All pastes #80611 Raw Edit

awol

public text v1 · immutable
·published 2006-07-06 16:49 UTC
rendered paste body
libtool: link: warning: `/var/tmp/portage/kdepim-kresources-3.5.2/work/kdepim-kresources-3.5.2/libkcal/libkcal.la' seems to be moved
libtool: link: warning: `/var/tmp/portage/kdepim-kresources-3.5.2/work/kdepim-kresources-3.5.2/libkdepim/libkdepim.la' seems to be moved
libtool: link: warning: `/var/tmp/portage/kdepim-kresources-3.5.2/work/kdepim-kresources-3.5.2/libkcal/libkcal.la' seems to be moved
libtool: link: warning: `/var/tmp/portage/kdepim-kresources-3.5.2/work/kdepim-kresources-3.5.2/libkdepim/libkdepim.la' seems to be moved
/bin/sh ../../libtool --silent --mode=link --tag=CXX i686-pc-linux-gnu-g++  -Wno-long-long -Wundef -ansi -D_XOPEN_SOURCE=500 -D_BSD_SOURCE -Wcast-align -Wconversion -Wchar-subscripts -Wall -W -Wpointer-arith -DNDEBUG -DNO_DEBUG -O2 -O2 -march=athlon-xp -pipe -Wformat-security -Wmissing-format-attribute -Wno-non-virtual-dtor -fno-exceptions -fno-check-new -fno-common -DQT_CLEAN_NAMESPACE -DQT_NO_ASCII_CAST -DQT_NO_STL -DQT_NO_COMPAT -DQT_NO_TRANSLATION    -o kcal_slox.la -rpath /usr/kde/3.5/lib/kde3 -L/usr/kde/3.5/lib -L/usr/qt/3/lib -L/usr/lib    -module -avoid-version -module -no-undefined -Wl,--no-undefined -Wl,--allow-shlib-undefined -R /usr/kde/3.5/lib -R /usr/kde/3.5/lib -R /usr/qt/3/lib -R /usr/lib  kcalresourceslox_plugin.lo libkcal_slox.la
libtool: link: warning: `/var/tmp/portage/kdepim-kresources-3.5.2/work/kdepim-kresources-3.5.2/libkdepim/libkdepim.la' seems to be moved
libtool: link: warning: `/var/tmp/portage/kdepim-kresources-3.5.2/work/kdepim-kresources-3.5.2/libkcal/libkcal.la' seems to be moved
/bin/sh ../../libtool --silent --mode=link --tag=CXX i686-pc-linux-gnu-g++  -Wno-long-long -Wundef -ansi -D_XOPEN_SOURCE=500 -D_BSD_SOURCE -Wcast-align -Wconversion -Wchar-subscripts -Wall -W -Wpointer-arith -DNDEBUG -DNO_DEBUG -O2 -O2 -march=athlon-xp -pipe -Wformat-security -Wmissing-format-attribute -Wno-non-virtual-dtor -fno-exceptions -fno-check-new -fno-common -DQT_CLEAN_NAMESPACE -DQT_NO_ASCII_CAST -DQT_NO_STL -DQT_NO_COMPAT -DQT_NO_TRANSLATION    -o kabc_slox.la -rpath /usr/kde/3.5/lib/kde3 -L/usr/kde/3.5/lib -L/usr/qt/3/lib -L/usr/lib    -module -avoid-version -module -no-undefined -Wl,--no-undefined -Wl,--allow-shlib-undefined -R /usr/kde/3.5/lib -R /usr/kde/3.5/lib -R /usr/qt/3/lib -R /usr/lib  kabcresourceslox_plugin.lo libkabc_slox.la
libtool: link: warning: `/var/tmp/portage/kdepim-kresources-3.5.2/work/kdepim-kresources-3.5.2/libkcal/libkcal.la' seems to be moved
libtool: link: warning: `/var/tmp/portage/kdepim-kresources-3.5.2/work/kdepim-kresources-3.5.2/libkdepim/libkdepim.la' seems to be moved
libtool: link: warning: `/var/tmp/portage/kdepim-kresources-3.5.2/work/kdepim-kresources-3.5.2/libkcal/libkcal.la' seems to be moved
libtool: link: warning: `/var/tmp/portage/kdepim-kresources-3.5.2/work/kdepim-kresources-3.5.2/libkdepim/libkdepim.la' seems to be moved
libtool: link: warning: `/var/tmp/portage/kdepim-kresources-3.5.2/work/kdepim-kresources-3.5.2/libkcal/libkcal.la' seems to be moved
libtool: link: warning: `/var/tmp/portage/kdepim-kresources-3.5.2/work/kdepim-kresources-3.5.2/libkdepim/libkdepim.la' seems to be moved
collect2: ld terminated with signal 11 [Segmentation fault]
make[3]: *** [kcal_slox.la] Error 1
make[3]: *** Waiting for unfinished jobs....
make[3]: Leaving directory `/var/tmp/portage/kdepim-kresources-3.5.2/work/kdepim-kresources-3.5.2/kresources/slox'
make[2]: *** [all-recursive] Error 1
make[2]: Leaving directory `/var/tmp/portage/kdepim-kresources-3.5.2/work/kdepim-kresources-3.5.2/kresources'
make[1]: *** [all-recursive] Error 1
make[1]: Leaving directory `/var/tmp/portage/kdepim-kresources-3.5.2/work/kdepim-kresources-3.5.2'
make: *** [all] Error 2

!!! ERROR: kde-base/kdepim-kresources-3.5.2 failed.
Call stack:
  ebuild.sh, line 1539:   Called dyn_compile
  ebuild.sh, line 939:   Called src_compile
  kdepim-kresources-3.5.2.ebuild, line 50:   Called kde-meta_src_compile 'make'
  kde-meta.eclass, line 410:   Called kde_src_compile 'make'
  kde.eclass, line 302:   Called die

!!! died running emake, kde_src_compile:make
!!! If you need support, post the topmost build error, and the call stack if relevant.