All pastes #80332 Raw Edit

Dyrty

public text v1 · immutable
·published 2006-07-06 09:38 UTC
rendered paste body
In file included from ogg_decoder_aspect.c:34:
./include/private/ogg_decoder_aspect.h:35:21: ogg/ogg.h: No such file or directory
In file included from ogg_decoder_aspect.c:34:
./include/private/ogg_decoder_aspect.h:46: error: syntax error before "ogg_stream_state"
./include/private/ogg_decoder_aspect.h:46: warning: no semicolon at end of struct or union
./include/private/ogg_decoder_aspect.h:47: warning: data definition has no type or storage class
./include/private/ogg_decoder_aspect.h:52: error: syntax error before "working_page"
./include/private/ogg_decoder_aspect.h:52: warning: data definition has no type or storage class
./include/private/ogg_decoder_aspect.h:54: error: syntax error before "working_packet"
./include/private/ogg_decoder_aspect.h:54: warning: data definition has no type or storage class
./include/private/ogg_decoder_aspect.h:55: warning: data definition has no type or storage class
./include/private/ogg_decoder_aspect.h:57: error: syntax error before '*' token
./include/private/ogg_decoder_aspect.h:58: error: syntax error before '*' token
./include/private/ogg_decoder_aspect.h:59: error: syntax error before '*' token
./include/private/ogg_decoder_aspect.h:60: error: syntax error before '*' token
./include/private/ogg_decoder_aspect.h:61: error: syntax error before '*' token
./include/private/ogg_decoder_aspect.h:62: error: syntax error before '*' token
./include/private/ogg_decoder_aspect.h:77: error: syntax error before '*' token
ogg_decoder_aspect.c:48: error: syntax error before '*' token
ogg_decoder_aspect.c: In function `OggFLAC__ogg_decoder_aspect_init':
ogg_decoder_aspect.c:51: error: `aspect' undeclared (first use in this function)
ogg_decoder_aspect.c:51: error: (Each undeclared identifier is reported only once
ogg_decoder_aspect.c:51: error: for each function it appears in.)
ogg_decoder_aspect.c: At top level:
ogg_decoder_aspect.c:68: error: syntax error before '*' token
ogg_decoder_aspect.c: In function `OggFLAC__ogg_decoder_aspect_finish':
ogg_decoder_aspect.c:70: error: `aspect' undeclared (first use in this function)
ogg_decoder_aspect.c: At top level:
ogg_decoder_aspect.c:74: error: syntax error before '*' token
ogg_decoder_aspect.c: In function `OggFLAC__ogg_decoder_aspect_set_serial_number':
ogg_decoder_aspect.c:76: error: `aspect' undeclared (first use in this function)
ogg_decoder_aspect.c:77: error: `value' undeclared (first use in this function)
ogg_decoder_aspect.c: At top level:
ogg_decoder_aspect.c:80: error: syntax error before '*' token
ogg_decoder_aspect.c: In function `OggFLAC__ogg_decoder_aspect_set_defaults':
ogg_decoder_aspect.c:82: error: `aspect' undeclared (first use in this function)
ogg_decoder_aspect.c: At top level:
ogg_decoder_aspect.c:85: error: syntax error before '*' token
ogg_decoder_aspect.c: In function `OggFLAC__ogg_decoder_aspect_flush':
ogg_decoder_aspect.c:87: error: `aspect' undeclared (first use in this function)
ogg_decoder_aspect.c: At top level:
ogg_decoder_aspect.c:93: error: syntax error before '*' token
ogg_decoder_aspect.c: In function `OggFLAC__ogg_decoder_aspect_reset':
ogg_decoder_aspect.c:95: error: `aspect' undeclared (first use in this function)
ogg_decoder_aspect.c: At top level:
ogg_decoder_aspect.c:101: error: syntax error before '*' token
ogg_decoder_aspect.c: In function `OggFLAC__ogg_decoder_aspect_read_callback_wrapper':
ogg_decoder_aspect.c:104: error: `bytes' undeclared (first use in this function)
ogg_decoder_aspect.c:133: error: `aspect' undeclared (first use in this function)
ogg_decoder_aspect.c:140: error: `buffer' undeclared (first use in this function)
ogg_decoder_aspect.c:210: warning: initialization makes pointer from integer without a cast
ogg_decoder_aspect.c:218: error: `decoder' undeclared (first use in this function)
ogg_decoder_aspect.c:218: error: `client_data' undeclared (first use in this function)
make[4]: *** [ogg_decoder_aspect.lo] Error 1
make[4]: Leaving directory `/var/tmp/portage/flac-1.1.2-r3/work/flac-1.1.2/src/libOggFLAC'
make[3]: *** [all-recursive] Error 1
make[3]: Leaving directory `/var/tmp/portage/flac-1.1.2-r3/work/flac-1.1.2/src/libOggFLAC'
make[2]: *** [all-recursive] Error 1
make[2]: Leaving directory `/var/tmp/portage/flac-1.1.2-r3/work/flac-1.1.2/src'
make[1]: *** [all-recursive] Error 1
make[1]: Leaving directory `/var/tmp/portage/flac-1.1.2-r3/work/flac-1.1.2'
make: *** [all] Error 2

!!! ERROR: media-libs/flac-1.1.2-r3 failed.
Call stack:
  ebuild.sh, line 1539:   Called dyn_compile
  ebuild.sh, line 939:   Called src_compile
  flac-1.1.2-r3.ebuild, line 53:   Called die

!!! make failed
!!! If you need support, post the topmost build error, and the call stack if relevant.