vaio:~/ion3-20071109# make && make install
set -e; for i in libtu libextl libmainloop mod_tiling mod_query mod_menu mod_dock mod_sp mod_sm mod_statusbar de ioncore ion pwm etc utils man po ; do make -C $i; done
make[1]: Entering directory `/root/ion3-20071109/libtu'
make[1]: Nothing to be done for `all'.
make[1]: Leaving directory `/root/ion3-20071109/libtu'
make[1]: Entering directory `/root/ion3-20071109/libextl'
make[1]: Nothing to be done for `all'.
make[1]: Leaving directory `/root/ion3-20071109/libextl'
make[1]: Entering directory `/root/ion3-20071109/libmainloop'
make[1]: Nothing to be done for `all'.
make[1]: Leaving directory `/root/ion3-20071109/libmainloop'
make[1]: Entering directory `/root/ion3-20071109/mod_tiling'
make[1]: Nothing to be done for `all'.
make[1]: Leaving directory `/root/ion3-20071109/mod_tiling'
make[1]: Entering directory `/root/ion3-20071109/mod_query'
make[1]: Nothing to be done for `all'.
make[1]: Leaving directory `/root/ion3-20071109/mod_query'
make[1]: Entering directory `/root/ion3-20071109/mod_menu'
make[1]: Nothing to be done for `all'.
make[1]: Leaving directory `/root/ion3-20071109/mod_menu'
make[1]: Entering directory `/root/ion3-20071109/mod_dock'
make[1]: Nothing to be done for `all'.
make[1]: Leaving directory `/root/ion3-20071109/mod_dock'
make[1]: Entering directory `/root/ion3-20071109/mod_sp'
make[1]: Nothing to be done for `all'.
make[1]: Leaving directory `/root/ion3-20071109/mod_sp'
make[1]: Entering directory `/root/ion3-20071109/mod_sm'
gcc -fPIC -DPIC -Os -W -Wimplicit -Wreturn-type -Wswitch -Wcomment -Wtrigraphs -Wformat -Wchar-subscripts -Wparentheses -pedantic -Wuninitialized -DCF_XFREE86_TEXTPROP_BUG_WORKAROUND -I/usr/X11R6/include -I.. -I.. -I.. -c sm_session.c -o sm_session.o
sm_session.c:23:26: error: X11/SM/SMlib.h: No such file or directory
sm_session.c:34: error: expected ‘=’, ‘,’, ‘;’, ‘asm’ or ‘__attribute__’ before ‘ice_sm_conn’
sm_session.c:35: error: expected ‘=’, ‘,’, ‘;’, ‘asm’ or ‘__attribute__’ before ‘sm_conn’
sm_session.c:39: error: ‘SmRestartImmediately’ undeclared here (not in a function)
sm_session.c: In function ‘sm_process_messages’:
sm_session.c:71: warning: implicit declaration of function ‘IceProcessMessages’
sm_session.c:71: error: ‘ice_sm_conn’ undeclared (first use in this function)
sm_session.c:71: error: (Each undeclared identifier is reported only once
sm_session.c:71: error: for each function it appears in.)
sm_session.c:71: error: ‘IceProcessMessagesIOError’ undeclared (first use in this function)
sm_session.c: At top level:
sm_session.c:79: error: expected ‘)’ before ‘conn’
sm_session.c: In function ‘sm_set_some_properties’:
sm_session.c:106: error: ‘SmPropValue’ undeclared (first use in this function)
sm_session.c:106: error: expected ‘;’ before ‘program_val’
sm_session.c:107: error: ‘SmProp’ undeclared (first use in this function)
sm_session.c:107: error: expected ‘;’ before ‘program_prop’
sm_session.c:108: error: ‘props’ undeclared (first use in this function)
sm_session.c:110: error: ‘program_prop’ undeclared (first use in this function)
sm_session.c:111: error: ‘userid_prop’ undeclared (first use in this function)
sm_session.c:112: error: ‘clone_prop’ undeclared (first use in this function)
sm_session.c:114: error: ‘program_val’ undeclared (first use in this function)
sm_session.c:116: error: ‘SmProgram’ undeclared (first use in this function)
sm_session.c:117: error: ‘SmARRAY8’ undeclared (first use in this function)
sm_session.c:121: error: ‘userid_val’ undeclared (first use in this function)
sm_session.c:123: error: ‘SmUserID’ undeclared (first use in this function)
sm_session.c:128: error: ‘SmCloneCommand’ undeclared (first use in this function)
sm_session.c:129: error: ‘SmLISTofARRAY8’ undeclared (first use in this function)
sm_session.c:133: warning: implicit declaration of function ‘SmcSetProperties’
sm_session.c:133: error: ‘sm_conn’ undeclared (first use in this function)
sm_session.c:135: error: expected expression before ‘)’ token
sm_session.c: In function ‘sm_set_other_properties’:
sm_session.c:147: error: ‘SmPropValue’ undeclared (first use in this function)
sm_session.c:147: error: expected ‘;’ before ‘discard_val’
sm_session.c:148: error: ‘SmProp’ undeclared (first use in this function)
sm_session.c:148: error: expected ‘;’ before ‘discard_prop’
sm_session.c:149: error: expected ‘;’ before ‘restart_hint_val’
sm_session.c:150: error: expected ‘;’ before ‘restart_hint_prop’
sm_session.c:151: error: expected ‘;’ before ‘restart_prop’
sm_session.c:153: error: ‘props’ undeclared (first use in this function)
sm_session.c:155: error: ‘discard_prop’ undeclared (first use in this function)
sm_session.c:155: error: ‘discard_val’ undeclared (first use in this function)
sm_session.c:156: error: ‘restart_hint_prop’ undeclared (first use in this function)
sm_session.c:156: error: ‘restart_hint_val’ undeclared (first use in this function)
sm_session.c:158: error: ‘restart_prop’ undeclared (first use in this function)
sm_session.c:171: error: ‘restart_val’ undeclared (first use in this function)
sm_session.c:171: error: expected expression before ‘)’ token
sm_session.c:198: error: ‘sm_conn’ undeclared (first use in this function)
sm_session.c:200: error: expected expression before ‘)’ token
sm_session.c: At top level:
sm_session.c:223: error: expected ‘)’ before ‘conn’
sm_session.c:239: error: expected ‘)’ before ‘conn’
sm_session.c:258: error: expected ‘)’ before ‘conn’
sm_session.c:269: error: expected ‘)’ before ‘conn’
sm_session.c:279: error: expected ‘)’ before ‘conn’
sm_session.c: In function ‘mod_sm_init_session’:
sm_session.c:293: error: ‘SmcCallbacks’ undeclared (first use in this function)
sm_session.c:293: error: expected ‘;’ before ‘smcall’
sm_session.c:300: warning: implicit declaration of function ‘IceAddConnectionWatch’
sm_session.c:300: error: ‘sm_ice_watch_fd’ undeclared (first use in this function)
sm_session.c:305: error: ‘smcall’ undeclared (first use in this function)
sm_session.c:306: error: ‘sm_save_yourself’ undeclared (first use in this function)
sm_session.c:308: error: ‘sm_die’ undeclared (first use in this function)
sm_session.c:310: error: ‘sm_save_complete’ undeclared (first use in this function)
sm_session.c:312: error: ‘sm_shutdown_cancelled’ undeclared (first use in this function)
sm_session.c:315: error: ‘sm_conn’ undeclared (first use in this function)
sm_session.c:315: warning: implicit declaration of function ‘SmcOpenConnection’
sm_session.c:318: error: ‘SmcSaveYourselfProcMask’ undeclared (first use in this function)
sm_session.c:319: error: ‘SmcSaveCompleteProcMask’ undeclared (first use in this function)
sm_session.c:320: error: ‘SmcShutdownCancelledProcMask’ undeclared (first use in this function)
sm_session.c:321: error: ‘SmcDieProcMask’ undeclared (first use in this function)
sm_session.c:333: error: ‘ice_sm_conn’ undeclared (first use in this function)
sm_session.c:333: warning: implicit declaration of function ‘SmcGetIceConnection’
sm_session.c: In function ‘mod_sm_close’:
sm_session.c:341: error: ‘sm_conn’ undeclared (first use in this function)
sm_session.c:342: warning: implicit declaration of function ‘SmcCloseConnection’
sm_session.c:346: error: ‘ice_sm_conn’ undeclared (first use in this function)
sm_session.c: In function ‘sm_exit’:
sm_session.c:363: warning: implicit declaration of function ‘sm_die’
sm_session.c:363: error: ‘sm_conn’ undeclared (first use in this function)
sm_session.c: In function ‘mod_sm_smhook’:
sm_session.c:381: error: ‘SmRestartIfRunning’ undeclared (first use in this function)
sm_session.c:390: warning: implicit declaration of function ‘SmcRequestSaveYourself’
sm_session.c:390: error: ‘sm_conn’ undeclared (first use in this function)
sm_session.c:390: error: ‘SmSaveBoth’ undeclared (first use in this function)
sm_session.c:391: error: ‘SmInteractStyleAny’ undeclared (first use in this function)
make[1]: *** [sm_session.o] Error 1
make[1]: Leaving directory `/root/ion3-20071109/mod_sm'
make: *** [subdirs] Error 2
vaio:~/ion3-20071109#