/home/loguser1/Desktop/tk8.4.16/unix/../generic/tk3d.c:1211: error: invalid type argument of ‘->’
/home/loguser1/Desktop/tk8.4.16/unix/../generic/tk3d.c:1211: error: invalid type argument of ‘->’
/home/loguser1/Desktop/tk8.4.16/unix/../generic/tk3d.c:1211: error: invalid type argument of ‘->’
/home/loguser1/Desktop/tk8.4.16/unix/../generic/tk3d.c:1211: error: invalid type argument of ‘->’
/home/loguser1/Desktop/tk8.4.16/unix/../generic/tk3d.c:1218: error: invalid type argument of ‘->’
/home/loguser1/Desktop/tk8.4.16/unix/../generic/tk3d.c:1220: error: invalid type argument of ‘->’
/home/loguser1/Desktop/tk8.4.16/unix/../generic/tk3d.c:1222: error: invalid type argument of ‘->’
/home/loguser1/Desktop/tk8.4.16/unix/../generic/tk3d.c:1222: error: invalid type argument of ‘->’
/home/loguser1/Desktop/tk8.4.16/unix/../generic/tk3d.c:1222: error: invalid type argument of ‘->’
/home/loguser1/Desktop/tk8.4.16/unix/../generic/tk3d.c:1222: error: invalid type argument of ‘->’
/home/loguser1/Desktop/tk8.4.16/unix/../generic/tk3d.c:1229: error: invalid type argument of ‘->’
/home/loguser1/Desktop/tk8.4.16/unix/../generic/tk3d.c:1231: error: invalid type argument of ‘->’
/home/loguser1/Desktop/tk8.4.16/unix/../generic/tk3d.c: In function ‘Tk_Get3DBorderFromObj’:
/home/loguser1/Desktop/tk8.4.16/unix/../generic/tk3d.c:1264: error: ‘TkWindow’ has no member named ‘dispPtr’
/home/loguser1/Desktop/tk8.4.16/unix/../generic/tk3d.c:1279: error: ‘TkBorder’ has no member named ‘resourceRefCount’
/home/loguser1/Desktop/tk8.4.16/unix/../generic/tk3d.c:1280: error: ‘Tk_FakeWin’ has no member named ‘display’
/home/loguser1/Desktop/tk8.4.16/unix/../generic/tk3d.c:1280: error: ‘Tk_FakeWin’ has no member named ‘screenNum’
/home/loguser1/Desktop/tk8.4.16/unix/../generic/tk3d.c:1280: error: ‘TkBorder’ has no member named ‘screen’
/home/loguser1/Desktop/tk8.4.16/unix/../generic/tk3d.c:1281: error: ‘Tk_FakeWin’ has no member named ‘atts’
/home/loguser1/Desktop/tk8.4.16/unix/../generic/tk3d.c:1281: error: ‘TkBorder’ has no member named ‘colormap’
/home/loguser1/Desktop/tk8.4.16/unix/../generic/tk3d.c:1301: error: ‘TkDisplay’ has no member named ‘borderTable’
/home/loguser1/Desktop/tk8.4.16/unix/../generic/tk3d.c:1301: error: ‘TkDisplay’ has no member named ‘borderTable’
/home/loguser1/Desktop/tk8.4.16/unix/../generic/tk3d.c:1306: error: ‘TkBorder’ has no member named ‘nextPtr’
/home/loguser1/Desktop/tk8.4.16/unix/../generic/tk3d.c:1307: error: ‘Tk_FakeWin’ has no member named ‘display’
/home/loguser1/Desktop/tk8.4.16/unix/../generic/tk3d.c:1307: error: ‘Tk_FakeWin’ has no member named ‘screenNum’
/home/loguser1/Desktop/tk8.4.16/unix/../generic/tk3d.c:1307: error: ‘TkBorder’ has no member named ‘screen’
/home/loguser1/Desktop/tk8.4.16/unix/../generic/tk3d.c:1308: error: ‘Tk_FakeWin’ has no member named ‘atts’
/home/loguser1/Desktop/tk8.4.16/unix/../generic/tk3d.c:1308: error: ‘TkBorder’ has no member named ‘colormap’
/home/loguser1/Desktop/tk8.4.16/unix/../generic/tk3d.c:1311: error: ‘TkBorder’ has no member named ‘objRefCount’
/home/loguser1/Desktop/tk8.4.16/unix/../generic/tk3d.c: In function ‘TkDebugBorder’:
/home/loguser1/Desktop/tk8.4.16/unix/../generic/tk3d.c:1391: error: ‘TkWindow’ has no member named ‘dispPtr’
/home/loguser1/Desktop/tk8.4.16/unix/../generic/tk3d.c:1394: error: ‘TkDisplay’ has no member named ‘borderTable’
/home/loguser1/Desktop/tk8.4.16/unix/../generic/tk3d.c:1394: error: ‘TkDisplay’ has no member named ‘borderTable’
/home/loguser1/Desktop/tk8.4.16/unix/../generic/tk3d.c:1400: error: ‘TkBorder’ has no member named ‘nextPtr’
/home/loguser1/Desktop/tk8.4.16/unix/../generic/tk3d.c:1403: error: ‘TkBorder’ has no member named ‘resourceRefCount’
/home/loguser1/Desktop/tk8.4.16/unix/../generic/tk3d.c:1405: error: ‘TkBorder’ has no member named ‘objRefCount’
make: *** [tk3d.o] Error 1
loguser1@pc1:~/Desktop/tk8.4.16/unix$ make install
gcc -c -O2 -pipe -Wall -Wno-implicit-int -fno-strict-aliasing -fPIC -I/home/loguser1/Desktop/tk8.4.16/unix -I/home/loguser1/Desktop/tk8.4.16/unix/../generic -I/home/loguser1/Desktop/tk8.4.16/unix/../bitmaps -I/home/loguser1/Desktop/tcl8.4.16/generic -DHAVE_LIMITS_H=1 -DHAVE_UNISTD_H=1 -DPEEK_XCLOSEIM=1 -D_LARGEFILE64_SOURCE=1 -DTCL_WIDE_INT_TYPE=long\ long -DHAVE_STRUCT_STAT64=1 -DHAVE_OPEN64=1 -DHAVE_LSEEK64=1 -DHAVE_TYPE_OFF64_T=1 -DHAVE_SYS_TIME_H=1 -DTIME_WITH_SYS_TIME=1 -DSTDC_HEADERS=1 -DHAVE_PW_GECOS=1 -DTCL_NO_DEPRECATED -DUSE_TCL_STUBS /home/loguser1/Desktop/tk8.4.16/unix/../generic/tk3d.c
In file included from /home/loguser1/Desktop/tk8.4.16/unix/../generic/tkInt.h:21,
from /home/loguser1/Desktop/tk8.4.16/unix/../generic/tk3d.h:18,
from /home/loguser1/Desktop/tk8.4.16/unix/../generic/tk3d.c:16:
/home/loguser1/Desktop/tk8.4.16/unix/../generic/tk.h:81:23: error: X11/Xlib.h: No such file or directory
In file included from /home/loguser1/Desktop/tk8.4.16/unix/../generic/tkInt.h:21,
from /home/loguser1/Desktop/tk8.4.16/unix/../generic/tk3d.h:18,
from /home/loguser1/Desktop/tk8.4.16/unix/../generic/tk3d.c:16:
/home/loguser1/Desktop/tk8.4.16/unix/../generic/tk.h:557: error: expected declaration specifiers or ‘...’ before ‘Window’
/home/loguser1/Desktop/tk8.4.16/unix/../generic/tk.h:557: error: ‘Window’ declared as function returning a function
/home/loguser1/Desktop/tk8.4.16/unix/../generic/tk.h:557: warning: parameter names (without types) in function declaration
/home/loguser1/Desktop/tk8.4.16/unix/../generic/tk.h:560: error: expected declaration specifiers or ‘...’ before ‘XEvent’
/home/loguser1/Desktop/tk8.4.16/unix/../generic/tk.h:569: error: expected specifier-qualifier-list before ‘Tk_ClassCreateProc’
/home/loguser1/Desktop/tk8.4.16/unix/../generic/tk.h:663: error: expected specifier-qualifier-list before ‘Bool’
/home/loguser1/Desktop/tk8.4.16/unix/../generic/tk.h:679: error: expected specifier-qualifier-list before ‘Bool’
/home/loguser1/Desktop/tk8.4.16/unix/../generic/tk.h:756: error: expected specifier-qualifier-list before ‘Display’
/home/loguser1/Desktop/tk8.4.16/unix/../generic/tk.h:906: error: expected declaration specifiers or ‘...’ before ‘XPoint’
/home/loguser1/Desktop/tk8.4.16/unix/../generic/tk.h:1007: error: expected declaration specifiers or ‘...’ before ‘Display’
/home/loguser1/Desktop/tk8.4.16/unix/../generic/tk.h:1009: error: expected declaration specifiers or ‘...’ before ‘Display’
/home/loguser1/Desktop/tk8.4.16/unix/../generic/tk.h:1009: error: expected declaration specifiers or ‘...’ before ‘Drawable’
/home/loguser1/Desktop/tk8.4.16/unix/../generic/tk.h:1106: error: expected specifier-qualifier-list before ‘XColor’
/home/loguser1/Desktop/tk8.4.16/unix/../generic/tk.h:1170: error: expected specifier-qualifier-list before ‘GC’
/home/loguser1/Desktop/tk8.4.16/unix/../generic/tk.h:1211: error: expected declaration specifiers or ‘...’ before ‘Display’
/home/loguser1/Desktop/tk8.4.16/unix/../generic/tk.h:1211: error: expected declaration specifiers or ‘...’ before ‘Drawable’
/home/loguser1/Desktop/tk8.4.16/unix/../generic/tk.h:1214: error: expected declaration specifiers or ‘...’ before ‘Display’
/home/loguser1/Desktop/tk8.4.16/unix/../generic/tk.h:1419: error: expected declaration specifiers or ‘...’ before ‘Drawable’
/home/loguser1/Desktop/tk8.4.16/unix/../generic/tk.h:1536: error: expected declaration specifiers or ‘...’ before ‘XErrorEvent’
/home/loguser1/Desktop/tk8.4.16/unix/../generic/tk.h:1538: error: expected declaration specifiers or ‘...’ before ‘XEvent’
/home/loguser1/Desktop/tk8.4.16/unix/../generic/tk.h:1540: error: expected declaration specifiers or ‘...’ before ‘XEvent’
/home/loguser1/Desktop/tk8.4.16/unix/../generic/tk.h:1542: error: expected declaration specifiers or ‘...’ before ‘XEvent’
/home/loguser1/Desktop/tk8.4.16/unix/../generic/tk.h:1547: error: expected declaration specifiers or ‘...’ before ‘XEvent’
In file included from /home/loguser1/Desktop/tk8.4.16/unix/../generic/tk.h:1561,
from /home/loguser1/Desktop/tk8.4.16/unix/../generic/tkInt.h:21,
from /home/loguser1/Desktop/tk8.4.16/unix/../generic/tk3d.h:18,
from /home/loguser1/Desktop/tk8.4.16/unix/../generic/tk3d.c:16:
/home/loguser1/Desktop/tk8.4.16/unix/../generic/tkDecls.h:37: error: expected ‘=’, ‘,’, ‘;’, ‘asm’ or ‘__attribute__’ before ‘*’ token
/home/loguser1/Desktop/tk8.4.16/unix/../generic/tkDecls.h:39: error: expected ‘=’, ‘,’, ‘;’, ‘asm’ or ‘__attribute__’ before ‘Tk_3DBorderGC’
/home/loguser1/Desktop/tk8.4.16/unix/../generic/tkDecls.h:42: error: expected declaration specifiers or ‘...’ before ‘Drawable’
/home/loguser1/Desktop/tk8.4.16/unix/../generic/tkDecls.h:47: error: expected declaration specifiers or ‘...’ before ‘Drawable’
/home/loguser1/Desktop/tk8.4.16/unix/../generic/tkDecls.h:56: error: expected declaration specifiers or ‘...’ before ‘XEvent’
/home/loguser1/Desktop/tk8.4.16/unix/../generic/tkDecls.h:76: error: expected declaration specifiers or ‘...’ before ‘Pixmap’
/home/loguser1/Desktop/tk8.4.16/unix/../generic/tkDecls.h:80: error: expected declaration specifiers or ‘...’ before ‘XColor’
/home/loguser1/Desktop/tk8.4.16/unix/../generic/tkDecls.h:90: error: expected declaration specifiers or ‘...’ before ‘Pixmap’
/home/loguser1/Desktop/tk8.4.16/unix/../generic/tkDecls.h:95: error: expected declaration specifiers or ‘...’ before ‘GC’
/home/loguser1/Desktop/tk8.4.16/unix/../generic/tkDecls.h:114: error: expected declaration specifiers or ‘...’ before ‘XSetWindowAttributes’
/home/loguser1/Desktop/tk8.4.16/unix/../generic/tkDecls.h:122: error: expected declaration specifiers or ‘...’ before ‘Atom’
/home/loguser1/Desktop/tk8.4.16/unix/../generic/tkDecls.h:125: error: expected declaration specifiers or ‘...’ before ‘Atom’
/home/loguser1/Desktop/tk8.4.16/unix/../generic/tkDecls.h:125: error: expected declaration specifiers or ‘...’ before ‘Atom’
/home/loguser1/Desktop/tk8.4.16/unix/../generic/tkDecls.h:147: error: expected declaration specifiers or ‘...’ before ‘XWindowChanges’
/home/loguser1/Desktop/tk8.4.16/unix/../generic/tkDecls.h:167: error: expected ‘)’ before ‘*’ token
/home/loguser1/Desktop/tk8.4.16/unix/../generic/tkDecls.h:187: error: expected declaration specifiers or ‘...’ before ‘Atom’
/home/loguser1/Desktop/tk8.4.16/unix/../generic/tkDecls.h:187: error: expected declaration specifiers or ‘...’ before ‘Atom’
/home/loguser1/Desktop/tk8.4.16/unix/../generic/tkDecls.h:187: error: expected declaration specifiers or ‘...’ before ‘Atom’
/home/loguser1/Desktop/tk8.4.16/unix/../generic/tkDecls.h:232: error: expected declaration specifiers or ‘...’ before ‘Atom’
/home/loguser1/Desktop/tk8.4.16/unix/../generic/tkDecls.h:232: error: expected declaration specifiers or ‘...’ before ‘Atom’
/home/loguser1/Desktop/tk8.4.16/unix/../generic/tkDecls.h:242: error: expected declaration specifiers or ‘...’ before ‘Drawable’
/home/loguser1/Desktop/tk8.4.16/unix/../generic/tkDecls.h:242: error: expected declaration specifiers or ‘...’ before ‘XPoint’
/home/loguser1/Desktop/tk8.4.16/unix/../generic/tkDecls.h:247: error: expected declaration specifiers or ‘...’ before ‘Drawable’
/home/loguser1/Desktop/tk8.4.16/unix/../generic/tkDecls.h:252: error: expected ‘)’ before ‘*’ token
/home/loguser1/Desktop/tk8.4.16/unix/../generic/tkDecls.h:257: error: expected declaration specifiers or ‘...’ before ‘GC’
/home/loguser1/Desktop/tk8.4.16/unix/../generic/tkDecls.h:257: error: expected declaration specifiers or ‘...’ before ‘Drawable’
/home/loguser1/Desktop/tk8.4.16/unix/../generic/tkDecls.h:260: error: expected ‘)’ before ‘*’ token
/home/loguser1/Desktop/tk8.4.16/unix/../generic/tkDecls.h:265: error: expected declaration specifiers or ‘...’ before ‘Drawable’
/home/loguser1/Desktop/tk8.4.16/unix/../generic/tkDecls.h:265: error: expected declaration specifiers or ‘...’ before ‘XPoint’
/home/loguser1/Desktop/tk8.4.16/unix/../generic/tkDecls.h:270: error: expected declaration specifiers or ‘...’ before ‘Drawable’
/home/loguser1/Desktop/tk8.4.16/unix/../generic/tkDecls.h:278: error: expected ‘=’, ‘,’, ‘;’, ‘asm’ or ‘__attribute__’ before ‘Tk_FontId’
/home/loguser1/Desktop/tk8.4.16/unix/../generic/tkDecls.h:282: error: expected ‘)’ before ‘*’ token
/home/loguser1/Desktop/tk8.4.16/unix/../generic/tkDecls.h:285: error: expected ‘)’ before ‘*’ token
/home/loguser1/Desktop/tk8.4.16/unix/../generic/tkDecls.h:287: error: expected ‘)’ before ‘*’ token
/home/loguser1/Desktop/tk8.4.16/unix/../generic/tkDecls.h:290: error: expected ‘)’ before ‘*’ token
/home/loguser1/Desktop/tk8.4.16/unix/../generic/tkDecls.h:295: error: expected ‘)’ before ‘*’ token
/home/loguser1/Desktop/tk8.4.16/unix/../generic/tkDecls.h:299: error: expected declaration specifiers or ‘...’ before ‘Display’
/home/loguser1/Desktop/tk8.4.16/unix/../generic/tkDecls.h:303: error: expected ‘)’ before ‘*’ token
/home/loguser1/Desktop/tk8.4.16/unix/../generic/tkDecls.h:309: error: expected ‘)’ before ‘*’ token
/home/loguser1/Desktop/tk8.4.16/unix/../generic/tkDecls.h:311: error: expected ‘=’, ‘,’, ‘;’, ‘asm’ or ‘__attribute__’ before ‘Tk_GCForColor’
/home/loguser1/Desktop/tk8.4.16/unix/../generic/tkDecls.h:327: error: expected declaration specifiers or ‘...’ before ‘Atom’
/home/loguser1/Desktop/tk8.4.16/unix/../generic/tkDecls.h:334: error: expected ‘=’, ‘,’, ‘;’, ‘asm’ or ‘__attribute__’ before ‘Tk_GetBitmap’
/home/loguser1/Desktop/tk8.4.16/unix/../generic/tkDecls.h:337: error: expected ‘=’, ‘,’, ‘;’, ‘asm’ or ‘__attribute__’ before ‘Tk_GetBitmapFromData’
/home/loguser1/Desktop/tk8.4.16/unix/../generic/tkDecls.h:344: error: expected ‘=’, ‘,’, ‘;’, ‘asm’ or ‘__attribute__’ before ‘*’ token
/home/loguser1/Desktop/tk8.4.16/unix/../generic/tkDecls.h:347: error: expected ‘=’, ‘,’, ‘;’, ‘asm’ or ‘__attribute__’ before ‘*’ token
/home/loguser1/Desktop/tk8.4.16/unix/../generic/tkDecls.h:350: error: expected ‘=’, ‘,’, ‘;’, ‘asm’ or ‘__attribute__’ before ‘Tk_GetColormap’
/home/loguser1/Desktop/tk8.4.16/unix/../generic/tkDecls.h:371: error: expected ‘=’, ‘,’, ‘;’, ‘asm’ or ‘__attribute__’ before ‘Tk_GetGC’
/home/loguser1/Desktop/tk8.4.16/unix/../generic/tkDecls.h:401: error: expected ‘=’, ‘,’, ‘;’, ‘asm’ or ‘__attribute__’ before ‘Tk_GetPixmap’
/home/loguser1/Desktop/tk8.4.16/unix/../generic/tkDecls.h:418: error: expected declaration specifiers or ‘...’ before ‘Atom’
/home/loguser1/Desktop/tk8.4.16/unix/../generic/tkDecls.h:418: error: expected declaration specifiers or ‘...’ before ‘Atom’
/home/loguser1/Desktop/tk8.4.16/unix/../generic/tkDecls.h:424: error: expected ‘=’, ‘,’, ‘;’, ‘asm’ or ‘__attribute__’ before ‘*’ token
/home/loguser1/Desktop/tk8.4.16/unix/../generic/tkDecls.h:435: error: expected ‘)’ before ‘*’ token
/home/loguser1/Desktop/tk8.4.16/unix/../generic/tkDecls.h:437: error: expected ‘)’ before ‘*’ token
/home/loguser1/Desktop/tk8.4.16/unix/../generic/tkDecls.h:446: error: expected ‘=’, ‘,’, ‘;’, ‘asm’ or ‘__attribute__’ before ‘Tk_InternAtom’
/home/loguser1/Desktop/tk8.4.16/unix/../generic/tkDecls.h:484: error: expected ‘)’ before ‘*’ token
/home/loguser1/Desktop/tk8.4.16/unix/../generic/tkDecls.h:489: error: expected ‘)’ before ‘*’ token
/home/loguser1/Desktop/tk8.4.16/unix/../generic/tkDecls.h:491: error: expected ‘)’ before ‘*’ token
/home/loguser1/Desktop/tk8.4.16/unix/../generic/tkDecls.h:509: error: expected declaration specifiers or ‘...’ before ‘Atom’
/home/loguser1/Desktop/tk8.4.16/unix/../generic/tkDecls.h:549: error: expected ‘)’ before ‘*’ token
/home/loguser1/Desktop/tk8.4.16/unix/../generic/tkDecls.h:552: error: expected ‘)’ before ‘*’ token
/home/loguser1/Desktop/tk8.4.16/unix/../generic/tkDecls.h:555: error: expected declaration specifiers or ‘...’ before ‘Drawable’
/home/loguser1/Desktop/tk8.4.16/unix/../generic/tkDecls.h:591: error: expected declaration specifiers or ‘...’ before ‘Pixmap’
/home/loguser1/Desktop/tk8.4.16/unix/../generic/tkDecls.h:600: error: expected declaration specifiers or ‘...’ before ‘Pixmap’
/home/loguser1/Desktop/tk8.4.16/unix/../generic/tkDecls.h:603: error: expected declaration specifiers or ‘...’ before ‘Colormap’
/home/loguser1/Desktop/tk8.4.16/unix/../generic/tkDecls.h:606: error: expected declaration specifiers or ‘...’ before ‘Visual’
/home/loguser1/Desktop/tk8.4.16/unix/../generic/tkDecls.h:606: error: expected declaration specifiers or ‘...’ before ‘Colormap’
/home/loguser1/Desktop/tk8.4.16/unix/../generic/tkDecls.h:610: error: expected ‘)’ before ‘*’ token
/home/loguser1/Desktop/tk8.4.16/unix/../generic/tkDecls.h:627: error: expected ‘)’ before ‘*’ token
/home/loguser1/Desktop/tk8.4.16/unix/../generic/tkDecls.h:632: error: expected ‘)’ before ‘*’ token
/home/loguser1/Desktop/tk8.4.16/unix/../generic/tkDecls.h:649: error: expected ‘=’, ‘,’, ‘;’, ‘asm’ or ‘__attribute__’ before ‘Tk_AllocBitmapFromObj’
/home/loguser1/Desktop/tk8.4.16/unix/../generic/tkDecls.h:657: error: expected ‘=’, ‘,’, ‘;’, ‘asm’ or ‘__attribute__’ before ‘*’ token
/home/loguser1/Desktop/tk8.4.16/unix/../generic/tkDecls.h:702: error: expected ‘=’, ‘,’, ‘;’, ‘asm’ or ‘__attribute__’ before ‘Tk_GetBitmapFromObj’
/home/loguser1/Desktop/tk8.4.16/unix/../generic/tkDecls.h:705: error: expected ‘=’, ‘,’, ‘;’, ‘asm’ or ‘__attribute__’ before ‘*’ token
/home/loguser1/Desktop/tk8.4.16/unix/../generic/tkDecls.h:772: error: expected ‘)’ before ‘*’ token
/home/loguser1/Desktop/tk8.4.16/unix/../generic/tkDecls.h:775: error: expected ‘)’ before ‘*’ token
/home/loguser1/Desktop/tk8.4.16/unix/../generic/tkDecls.h:788: error: expected declaration specifiers or ‘...’ before ‘GC’
/home/loguser1/Desktop/tk8.4.16/unix/../generic/tkDecls.h:795: error: expected declaration specifiers or ‘...’ before ‘GC’
/home/loguser1/Desktop/tk8.4.16/unix/../generic/tkDecls.h:801: error: expected declaration specifiers or ‘...’ before ‘Pixmap’
/home/loguser1/Desktop/tk8.4.16/unix/../generic/tkDecls.h:806: error: expected declaration specifiers or ‘...’ before ‘XColor’
/home/loguser1/Desktop/tk8.4.16/unix/../generic/tkDecls.h:821: error: expected declaration specifiers or ‘...’ before ‘Pixmap’
/home/loguser1/Desktop/tk8.4.16/unix/../generic/tkDecls.h:866: error: expected ‘)’ before ‘*’ token
/home/loguser1/Desktop/tk8.4.16/unix/../generic/tkDecls.h:915: error: expected declaration specifiers or ‘...’ before ‘Drawable’
/home/loguser1/Desktop/tk8.4.16/unix/../generic/tkDecls.h:932: error: expected specifier-qualifier-list before ‘XColor’
In file included from /home/loguser1/Desktop/tk8.4.16/unix/../generic/tkPort.h:34,
from /home/loguser1/Desktop/tk8.4.16/unix/../generic/tkInt.h:27,
from /home/loguser1/Desktop/tk8.4.16/unix/../generic/tk3d.h:18,
from /home/loguser1/Desktop/tk8.4.16/unix/../generic/tk3d.c:16:
/home/loguser1/Desktop/tk8.4.16/unix/../generic/../unix/tkUnixPort.h:78:28: error: X11/cursorfont.h: No such file or directory
/home/loguser1/Desktop/tk8.4.16/unix/../generic/../unix/tkUnixPort.h:79:24: error: X11/keysym.h: No such file or directory
/home/loguser1/Desktop/tk8.4.16/unix/../generic/../unix/tkUnixPort.h:80:23: error: X11/Xatom.h: No such file or directory
/home/loguser1/Desktop/tk8.4.16/unix/../generic/../unix/tkUnixPort.h:81:24: error: X11/Xproto.h: No such file or directory
/home/loguser1/Desktop/tk8.4.16/unix/../generic/../unix/tkUnixPort.h:82:27: error: X11/Xresource.h: No such file or directory
/home/loguser1/Desktop/tk8.4.16/unix/../generic/../unix/tkUnixPort.h:83:23: error: X11/Xutil.h: No such file or directory
In file included from /home/loguser1/Desktop/tk8.4.16/unix/../generic/tk3d.h:18,
from /home/loguser1/Desktop/tk8.4.16/unix/../generic/tk3d.c:16:
/home/loguser1/Desktop/tk8.4.16/unix/../generic/tkInt.h:84: error: expected declaration specifiers or ‘...’ before ‘XEvent’
/home/loguser1/Desktop/tk8.4.16/unix/../generic/tkInt.h:84: error: expected declaration specifiers or ‘...’ before ‘KeySym’
/home/loguser1/Desktop/tk8.4.16/unix/../generic/tkInt.h:97: error: expected specifier-qualifier-list before ‘Display’
/home/loguser1/Desktop/tk8.4.16/unix/../generic/tkInt.h:156: error: expected specifier-qualifier-list before ‘Display’
/home/loguser1/Desktop/tk8.4.16/unix/../generic/tkInt.h:715: error: expected specifier-qualifier-list before ‘Display’
/home/loguser1/Desktop/tk8.4.16/unix/../generic/tkInt.h:898: error: expected specifier-qualifier-list before ‘Pixmap’
/home/loguser1/Desktop/tk8.4.16/unix/../generic/tkInt.h:967: error: expected ‘)’ before ‘*’ token
In file included from /home/loguser1/Desktop/tk8.4.16/unix/../generic/tkInt.h:975,
from /home/loguser1/Desktop/tk8.4.16/unix/../generic/tk3d.h:18,
from /home/loguser1/Desktop/tk8.4.16/unix/../generic/tk3d.c:16:
/home/loguser1/Desktop/tk8.4.16/unix/../generic/tkIntDecls.h:44: error: expected declaration specifiers or ‘...’ before ‘XPoint’
/home/loguser1/Desktop/tk8.4.16/unix/../generic/tkIntDecls.h:50: error: expected declaration specifiers or ‘...’ before ‘XEvent’
/home/loguser1/Desktop/tk8.4.16/unix/../generic/tkIntDecls.h:57: error: expected ‘)’ before ‘*’ token
/home/loguser1/Desktop/tk8.4.16/unix/../generic/tkIntDecls.h:79: error: expected declaration specifiers or ‘...’ before ‘XColor’
/home/loguser1/Desktop/tk8.4.16/unix/../generic/tkIntDecls.h:79: error: expected declaration specifiers or ‘...’ before ‘XColor’
/home/loguser1/Desktop/tk8.4.16/unix/../generic/tkIntDecls.h:91: error: expected ‘=’, ‘,’, ‘;’, ‘asm’ or ‘__attribute__’ before ‘TkCurrentTime’
/home/loguser1/Desktop/tk8.4.16/unix/../generic/tkIntDecls.h:97: error: expected declaration specifiers or ‘...’ before ‘GC’
/home/loguser1/Desktop/tk8.4.16/unix/../generic/tkIntDecls.h:97: error: expected declaration specifiers or ‘...’ before ‘Drawable’
/home/loguser1/Desktop/tk8.4.16/unix/../generic/tkIntDecls.h:103: error: expected declaration specifiers or ‘...’ before ‘Display’
/home/loguser1/Desktop/tk8.4.16/unix/../generic/tkIntDecls.h:103: error: expected declaration specifiers or ‘...’ before ‘Drawable’
/home/loguser1/Desktop/tk8.4.16/unix/../generic/tkIntDecls.h:103: error: expected declaration specifiers or ‘...’ before ‘GC’
/home/loguser1/Desktop/tk8.4.16/unix/../generic/tkIntDecls.h:103: error: expected declaration specifiers or ‘...’ before ‘GC’
/home/loguser1/Desktop/tk8.4.16/unix/../generic/tkIntDecls.h:118: error: expected declaration specifiers or ‘...’ before ‘XEvent’
/home/loguser1/Desktop/tk8.4.16/unix/../generic/tkIntDecls.h:121: error: expected declaration specifiers or ‘...’ before ‘XEvent’
/home/loguser1/Desktop/tk8.4.16/unix/../generic/tkIntDecls.h:147: error: expected ‘)’ before ‘*’ token
/home/loguser1/Desktop/tk8.4.16/unix/../generic/tkIntDecls.h:175: error: expected ‘)’ before ‘*’ token
/home/loguser1/Desktop/tk8.4.16/unix/../generic/tkIntDecls.h:182: error: expected ‘)’ before ‘keysym’
/home/loguser1/Desktop/tk8.4.16/unix/../generic/tkIntDecls.h:190: error: expected declaration specifiers or ‘...’ before ‘XPoint’
/home/loguser1/Desktop/tk8.4.16/unix/../generic/tkIntDecls.h:238: error: ‘TkpMakeWindow’ declared as function returning a function
/home/loguser1/Desktop/tk8.4.16/unix/../generic/tkIntDecls.h:247: error: expected ‘)’ before ‘*’ token
/home/loguser1/Desktop/tk8.4.16/unix/../generic/tkIntDecls.h:259: error: expected declaration specifiers or ‘...’ before ‘XEvent’
/home/loguser1/Desktop/tk8.4.16/unix/../generic/tkIntDecls.h:271: error: expected declaration specifiers or ‘...’ before ‘XEvent’
/home/loguser1/Desktop/tk8.4.16/unix/../generic/tkIntDecls.h:274: error: expected ‘)’ before ‘*’ token
/home/loguser1/Desktop/tk8.4.16/unix/../generic/tkIntDecls.h:281: error: expected declaration specifiers or ‘...’ before ‘GC’
/home/loguser1/Desktop/tk8.4.16/unix/../generic/tkIntDecls.h:287: error: expected declaration specifiers or ‘...’ before ‘XEvent’
/home/loguser1/Desktop/tk8.4.16/unix/../generic/tkIntDecls.h:292: error: expected ‘)’ before ‘*’ token
/home/loguser1/Desktop/tk8.4.16/unix/../generic/tkIntDecls.h:299: error: expected ‘=’, ‘,’, ‘;’, ‘asm’ or ‘__attribute__’ before ‘TkStringToKeysym’
/home/loguser1/Desktop/tk8.4.16/unix/../generic/tkIntDecls.h:316: error: expected declaration specifiers or ‘...’ before ‘XEvent’
/home/loguser1/Desktop/tk8.4.16/unix/../generic/tkIntDecls.h:361: error: expected declaration specifiers or ‘...’ before ‘XEvent’
/home/loguser1/Desktop/tk8.4.16/unix/../generic/tkIntDecls.h:514: error: expected declaration specifiers or ‘...’ before ‘GC’
/home/loguser1/Desktop/tk8.4.16/unix/../generic/tkIntDecls.h:514: error: expected declaration specifiers or ‘...’ before ‘GC’
/home/loguser1/Desktop/tk8.4.16/unix/../generic/tkIntDecls.h:514: error: expected declaration specifiers or ‘...’ before ‘Drawable’
/home/loguser1/Desktop/tk8.4.16/unix/../generic/tkIntDecls.h:521: error: expected declaration specifiers or ‘...’ before ‘KeySym’
/home/loguser1/Desktop/tk8.4.16/unix/../generic/tkIntDecls.h:521: error: expected declaration specifiers or ‘...’ before ‘XEvent’
/home/loguser1/Desktop/tk8.4.16/unix/../generic/tkIntDecls.h:524: error: expected ‘=’, ‘,’, ‘;’, ‘asm’ or ‘__attribute__’ before ‘TkpGetKeySym’
/home/loguser1/Desktop/tk8.4.16/unix/../generic/tkIntDecls.h:578: error: expected declaration specifiers or ‘...’ before ‘XPoint’
/home/loguser1/Desktop/tk8.4.16/unix/../generic/tkIntDecls.h:580: error: expected declaration specifiers or ‘...’ before ‘XEvent’
/home/loguser1/Desktop/tk8.4.16/unix/../generic/tkIntDecls.h:583: error: expected ‘)’ before ‘*’ token
/home/loguser1/Desktop/tk8.4.16/unix/../generic/tkIntDecls.h:584: error: expected ‘;’ before ‘int’
In file included from /home/loguser1/Desktop/tk8.4.16/unix/../generic/tk3d.h:18,
from /home/loguser1/Desktop/tk8.4.16/unix/../generic/tk3d.c:16:
/home/loguser1/Desktop/tk8.4.16/unix/../generic/tkInt.h:1181: error: expected declaration specifiers or ‘...’ before ‘XImage’
In file included from /home/loguser1/Desktop/tk8.4.16/unix/../generic/tk3d.c:16:
/home/loguser1/Desktop/tk8.4.16/unix/../generic/tk3d.h:33: error: expected specifier-qualifier-list before ‘Screen’
/home/loguser1/Desktop/tk8.4.16/unix/../generic/tk3d.c:35: error: expected ‘)’ before ‘*’ token
/home/loguser1/Desktop/tk8.4.16/unix/../generic/tk3d.c:38: error: expected ‘)’ before ‘*’ token
/home/loguser1/Desktop/tk8.4.16/unix/../generic/tk3d.c: In function ‘Tk_Alloc3DBorderFromObj’:
/home/loguser1/Desktop/tk8.4.16/unix/../generic/tk3d.c:101: error: ‘TkBorder’ has no member named ‘resourceRefCount’
/home/loguser1/Desktop/tk8.4.16/unix/../generic/tk3d.c:109: warning: implicit declaration of function ‘ScreenOfDisplay’
/home/loguser1/Desktop/tk8.4.16/unix/../generic/tk3d.c:109: error: ‘Tk_FakeWin’ has no member named ‘display’
/home/loguser1/Desktop/tk8.4.16/unix/../generic/tk3d.c:109: error: ‘Tk_FakeWin’ has no member named ‘screenNum’
/home/loguser1/Desktop/tk8.4.16/unix/../generic/tk3d.c:109: error: ‘TkBorder’ has no member named ‘screen’
/home/loguser1/Desktop/tk8.4.16/unix/../generic/tk3d.c:110: error: ‘Tk_FakeWin’ has no member named ‘atts’
/home/loguser1/Desktop/tk8.4.16/unix/../generic/tk3d.c:110: error: ‘TkBorder’ has no member named ‘colormap’
/home/loguser1/Desktop/tk8.4.16/unix/../generic/tk3d.c:111: error: ‘TkBorder’ has no member named ‘resourceRefCount’
/home/loguser1/Desktop/tk8.4.16/unix/../generic/tk3d.c:135: error: ‘TkBorder’ has no member named ‘hashPtr’
/home/loguser1/Desktop/tk8.4.16/unix/../generic/tk3d.c:138: error: ‘TkBorder’ has no member named ‘nextPtr’
/home/loguser1/Desktop/tk8.4.16/unix/../generic/tk3d.c:139: error: ‘Tk_FakeWin’ has no member named ‘display’
/home/loguser1/Desktop/tk8.4.16/unix/../generic/tk3d.c:139: error: ‘Tk_FakeWin’ has no member named ‘screenNum’
/home/loguser1/Desktop/tk8.4.16/unix/../generic/tk3d.c:139: error: ‘TkBorder’ has no member named ‘screen’
/home/loguser1/Desktop/tk8.4.16/unix/../generic/tk3d.c:140: error: ‘Tk_FakeWin’ has no member named ‘atts’
/home/loguser1/Desktop/tk8.4.16/unix/../generic/tk3d.c:140: error: ‘TkBorder’ has no member named ‘colormap’
/home/loguser1/Desktop/tk8.4.16/unix/../generic/tk3d.c:141: error: ‘TkBorder’ has no member named ‘resourceRefCount’
/home/loguser1/Desktop/tk8.4.16/unix/../generic/tk3d.c:142: error: ‘TkBorder’ has no member named ‘objRefCount’
/home/loguser1/Desktop/tk8.4.16/unix/../generic/tk3d.c:157: error: ‘TkBorder’ has no member named ‘objRefCount’
/home/loguser1/Desktop/tk8.4.16/unix/../generic/tk3d.c: In function ‘Tk_Get3DBorder’:
/home/loguser1/Desktop/tk8.4.16/unix/../generic/tk3d.c:195: error: ‘XGCValues’ undeclared (first use in this function)
/home/loguser1/Desktop/tk8.4.16/unix/../generic/tk3d.c:195: error: (Each undeclared identifier is reported only once
/home/loguser1/Desktop/tk8.4.16/unix/../generic/tk3d.c:195: error: for each function it appears in.)
/home/loguser1/Desktop/tk8.4.16/unix/../generic/tk3d.c:195: error: expected ‘;’ before ‘gcValues’
/home/loguser1/Desktop/tk8.4.16/unix/../generic/tk3d.c:196: error: ‘XColor’ undeclared (first use in this function)
/home/loguser1/Desktop/tk8.4.16/unix/../generic/tk3d.c:196: error: ‘bgColorPtr’ undeclared (first use in this function)
/home/loguser1/Desktop/tk8.4.16/unix/../generic/tk3d.c:199: error: ‘TkWindow’ has no member named ‘dispPtr’
/home/loguser1/Desktop/tk8.4.16/unix/../generic/tk3d.c:201: error: ‘TkDisplay’ has no member named ‘borderInit’
/home/loguser1/Desktop/tk8.4.16/unix/../generic/tk3d.c:205: error: ‘TkDisplay’ has no member named ‘borderTable’
/home/loguser1/Desktop/tk8.4.16/unix/../generic/tk3d.c:205: error: ‘TkDisplay’ has no member named ‘borderTable’
/home/loguser1/Desktop/tk8.4.16/unix/../generic/tk3d.c:209: error: ‘TkBorder’ has no member named ‘nextPtr’
/home/loguser1/Desktop/tk8.4.16/unix/../generic/tk3d.c:210: error: ‘Tk_FakeWin’ has no member named ‘display’
/home/loguser1/Desktop/tk8.4.16/unix/../generic/tk3d.c:210: error: ‘Tk_FakeWin’ has no member named ‘screenNum’
/home/loguser1/Desktop/tk8.4.16/unix/../generic/tk3d.c:210: error: ‘TkBorder’ has no member named ‘screen’
/home/loguser1/Desktop/tk8.4.16/unix/../generic/tk3d.c:211: error: ‘Tk_FakeWin’ has no member named ‘atts’
/home/loguser1/Desktop/tk8.4.16/unix/../generic/tk3d.c:211: error: ‘TkBorder’ has no member named ‘colormap’
/home/loguser1/Desktop/tk8.4.16/unix/../generic/tk3d.c:212: error: ‘TkBorder’ has no member named ‘resourceRefCount’
/home/loguser1/Desktop/tk8.4.16/unix/../generic/tk3d.c:224: warning: implicit declaration of function ‘Tk_GetColor’
/home/loguser1/Desktop/tk8.4.16/unix/../generic/tk3d.c:233: error: ‘TkBorder’ has no member named ‘screen’
/home/loguser1/Desktop/tk8.4.16/unix/../generic/tk3d.c:233: error: ‘Tk_FakeWin’ has no member named ‘display’
/home/loguser1/Desktop/tk8.4.16/unix/../generic/tk3d.c:233: error: ‘Tk_FakeWin’ has no member named ‘screenNum’
/home/loguser1/Desktop/tk8.4.16/unix/../generic/tk3d.c:234: error: ‘TkBorder’ has no member named ‘visual’
/home/loguser1/Desktop/tk8.4.16/unix/../generic/tk3d.c:234: error: ‘Tk_FakeWin’ has no member named ‘visual’
/home/loguser1/Desktop/tk8.4.16/unix/../generic/tk3d.c:235: error: ‘TkBorder’ has no member named ‘depth’
/home/loguser1/Desktop/tk8.4.16/unix/../generic/tk3d.c:235: error: ‘Tk_FakeWin’ has no member named ‘depth’
/home/loguser1/Desktop/tk8.4.16/unix/../generic/tk3d.c:236: error: ‘TkBorder’ has no member named ‘colormap’
/home/loguser1/Desktop/tk8.4.16/unix/../generic/tk3d.c:236: error: ‘Tk_FakeWin’ has no member named ‘atts’
/home/loguser1/Desktop/tk8.4.16/unix/../generic/tk3d.c:237: error: ‘TkBorder’ has no member named ‘resourceRefCount’
/home/loguser1/Desktop/tk8.4.16/unix/../generic/tk3d.c:238: error: ‘TkBorder’ has no member named ‘objRefCount’
/home/loguser1/Desktop/tk8.4.16/unix/../generic/tk3d.c:239: error: ‘TkBorder’ has no member named ‘bgColorPtr’
/home/loguser1/Desktop/tk8.4.16/unix/../generic/tk3d.c:240: error: ‘TkBorder’ has no member named ‘darkColorPtr’
/home/loguser1/Desktop/tk8.4.16/unix/../generic/tk3d.c:241: error: ‘TkBorder’ has no member named ‘lightColorPtr’
/home/loguser1/Desktop/tk8.4.16/unix/../generic/tk3d.c:242: error: ‘TkBorder’ has no member named ‘shadow’
/home/loguser1/Desktop/tk8.4.16/unix/../generic/tk3d.c:242: error: ‘None’ undeclared (first use in this function)
/home/loguser1/Desktop/tk8.4.16/unix/../generic/tk3d.c:243: error: ‘TkBorder’ has no member named ‘bgGC’
/home/loguser1/Desktop/tk8.4.16/unix/../generic/tk3d.c:244: error: ‘TkBorder’ has no member named ‘darkGC’
/home/loguser1/Desktop/tk8.4.16/unix/../generic/tk3d.c:245: error: ‘TkBorder’ has no member named ‘lightGC’
/home/loguser1/Desktop/tk8.4.16/unix/../generic/tk3d.c:246: error: ‘TkBorder’ has no member named ‘hashPtr’
/home/loguser1/Desktop/tk8.4.16/unix/../generic/tk3d.c:247: error: ‘TkBorder’ has no member named ‘nextPtr’
/home/loguser1/Desktop/tk8.4.16/unix/../generic/tk3d.c:256: error: ‘gcValues’ undeclared (first use in this function)
/home/loguser1/Desktop/tk8.4.16/unix/../generic/tk3d.c:256: error: ‘TkBorder’ has no member named ‘bgColorPtr’
/home/loguser1/Desktop/tk8.4.16/unix/../generic/tk3d.c:257: error: ‘TkBorder’ has no member named ‘bgGC’
/home/loguser1/Desktop/tk8.4.16/unix/../generic/tk3d.c:257: warning: implicit declaration of function ‘Tk_GetGC’
/home/loguser1/Desktop/tk8.4.16/unix/../generic/tk3d.c:257: error: ‘GCForeground’ undeclared (first use in this function)
/home/loguser1/Desktop/tk8.4.16/unix/../generic/tk3d.c: In function ‘Tk_Draw3DRectangle’:
/home/loguser1/Desktop/tk8.4.16/unix/../generic/tk3d.c:284: error: expected declaration specifiers before ‘Drawable’
/home/loguser1/Desktop/tk8.4.16/unix/../generic/tk3d.c:292: error: argument ‘drawable’ doesn’t match prototype
/home/loguser1/Desktop/tk8.4.16/unix/../generic/tkDecls.h:247: error: prototype declaration
/home/loguser1/Desktop/tk8.4.16/unix/../generic/tk3d.c:292: error: argument ‘border’ doesn’t match prototype
/home/loguser1/Desktop/tk8.4.16/unix/../generic/tkDecls.h:247: error: prototype declaration
/home/loguser1/Desktop/tk8.4.16/unix/../generic/tk3d.c:292: error: number of arguments doesn’t match prototype
/home/loguser1/Desktop/tk8.4.16/unix/../generic/tkDecls.h:247: error: prototype declaration
/home/loguser1/Desktop/tk8.4.16/unix/../generic/tk3d.c:300: warning: passing argument 2 of ‘Tk_3DVerticalBevel’ makes pointer from integer without a cast
/home/loguser1/Desktop/tk8.4.16/unix/../generic/tk3d.c:300: warning: passing argument 3 of ‘Tk_3DVerticalBevel’ makes integer from pointer without a cast
/home/loguser1/Desktop/tk8.4.16/unix/../generic/tk3d.c:300: error: too many arguments to function ‘Tk_3DVerticalBevel’
/home/loguser1/Desktop/tk8.4.16/unix/../generic/tk3d.c:302: warning: passing argument 2 of ‘Tk_3DVerticalBevel’ makes pointer from integer without a cast
/home/loguser1/Desktop/tk8.4.16/unix/../generic/tk3d.c:302: warning: passing argument 3 of ‘Tk_3DVerticalBevel’ makes integer from pointer without a cast
/home/loguser1/Desktop/tk8.4.16/unix/../generic/tk3d.c:302: error: too many arguments to function ‘Tk_3DVerticalBevel’
/home/loguser1/Desktop/tk8.4.16/unix/../generic/tk3d.c:304: warning: passing argument 2 of ‘Tk_3DHorizontalBevel’ makes pointer from integer without a cast
/home/loguser1/Desktop/tk8.4.16/unix/../generic/tk3d.c:304: warning: passing argument 3 of ‘Tk_3DHorizontalBevel’ makes integer from pointer without a cast
/home/loguser1/Desktop/tk8.4.16/unix/../generic/tk3d.c:304: error: too many arguments to function ‘Tk_3DHorizontalBevel’
/home/loguser1/Desktop/tk8.4.16/unix/../generic/tk3d.c:306: warning: passing argument 2 of ‘Tk_3DHorizontalBevel’ makes pointer from integer without a cast
/home/loguser1/Desktop/tk8.4.16/unix/../generic/tk3d.c:306: warning: passing argument 3 of ‘Tk_3DHorizontalBevel’ makes integer from pointer without a cast
/home/loguser1/Desktop/tk8.4.16/unix/../generic/tk3d.c:306: error: too many arguments to function ‘Tk_3DHorizontalBevel’
/home/loguser1/Desktop/tk8.4.16/unix/../generic/tk3d.c: In function ‘Tk_NameOf3DBorder’:
/home/loguser1/Desktop/tk8.4.16/unix/../generic/tk3d.c:333: error: ‘TkBorder’ has no member named ‘hashPtr’
/home/loguser1/Desktop/tk8.4.16/unix/../generic/tk3d.c: At top level:
/home/loguser1/Desktop/tk8.4.16/unix/../generic/tk3d.c:352: error: expected ‘=’, ‘,’, ‘;’, ‘asm’ or ‘__attribute__’ before ‘*’ token
/home/loguser1/Desktop/tk8.4.16/unix/../generic/tk3d.c:355: error: expected identifier or ‘(’ before ‘{’ token
/home/loguser1/Desktop/tk8.4.16/unix/../generic/tk3d.c:376: error: expected ‘=’, ‘,’, ‘;’, ‘asm’ or ‘__attribute__’ before ‘Tk_3DBorderGC’
/home/loguser1/Desktop/tk8.4.16/unix/../generic/tk3d.c:382: error: expected identifier or ‘(’ before ‘{’ token
/home/loguser1/Desktop/tk8.4.16/unix/../generic/tk3d.c: In function ‘Tk_Free3DBorder’:
/home/loguser1/Desktop/tk8.4.16/unix/../generic/tk3d.c:429: error: ‘Display’ undeclared (first use in this function)
/home/loguser1/Desktop/tk8.4.16/unix/../generic/tk3d.c:429: error: ‘display’ undeclared (first use in this function)
/home/loguser1/Desktop/tk8.4.16/unix/../generic/tk3d.c:429: warning: implicit declaration of function ‘DisplayOfScreen’
/home/loguser1/Desktop/tk8.4.16/unix/../generic/tk3d.c:429: error: ‘TkBorder’ has no member named ‘screen’
/home/loguser1/Desktop/tk8.4.16/unix/../generic/tk3d.c:432: error: ‘TkBorder’ has no member named ‘resourceRefCount’
/home/loguser1/Desktop/tk8.4.16/unix/../generic/tk3d.c:433: error: ‘TkBorder’ has no member named ‘resourceRefCount’
/home/loguser1/Desktop/tk8.4.16/unix/../generic/tk3d.c:437: error: ‘TkBorder’ has no member named ‘hashPtr’
/home/loguser1/Desktop/tk8.4.16/unix/../generic/tk3d.c:439: error: ‘TkBorder’ has no member named ‘bgColorPtr’
/home/loguser1/Desktop/tk8.4.16/unix/../generic/tk3d.c:440: warning: implicit declaration of function ‘Tk_FreeColor’
/home/loguser1/Desktop/tk8.4.16/unix/../generic/tk3d.c:440: error: ‘TkBorder’ has no member named ‘bgColorPtr’
/home/loguser1/Desktop/tk8.4.16/unix/../generic/tk3d.c:442: error: ‘TkBorder’ has no member named ‘darkColorPtr’
/home/loguser1/Desktop/tk8.4.16/unix/../generic/tk3d.c:443: error: ‘TkBorder’ has no member named ‘darkColorPtr’
/home/loguser1/Desktop/tk8.4.16/unix/../generic/tk3d.c:445: error: ‘TkBorder’ has no member named ‘lightColorPtr’
/home/loguser1/Desktop/tk8.4.16/unix/../generic/tk3d.c:446: error: ‘TkBorder’ has no member named ‘lightColorPtr’
/home/loguser1/Desktop/tk8.4.16/unix/../generic/tk3d.c:448: error: ‘TkBorder’ has no member named ‘shadow’
/home/loguser1/Desktop/tk8.4.16/unix/../generic/tk3d.c:448: error: ‘None’ undeclared (first use in this function)
/home/loguser1/Desktop/tk8.4.16/unix/../generic/tk3d.c:449: warning: implicit declaration of function ‘Tk_FreeBitmap’
/home/loguser1/Desktop/tk8.4.16/unix/../generic/tk3d.c:449: error: ‘TkBorder’ has no member named ‘shadow’
/home/loguser1/Desktop/tk8.4.16/unix/../generic/tk3d.c:451: error: ‘TkBorder’ has no member named ‘bgGC’
/home/loguser1/Desktop/tk8.4.16/unix/../generic/tk3d.c:452: warning: implicit declaration of function ‘Tk_FreeGC’
/home/loguser1/Desktop/tk8.4.16/unix/../generic/tk3d.c:452: error: ‘TkBorder’ has no member named ‘bgGC’
/home/loguser1/Desktop/tk8.4.16/unix/../generic/tk3d.c:454: error: ‘TkBorder’ has no member named ‘darkGC’
/home/loguser1/Desktop/tk8.4.16/unix/../generic/tk3d.c:455: error: ‘TkBorder’ has no member named ‘darkGC’
/home/loguser1/Desktop/tk8.4.16/unix/../generic/tk3d.c:457: error: ‘TkBorder’ has no member named ‘lightGC’
/home/loguser1/Desktop/tk8.4.16/unix/../generic/tk3d.c:458: error: ‘TkBorder’ has no member named ‘lightGC’
/home/loguser1/Desktop/tk8.4.16/unix/../generic/tk3d.c:461: error: ‘TkBorder’ has no member named ‘nextPtr’
/home/loguser1/Desktop/tk8.4.16/unix/../generic/tk3d.c:462: error: ‘TkBorder’ has no member named ‘hashPtr’
/home/loguser1/Desktop/tk8.4.16/unix/../generic/tk3d.c:464: error: ‘TkBorder’ has no member named ‘hashPtr’
/home/loguser1/Desktop/tk8.4.16/unix/../generic/tk3d.c:464: error: ‘TkBorder’ has no member named ‘nextPtr’
/home/loguser1/Desktop/tk8.4.16/unix/../generic/tk3d.c:467: error: ‘TkBorder’ has no member named ‘nextPtr’
/home/loguser1/Desktop/tk8.4.16/unix/../generic/tk3d.c:468: error: ‘TkBorder’ has no member named ‘nextPtr’
/home/loguser1/Desktop/tk8.4.16/unix/../generic/tk3d.c:470: error: ‘TkBorder’ has no member named ‘nextPtr’
/home/loguser1/Desktop/tk8.4.16/unix/../generic/tk3d.c:470: error: ‘TkBorder’ has no member named ‘nextPtr’
/home/loguser1/Desktop/tk8.4.16/unix/../generic/tk3d.c:472: error: ‘TkBorder’ has no member named ‘objRefCount’
/home/loguser1/Desktop/tk8.4.16/unix/../generic/tk3d.c: In function ‘FreeBorderObjProc’:
/home/loguser1/Desktop/tk8.4.16/unix/../generic/tk3d.c:535: error: ‘TkBorder’ has no member named ‘objRefCount’
/home/loguser1/Desktop/tk8.4.16/unix/../generic/tk3d.c:536: error: ‘TkBorder’ has no member named ‘objRefCount’
/home/loguser1/Desktop/tk8.4.16/unix/../generic/tk3d.c:537: error: ‘TkBorder’ has no member named ‘resourceRefCount’
/home/loguser1/Desktop/tk8.4.16/unix/../generic/tk3d.c: In function ‘DupBorderObjProc’:
/home/loguser1/Desktop/tk8.4.16/unix/../generic/tk3d.c:573: error: ‘TkBorder’ has no member named ‘objRefCount’
/home/loguser1/Desktop/tk8.4.16/unix/../generic/tk3d.c: In function ‘Tk_SetBackgroundFromBorder’:
/home/loguser1/Desktop/tk8.4.16/unix/../generic/tk3d.c:601: error: ‘TkBorder’ has no member named ‘bgColorPtr’
/home/loguser1/Desktop/tk8.4.16/unix/../generic/tk3d.c: In function ‘Tk_Draw3DPolygon’:
/home/loguser1/Desktop/tk8.4.16/unix/../generic/tk3d.c:755: error: expected declaration specifiers before ‘Drawable’
/home/loguser1/Desktop/tk8.4.16/unix/../generic/tk3d.c:757: error: expected declaration specifiers before ‘XPoint’
/home/loguser1/Desktop/tk8.4.16/unix/../generic/tk3d.c:768: error: argument ‘drawable’ doesn’t match prototype
/home/loguser1/Desktop/tk8.4.16/unix/../generic/tkDecls.h:242: error: prototype declaration
/home/loguser1/Desktop/tk8.4.16/unix/../generic/tk3d.c:768: error: argument ‘border’ doesn’t match prototype
/home/loguser1/Desktop/tk8.4.16/unix/../generic/tkDecls.h:242: error: prototype declaration
/home/loguser1/Desktop/tk8.4.16/unix/../generic/tk3d.c:768: error: number of arguments doesn’t match prototype
/home/loguser1/Desktop/tk8.4.16/unix/../generic/tkDecls.h:242: error: prototype declaration
/home/loguser1/Desktop/tk8.4.16/unix/../generic/tk3d.c:769: error: ‘XPoint’ undeclared (first use in this function)
/home/loguser1/Desktop/tk8.4.16/unix/../generic/tk3d.c:769: error: expected ‘;’ before ‘poly’
/home/loguser1/Desktop/tk8.4.16/unix/../generic/tk3d.c:770: error: expected ‘;’ before ‘perp’
/home/loguser1/Desktop/tk8.4.16/unix/../generic/tk3d.c:771: error: expected ‘=’, ‘,’, ‘;’, ‘asm’ or ‘__attribute__’ before ‘*’ token
/home/loguser1/Desktop/tk8.4.16/unix/../generic/tk3d.c:771: error: ‘p1Ptr’ undeclared (first use in this function)
/home/loguser1/Desktop/tk8.4.16/unix/../generic/tk3d.c:771: error: ‘p2Ptr’ undeclared (first use in this function)
/home/loguser1/Desktop/tk8.4.16/unix/../generic/tk3d.c:771: warning: left-hand operand of comma expression has no effect
/home/loguser1/Desktop/tk8.4.16/unix/../generic/tk3d.c:773: error: ‘GC’ undeclared (first use in this function)
/home/loguser1/Desktop/tk8.4.16/unix/../generic/tk3d.c:773: error: expected ‘;’ before ‘gc’
/home/loguser1/Desktop/tk8.4.16/unix/../generic/tk3d.c:775: error: ‘Display’ undeclared (first use in this function)
/home/loguser1/Desktop/tk8.4.16/unix/../generic/tk3d.c:775: error: ‘display’ undeclared (first use in this function)
/home/loguser1/Desktop/tk8.4.16/unix/../generic/tk3d.c:775: error: ‘Tk_FakeWin’ has no member named ‘display’
/home/loguser1/Desktop/tk8.4.16/unix/../generic/tk3d.c:777: error: ‘TkBorder’ has no member named ‘lightGC’
/home/loguser1/Desktop/tk8.4.16/unix/../generic/tk3d.c:777: error: ‘None’ undeclared (first use in this function)
/home/loguser1/Desktop/tk8.4.16/unix/../generic/tk3d.c:791: warning: passing argument 2 of ‘Tk_Draw3DPolygon’ makes pointer from integer without a cast
/home/loguser1/Desktop/tk8.4.16/unix/../generic/tk3d.c:791: warning: passing argument 3 of ‘Tk_Draw3DPolygon’ makes integer from pointer without a cast
/home/loguser1/Desktop/tk8.4.16/unix/../generic/tk3d.c:791: error: too many arguments to function ‘Tk_Draw3DPolygon’
/home/loguser1/Desktop/tk8.4.16/unix/../generic/tk3d.c:794: warning: passing argument 2 of ‘Tk_Draw3DPolygon’ makes pointer from integer without a cast
/home/loguser1/Desktop/tk8.4.16/unix/../generic/tk3d.c:794: warning: passing argument 3 of ‘Tk_Draw3DPolygon’ makes integer from pointer without a cast
/home/loguser1/Desktop/tk8.4.16/unix/../generic/tk3d.c:794: error: too many arguments to function ‘Tk_Draw3DPolygon’
/home/loguser1/Desktop/tk8.4.16/unix/../generic/tk3d.c:803: error: subscripted value is neither array nor pointer
/home/loguser1/Desktop/tk8.4.16/unix/../generic/tk3d.c:804: error: subscripted value is neither array nor pointer
/home/loguser1/Desktop/tk8.4.16/unix/../generic/tk3d.c:850: error: subscripted value is neither array nor pointer
/home/loguser1/Desktop/tk8.4.16/unix/../generic/tk3d.c:850: warning: left-hand operand of comma expression has no effect
/home/loguser1/Desktop/tk8.4.16/unix/../generic/tk3d.c:851: warning: left-hand operand of comma expression has no effect
/home/loguser1/Desktop/tk8.4.16/unix/../generic/tk3d.c:862: warning: implicit declaration of function ‘ShiftLine’
/home/loguser1/Desktop/tk8.4.16/unix/../generic/tk3d.c:862: error: ‘newB1’ undeclared (first use in this function)
/home/loguser1/Desktop/tk8.4.16/unix/../generic/tk3d.c:863: error: ‘newB2’ undeclared (first use in this function)
/home/loguser1/Desktop/tk8.4.16/unix/../generic/tk3d.c:865: error: ‘poly’ undeclared (first use in this function)
/home/loguser1/Desktop/tk8.4.16/unix/../generic/tk3d.c:868: warning: implicit declaration of function ‘Intersect’
/home/loguser1/Desktop/tk8.4.16/unix/../generic/tk3d.c:868: error: ‘b1’ undeclared (first use in this function)
/home/loguser1/Desktop/tk8.4.16/unix/../generic/tk3d.c:868: error: ‘b2’ undeclared (first use in this function)
/home/loguser1/Desktop/tk8.4.16/unix/../generic/tk3d.c:900: error: ‘perp’ undeclared (first use in this function)
/home/loguser1/Desktop/tk8.4.16/unix/../generic/tk3d.c:903: error: ‘c’ undeclared (first use in this function)
/home/loguser1/Desktop/tk8.4.16/unix/../generic/tk3d.c:904: error: ‘shift1’ undeclared (first use in this function)
/home/loguser1/Desktop/tk8.4.16/unix/../generic/tk3d.c:905: error: ‘shift2’ undeclared (first use in this function)
/home/loguser1/Desktop/tk8.4.16/unix/../generic/tk3d.c:919: error: ‘gc’ undeclared (first use in this function)
/home/loguser1/Desktop/tk8.4.16/unix/../generic/tk3d.c:919: error: ‘TkBorder’ has no member named ‘lightGC’
/home/loguser1/Desktop/tk8.4.16/unix/../generic/tk3d.c:921: error: ‘TkBorder’ has no member named ‘darkGC’
/home/loguser1/Desktop/tk8.4.16/unix/../generic/tk3d.c:923: warning: implicit declaration of function ‘XFillPolygon’
/home/loguser1/Desktop/tk8.4.16/unix/../generic/tk3d.c:923: error: ‘Convex’ undeclared (first use in this function)
/home/loguser1/Desktop/tk8.4.16/unix/../generic/tk3d.c:924: error: ‘CoordModeOrigin’ undeclared (first use in this function)
/home/loguser1/Desktop/tk8.4.16/unix/../generic/tk3d.c: In function ‘Tk_Fill3DRectangle’:
/home/loguser1/Desktop/tk8.4.16/unix/../generic/tk3d.c:963: error: expected declaration specifiers before ‘Drawable’
/home/loguser1/Desktop/tk8.4.16/unix/../generic/tk3d.c:970: error: argument ‘drawable’ doesn’t match prototype
/home/loguser1/Desktop/tk8.4.16/unix/../generic/tkDecls.h:270: error: prototype declaration
/home/loguser1/Desktop/tk8.4.16/unix/../generic/tk3d.c:970: error: argument ‘border’ doesn’t match prototype
/home/loguser1/Desktop/tk8.4.16/unix/../generic/tkDecls.h:270: error: prototype declaration
/home/loguser1/Desktop/tk8.4.16/unix/../generic/tk3d.c:970: error: number of arguments doesn’t match prototype
/home/loguser1/Desktop/tk8.4.16/unix/../generic/tkDecls.h:270: error: prototype declaration
/home/loguser1/Desktop/tk8.4.16/unix/../generic/tk3d.c:997: warning: implicit declaration of function ‘XFillRectangle’
/home/loguser1/Desktop/tk8.4.16/unix/../generic/tk3d.c:997: error: ‘Tk_FakeWin’ has no member named ‘display’
/home/loguser1/Desktop/tk8.4.16/unix/../generic/tk3d.c:997: error: ‘TkBorder’ has no member named ‘bgGC’
/home/loguser1/Desktop/tk8.4.16/unix/../generic/tk3d.c:1004: warning: passing argument 2 of ‘Tk_Draw3DRectangle’ makes pointer from integer without a cast
/home/loguser1/Desktop/tk8.4.16/unix/../generic/tk3d.c:1004: warning: passing argument 3 of ‘Tk_Draw3DRectangle’ makes integer from pointer without a cast
/home/loguser1/Desktop/tk8.4.16/unix/../generic/tk3d.c:1004: error: too many arguments to function ‘Tk_Draw3DRectangle’
/home/loguser1/Desktop/tk8.4.16/unix/../generic/tk3d.c: In function ‘Tk_Fill3DPolygon’:
/home/loguser1/Desktop/tk8.4.16/unix/../generic/tk3d.c:1028: error: expected declaration specifiers before ‘Drawable’
/home/loguser1/Desktop/tk8.4.16/unix/../generic/tk3d.c:1030: error: expected declaration specifiers before ‘XPoint’
/home/loguser1/Desktop/tk8.4.16/unix/../generic/tk3d.c:1041: error: argument ‘drawable’ doesn’t match prototype
/home/loguser1/Desktop/tk8.4.16/unix/../generic/tkDecls.h:265: error: prototype declaration
/home/loguser1/Desktop/tk8.4.16/unix/../generic/tk3d.c:1041: error: argument ‘border’ doesn’t match prototype
/home/loguser1/Desktop/tk8.4.16/unix/../generic/tkDecls.h:265: error: prototype declaration
/home/loguser1/Desktop/tk8.4.16/unix/../generic/tk3d.c:1041: error: number of arguments doesn’t match prototype
/home/loguser1/Desktop/tk8.4.16/unix/../generic/tkDecls.h:265: error: prototype declaration
/home/loguser1/Desktop/tk8.4.16/unix/../generic/tk3d.c:1044: error: ‘Tk_FakeWin’ has no member named ‘display’
/home/loguser1/Desktop/tk8.4.16/unix/../generic/tk3d.c:1044: error: ‘TkBorder’ has no member named ‘bgGC’
/home/loguser1/Desktop/tk8.4.16/unix/../generic/tk3d.c:1045: error: ‘Complex’ undeclared (first use in this function)
/home/loguser1/Desktop/tk8.4.16/unix/../generic/tk3d.c:1045: error: ‘CoordModeOrigin’ undeclared (first use in this function)
/home/loguser1/Desktop/tk8.4.16/unix/../generic/tk3d.c:1048: warning: passing argument 2 of ‘Tk_Draw3DPolygon’ makes pointer from integer without a cast
/home/loguser1/Desktop/tk8.4.16/unix/../generic/tk3d.c:1048: warning: passing argument 3 of ‘Tk_Draw3DPolygon’ makes integer from pointer without a cast
/home/loguser1/Desktop/tk8.4.16/unix/../generic/tk3d.c:1048: error: too many arguments to function ‘Tk_Draw3DPolygon’
/home/loguser1/Desktop/tk8.4.16/unix/../generic/tk3d.c: In function ‘BorderInit’:
/home/loguser1/Desktop/tk8.4.16/unix/../generic/tk3d.c:1072: error: ‘TkDisplay’ has no member named ‘borderInit’
/home/loguser1/Desktop/tk8.4.16/unix/../generic/tk3d.c:1073: error: ‘TkDisplay’ has no member named ‘borderTable’
/home/loguser1/Desktop/tk8.4.16/unix/../generic/tk3d.c: At top level:
/home/loguser1/Desktop/tk8.4.16/unix/../generic/tk3d.c:1096: warning: conflicting types for ‘ShiftLine’
/home/loguser1/Desktop/tk8.4.16/unix/../generic/tk3d.c:1096: error: static declaration of ‘ShiftLine’ follows non-static declaration
/home/loguser1/Desktop/tk8.4.16/unix/../generic/tk3d.c:862: error: previous implicit declaration of ‘ShiftLine’ was here
/home/loguser1/Desktop/tk8.4.16/unix/../generic/tk3d.c: In function ‘ShiftLine’:
/home/loguser1/Desktop/tk8.4.16/unix/../generic/tk3d.c:1096: error: expected declaration specifiers before ‘XPoint’
/home/loguser1/Desktop/tk8.4.16/unix/../generic/tk3d.c:1097: error: expected declaration specifiers before ‘XPoint’
/home/loguser1/Desktop/tk8.4.16/unix/../generic/tk3d.c:1102: error: expected declaration specifiers before ‘XPoint’
/home/loguser1/Desktop/tk8.4.16/unix/../generic/tk3d.c:1138: error: invalid type argument of ‘unary *’
/home/loguser1/Desktop/tk8.4.16/unix/../generic/tk3d.c:1138: error: invalid type argument of ‘unary *’
/home/loguser1/Desktop/tk8.4.16/unix/../generic/tk3d.c:1139: error: invalid type argument of ‘->’
/home/loguser1/Desktop/tk8.4.16/unix/../generic/tk3d.c:1139: error: invalid type argument of ‘->’
/home/loguser1/Desktop/tk8.4.16/unix/../generic/tk3d.c:1140: error: invalid type argument of ‘->’
/home/loguser1/Desktop/tk8.4.16/unix/../generic/tk3d.c:1140: error: invalid type argument of ‘->’
/home/loguser1/Desktop/tk8.4.16/unix/../generic/tk3d.c:1158: error: invalid type argument of ‘->’
/home/loguser1/Desktop/tk8.4.16/unix/../generic/tk3d.c:1164: error: invalid type argument of ‘->’
/home/loguser1/Desktop/tk8.4.16/unix/../generic/tk3d.c: At top level:
/home/loguser1/Desktop/tk8.4.16/unix/../generic/tk3d.c:1189: error: static declaration of ‘Intersect’ follows non-static declaration
/home/loguser1/Desktop/tk8.4.16/unix/../generic/tk3d.c:868: error: previous implicit declaration of ‘Intersect’ was here
/home/loguser1/Desktop/tk8.4.16/unix/../generic/tk3d.c: In function ‘Intersect’:
/home/loguser1/Desktop/tk8.4.16/unix/../generic/tk3d.c:1189: error: expected declaration specifiers before ‘XPoint’
/home/loguser1/Desktop/tk8.4.16/unix/../generic/tk3d.c:1190: error: expected declaration specifiers before ‘XPoint’
/home/loguser1/Desktop/tk8.4.16/unix/../generic/tk3d.c:1191: error: expected declaration specifiers before ‘XPoint’
/home/loguser1/Desktop/tk8.4.16/unix/../generic/tk3d.c:1192: error: expected declaration specifiers before ‘XPoint’
/home/loguser1/Desktop/tk8.4.16/unix/../generic/tk3d.c:1193: error: expected declaration specifiers before ‘XPoint’
/home/loguser1/Desktop/tk8.4.16/unix/../generic/tk3d.c:1203: error: invalid type argument of ‘->’
/home/loguser1/Desktop/tk8.4.16/unix/../generic/tk3d.c:1203: error: invalid type argument of ‘->’
/home/loguser1/Desktop/tk8.4.16/unix/../generic/tk3d.c:1203: error: invalid type argument of ‘->’
/home/loguser1/Desktop/tk8.4.16/unix/../generic/tk3d.c:1203: error: invalid type argument of ‘->’
/home/loguser1/Desktop/tk8.4.16/unix/../generic/tk3d.c:1204: error: invalid type argument of ‘->’
/home/loguser1/Desktop/tk8.4.16/unix/../generic/tk3d.c:1204: error: invalid type argument of ‘->’
/home/loguser1/Desktop/tk8.4.16/unix/../generic/tk3d.c:1204: error: invalid type argument of ‘->’
/home/loguser1/Desktop/tk8.4.16/unix/../generic/tk3d.c:1204: error: invalid type argument of ‘->’
/home/loguser1/Desktop/tk8.4.16/unix/../generic/tk3d.c:1205: error: invalid type argument of ‘->’
/home/loguser1/Desktop/tk8.4.16/unix/../generic/tk3d.c:1205: error: invalid type argument of ‘->’
/home/loguser1/Desktop/tk8.4.16/unix/../generic/tk3d.c:1205: error: invalid type argument of ‘->’
/home/loguser1/Desktop/tk8.4.16/unix/../generic/tk3d.c:1205: error: invalid type argument of ‘->’
/home/loguser1/Desktop/tk8.4.16/unix/../generic/tk3d.c:1206: error: invalid type argument of ‘->’
/home/loguser1/Desktop/tk8.4.16/unix/../generic/tk3d.c:1206: error: invalid type argument of ‘->’
/home/loguser1/Desktop/tk8.4.16/unix/../generic/tk3d.c:1206: error: invalid type argument of ‘->’
/home/loguser1/Desktop/tk8.4.16/unix/../generic/tk3d.c:1206: error: invalid type argument of ‘->’
/home/loguser1/Desktop/tk8.4.16/unix/../generic/tk3d.c:1211: error: invalid type argument of ‘->’
/home/loguser1/Desktop/tk8.4.16/unix/../generic/tk3d.c:1211: error: invalid type argument of ‘->’
/home/loguser1/Desktop/tk8.4.16/unix/../generic/tk3d.c:1211: error: invalid type argument of ‘->’
/home/loguser1/Desktop/tk8.4.16/unix/../generic/tk3d.c:1211: error: invalid type argument of ‘->’
/home/loguser1/Desktop/tk8.4.16/unix/../generic/tk3d.c:1218: error: invalid type argument of ‘->’
/home/loguser1/Desktop/tk8.4.16/unix/../generic/tk3d.c:1220: error: invalid type argument of ‘->’
/home/loguser1/Desktop/tk8.4.16/unix/../generic/tk3d.c:1222: error: invalid type argument of ‘->’
/home/loguser1/Desktop/tk8.4.16/unix/../generic/tk3d.c:1222: error: invalid type argument of ‘->’
/home/loguser1/Desktop/tk8.4.16/unix/../generic/tk3d.c:1222: error: invalid type argument of ‘->’
/home/loguser1/Desktop/tk8.4.16/unix/../generic/tk3d.c:1222: error: invalid type argument of ‘->’
/home/loguser1/Desktop/tk8.4.16/unix/../generic/tk3d.c:1229: error: invalid type argument of ‘->’
/home/loguser1/Desktop/tk8.4.16/unix/../generic/tk3d.c:1231: error: invalid type argument of ‘->’
/home/loguser1/Desktop/tk8.4.16/unix/../generic/tk3d.c: In function ‘Tk_Get3DBorderFromObj’:
/home/loguser1/Desktop/tk8.4.16/unix/../generic/tk3d.c:1264: error: ‘TkWindow’ has no member named ‘dispPtr’
/home/loguser1/Desktop/tk8.4.16/unix/../generic/tk3d.c:1279: error: ‘TkBorder’ has no member named ‘resourceRefCount’
/home/loguser1/Desktop/tk8.4.16/unix/../generic/tk3d.c:1280: error: ‘Tk_FakeWin’ has no member named ‘display’
/home/loguser1/Desktop/tk8.4.16/unix/../generic/tk3d.c:1280: error: ‘Tk_FakeWin’ has no member named ‘screenNum’
/home/loguser1/Desktop/tk8.4.16/unix/../generic/tk3d.c:1280: error: ‘TkBorder’ has no member named ‘screen’
/home/loguser1/Desktop/tk8.4.16/unix/../generic/tk3d.c:1281: error: ‘Tk_FakeWin’ has no member named ‘atts’
/home/loguser1/Desktop/tk8.4.16/unix/../generic/tk3d.c:1281: error: ‘TkBorder’ has no member named ‘colormap’
/home/loguser1/Desktop/tk8.4.16/unix/../generic/tk3d.c:1301: error: ‘TkDisplay’ has no member named ‘borderTable’
/home/loguser1/Desktop/tk8.4.16/unix/../generic/tk3d.c:1301: error: ‘TkDisplay’ has no member named ‘borderTable’
/home/loguser1/Desktop/tk8.4.16/unix/../generic/tk3d.c:1306: error: ‘TkBorder’ has no member named ‘nextPtr’
/home/loguser1/Desktop/tk8.4.16/unix/../generic/tk3d.c:1307: error: ‘Tk_FakeWin’ has no member named ‘display’
/home/loguser1/Desktop/tk8.4.16/unix/../generic/tk3d.c:1307: error: ‘Tk_FakeWin’ has no member named ‘screenNum’
/home/loguser1/Desktop/tk8.4.16/unix/../generic/tk3d.c:1307: error: ‘TkBorder’ has no member named ‘screen’
/home/loguser1/Desktop/tk8.4.16/unix/../generic/tk3d.c:1308: error: ‘Tk_FakeWin’ has no member named ‘atts’
/home/loguser1/Desktop/tk8.4.16/unix/../generic/tk3d.c:1308: error: ‘TkBorder’ has no member named ‘colormap’
/home/loguser1/Desktop/tk8.4.16/unix/../generic/tk3d.c:1311: error: ‘TkBorder’ has no member named ‘objRefCount’
/home/loguser1/Desktop/tk8.4.16/unix/../generic/tk3d.c: In function ‘TkDebugBorder’:
/home/loguser1/Desktop/tk8.4.16/unix/../generic/tk3d.c:1391: error: ‘TkWindow’ has no member named ‘dispPtr’
/home/loguser1/Desktop/tk8.4.16/unix/../generic/tk3d.c:1394: error: ‘TkDisplay’ has no member named ‘borderTable’
/home/loguser1/Desktop/tk8.4.16/unix/../generic/tk3d.c:1394: error: ‘TkDisplay’ has no member named ‘borderTable’
/home/loguser1/Desktop/tk8.4.16/unix/../generic/tk3d.c:1400: error: ‘TkBorder’ has no member named ‘nextPtr’
/home/loguser1/Desktop/tk8.4.16/unix/../generic/tk3d.c:1403: error: ‘TkBorder’ has no member named ‘resourceRefCount’
/home/loguser1/Desktop/tk8.4.16/unix/../generic/tk3d.c:1405: error: ‘TkBorder’ has no member named ‘objRefCount’
make: *** [tk3d.o] Error 1
loguser1@pc1:~/Desktop/tk8.4.16/unix$