All pastes #800065 Raw Edit

Unnamed

public text v1 · immutable
#800065 ·published 2007-11-28 02:07 UTC
rendered paste body
make[6]: Leaving directory `/home/travis/buildbot/x86/magicbox-trunk/build/build_dir/toolchain-powerpc_gcc4.1.2/uClibc-0.9.28.2/libc/sysdeps'
make -C  unistd
make[6]: Entering directory `/home/travis/buildbot/x86/magicbox-trunk/build/build_dir/toolchain-powerpc_gcc4.1.2/uClibc-0.9.28.2/libc/unistd'
make[6]: Nothing to be done for `all'.
make[6]: Leaving directory `/home/travis/buildbot/x86/magicbox-trunk/build/build_dir/toolchain-powerpc_gcc4.1.2/uClibc-0.9.28.2/libc/unistd'
rm -f libc.a shared_libc.a
objs=`cat obj.*` ; \
	ar cr libc.a $objs && \
	ar dN 2 libc.a $objs && \
	ar dN 2 libc.a $objs
ar cr libc.a obj.signal
ar cr libc.a obj.string
ar cr libc.a obj.string.generic
ar cr libc.a obj.string.powerpc
ar cr libc.a obj.sysdeps.common
ar cr libc.a obj.sysdeps.powerpc
cp libc.a shared_libc.a
ranlib libc.a
ld  -shared --warn-common --warn-once -z combreloc -z defs -s  -soname=libc.so.0 -o libuClibc-0.9.28.so \
		--whole-archive shared_libc.a \
		../libc/misc/internals/interp.o --no-whole-archive \
		-init __uClibc_init ../lib/ld-uClibc.so.0 /usr/lib/gcc/i386-redhat-linux/4.1.2/libgcc.a 
ld: shared_libc.a(inet_aton.o): Relocations in generic ELF (EM: 20)
shared_libc.a(inet_aton.o): could not read symbols: File in wrong format
make[5]: *** [shared] Error 1
make[5]: Leaving directory `/home/travis/buildbot/x86/magicbox-trunk/build/build_dir/toolchain-powerpc_gcc4.1.2/uClibc-0.9.28.2/libc'
make[4]: *** [shared] Error 2
make[4]: Leaving directory `/home/travis/buildbot/x86/magicbox-trunk/build/build_dir/toolchain-powerpc_gcc4.1.2/uClibc-0.9.28.2'
make[3]: *** [/home/travis/buildbot/x86/magicbox-trunk/build/staging_dir/toolchain-powerpc_gcc4.1.2/stamp/.uclibc_installed] Error 2
make[3]: Leaving directory `/home/travis/buildbot/x86/magicbox-trunk/build/toolchain/uClibc'
make[2]: *** [toolchain/uClibc/compile] Error 2
make[2]: Leaving directory `/home/travis/buildbot/x86/magicbox-trunk/build'
make[1]: *** [/home/travis/buildbot/x86/magicbox-trunk/build/staging_dir/powerpc/stamp/.toolchain_install] Error 2
make[1]: Leaving directory `/home/travis/buildbot/x86/magicbox-trunk/build'
make: *** [world] Error 2