All pastes #800006 Raw Edit

Someone

public cpp v1 · immutable
#800006 ·published 2007-11-28 01:01 UTC
rendered paste body
g++ -c -pipe -Wall -W -O2 -D_REENTRANT  -DQT_NO_DEBUG -DQT_THREAD_SUPPORT -DQT_SHARED -DQT_TABLET_SUPPORT -I/usr/share/qt3/mkspecs/default -I. -I. -Isrc -I/usr/include/qt3 -o ajustes.o src/ajustes.cppsrc/ajustes.cpp: In member function ‘virtual void ajustes::btGuardarClicked()’:src/ajustes.cpp:35: error: ‘almacen’ was not declared in this scopesrc/ajustes.cpp:35: error: ‘articulo’ was not declared in this scopesrc/ajustes.cpp:35: error: ‘documento’ was not declared in this scopesrc/ajustes.cpp:35: error: ‘cantidad’ was not declared in this scopesrc/ajustes.cpp:35: error: ‘concepto’ was not declared in this scopesrc/ajustes.cpp:36: error: ‘fecha’ was not declared in this scopesrc/ajustes.cpp:38: error: ‘listView’ was not declared in this scopesrc/ajustes.cpp: In member function ‘virtual void ajustes::btBuscarArticuloClicked()’:src/ajustes.cpp:44: error: ‘articulo’ was not declared in this scopesrc/ajustes.cpp:45: error: ‘nombreArticulo’ was not declared in this scopesrc/ajustes.cpp: In member function ‘virtual void ajustes::btBuscarConceptoClicked()’:src/ajustes.cpp:51: error: ‘concepto’ was not declared in this scopesrc/ajustes.cpp:52: error: ‘nombreConcepto’ was not declared in this scopesrc/ajustes.cpp: In member function ‘virtual void ajustes::btBuscarAlmacenClicked()’:src/ajustes.cpp:57: error: ‘almacen’ was not declared in this scopesrc/ajustes.cpp:58: error: ‘nombreAlmacen’ was not declared in this scopesrc/ajustes.cpp: In member function ‘bool ajustes::validFields()’:src/ajustes.cpp:65: error: ‘almacen’ was not declared in this scopesrc/ajustes.cpp:66: error: ‘articulo’ was not declared in this scopesrc/ajustes.cpp:67: error: ‘cantidad’ was not declared in this scopesrc/ajustes.cpp:68: error: ‘documento’ was not declared in this scopesrc/ajustes.cpp:69: error: ‘concepto’ was not declared in this scopesrc/ajustes.cpp: In member function ‘void ajustes::inicializa()’:src/ajustes.cpp:83: error: ‘fecha’ was not declared in this scopesrc/ajustes.cpp:84: error: ‘listView’ was not declared in this scopemake: *** [ajustes.o] Error 1