rendered paste bodyThis file contains any messages produced by compilers while
running configure, to aid debugging if configure makes a mistake.
It was created by aranym configure 0.9, which was
generated by GNU Autoconf 2.61. Invocation command line was
$ ./configure --enable-fpe=uae
## --------- ##
## Platform. ##
## --------- ##
hostname = livecd
uname -m = ppc64
uname -r = 2.6.16-ps3
uname -s = Linux
uname -v = #1 SMP Thu Mar 15 19:06:46 UTC 2007
/usr/bin/uname -p = Cell Broadband Engine, altivec supported
/bin/uname -X = unknown
/bin/arch = ppc64
/usr/bin/arch -k = unknown
/usr/convex/getsysinfo = unknown
/usr/bin/hostinfo = unknown
/bin/machine = unknown
/usr/bin/oslevel = unknown
/bin/universe = unknown
PATH: /bin
PATH: /sbin
PATH: /usr/bin
PATH: /usr/sbin
PATH: /usr/local/bin
PATH: /usr/local/sbin
PATH: /opt/bin
## ----------- ##
## Core tests. ##
## ----------- ##
configure:1839: checking build system type
configure:1857: result: powerpc64-unknown-linux-gnu
configure:1879: checking host system type
configure:1894: result: powerpc64-unknown-linux-gnu
configure:1916: checking target system type
configure:1931: result: powerpc64-unknown-linux-gnu
configure:2451: checking for gcc
configure:2467: found /usr/bin/gcc
configure:2478: result: gcc
configure:2716: checking for C compiler version
configure:2723: gcc --version >&5
gcc (GCC) 4.1.1 (Gentoo 4.1.1-r3)
Copyright (C) 2006 Free Software Foundation, Inc.
This is free software; see the source for copying conditions. There is NO
warranty; not even for MERCHANTABILITY or FITNESS FOR A PARTICULAR PURPOSE.
configure:2726: $? = 0
configure:2733: gcc -v >&5
Using built-in specs.
Target: powerpc-unknown-linux-gnu
Configured with: /var/tmp/portage/sys-devel/gcc-4.1.1-r3/work/gcc-4.1.1/configure --prefix=/usr --bindir=/usr/powerpc-unknown-linux-gnu/gcc-bin/4.1.1 --includedir=/usr/lib/gcc/powerpc-unknown-linux-gnu/4.1.1/include --datadir=/usr/share/gcc-data/powerpc-unknown-linux-gnu/4.1.1 --mandir=/usr/share/gcc-data/powerpc-unknown-linux-gnu/4.1.1/man --infodir=/usr/share/gcc-data/powerpc-unknown-linux-gnu/4.1.1/info --with-gxx-include-dir=/usr/lib/gcc/powerpc-unknown-linux-gnu/4.1.1/include/g++-v4 --host=powerpc-unknown-linux-gnu --build=powerpc-unknown-linux-gnu --enable-altivec --enable-nls --without-included-gettext --with-system-zlib --disable-checking --disable-werror --enable-secureplt --disable-libunwind-exceptions --disable-multilib --disable-libmudflap --disable-libssp --disable-libgcj --enable-languages=c,c++,fortran --enable-shared --enable-threads=posix --enable-__cxa_atexit --enable-clocale=gnu
Thread model: posix
gcc version 4.1.1 (Gentoo 4.1.1-r3)
configure:2736: $? = 0
configure:2743: gcc -V >&5
gcc: '-V' option must have argument
configure:2746: $? = 1
configure:2769: checking for C compiler default output file name
configure:2796: gcc conftest.c >&5
configure:2799: $? = 0
configure:2837: result: a.out
configure:2854: checking whether the C compiler works
configure:2864: ./a.out
configure:2867: $? = 0
configure:2884: result: yes
configure:2891: checking whether we are cross compiling
configure:2893: result: no
configure:2896: checking for suffix of executables
configure:2903: gcc -o conftest conftest.c >&5
configure:2906: $? = 0
configure:2930: result:
configure:2936: checking for suffix of object files
configure:2962: gcc -c conftest.c >&5
configure:2965: $? = 0
configure:2988: result: o
configure:2992: checking whether we are using the GNU C compiler
configure:3021: gcc -c conftest.c >&5
configure:3027: $? = 0
configure:3044: result: yes
configure:3049: checking whether gcc accepts -g
configure:3079: gcc -c -g conftest.c >&5
configure:3085: $? = 0
configure:3184: result: yes
configure:3201: checking for gcc option to accept ISO C89
configure:3275: gcc -c -g -O2 conftest.c >&5
configure:3281: $? = 0
configure:3304: result: none needed
configure:3323: checking whether gcc and cc understand -c and -o together
configure:3358: gcc -c conftest.c -o conftest2.o >&5
configure:3361: $? = 0
configure:3367: gcc -c conftest.c -o conftest2.o >&5
configure:3370: $? = 0
configure:3381: cc -c conftest.c >&5
configure:3384: $? = 0
configure:3392: cc -c conftest.c -o conftest2.o >&5
configure:3395: $? = 0
configure:3401: cc -c conftest.c -o conftest2.o >&5
configure:3404: $? = 0
configure:3422: result: yes
configure:3439: checking how to run the C preprocessor
configure:3479: gcc -E conftest.c
configure:3485: $? = 0
configure:3516: gcc -E conftest.c
conftest.c:10:28: error: ac_nonexistent.h: No such file or directory
configure:3522: $? = 1
configure: failed program was:
| /* confdefs.h. */
| #define PACKAGE_NAME "aranym"
| #define PACKAGE_TARNAME "aranym"
| #define PACKAGE_VERSION "0.9"
| #define PACKAGE_STRING "aranym 0.9"
| #define PACKAGE_BUGREPORT "aranym@bobek.sh.cvut.cz"
| #define OS_TYPE "linux"
| #define CPU_TYPE "powerpc"
| /* end confdefs.h. */
| #include <ac_nonexistent.h>
configure:3555: result: gcc -E
configure:3584: gcc -E conftest.c
configure:3590: $? = 0
configure:3621: gcc -E conftest.c
conftest.c:10:28: error: ac_nonexistent.h: No such file or directory
configure:3627: $? = 1
configure: failed program was:
| /* confdefs.h. */
| #define PACKAGE_NAME "aranym"
| #define PACKAGE_TARNAME "aranym"
| #define PACKAGE_VERSION "0.9"
| #define PACKAGE_STRING "aranym 0.9"
| #define PACKAGE_BUGREPORT "aranym@bobek.sh.cvut.cz"
| #define OS_TYPE "linux"
| #define CPU_TYPE "powerpc"
| /* end confdefs.h. */
| #include <ac_nonexistent.h>
configure:3722: checking for g++
configure:3738: found /usr/bin/g++
configure:3749: result: g++
configure:3780: checking for C++ compiler version
configure:3787: g++ --version >&5
g++ (GCC) 4.1.1 (Gentoo 4.1.1-r3)
Copyright (C) 2006 Free Software Foundation, Inc.
This is free software; see the source for copying conditions. There is NO
warranty; not even for MERCHANTABILITY or FITNESS FOR A PARTICULAR PURPOSE.
configure:3790: $? = 0
configure:3797: g++ -v >&5
Using built-in specs.
Target: powerpc-unknown-linux-gnu
Configured with: /var/tmp/portage/sys-devel/gcc-4.1.1-r3/work/gcc-4.1.1/configure --prefix=/usr --bindir=/usr/powerpc-unknown-linux-gnu/gcc-bin/4.1.1 --includedir=/usr/lib/gcc/powerpc-unknown-linux-gnu/4.1.1/include --datadir=/usr/share/gcc-data/powerpc-unknown-linux-gnu/4.1.1 --mandir=/usr/share/gcc-data/powerpc-unknown-linux-gnu/4.1.1/man --infodir=/usr/share/gcc-data/powerpc-unknown-linux-gnu/4.1.1/info --with-gxx-include-dir=/usr/lib/gcc/powerpc-unknown-linux-gnu/4.1.1/include/g++-v4 --host=powerpc-unknown-linux-gnu --build=powerpc-unknown-linux-gnu --enable-altivec --enable-nls --without-included-gettext --with-system-zlib --disable-checking --disable-werror --enable-secureplt --disable-libunwind-exceptions --disable-multilib --disable-libmudflap --disable-libssp --disable-libgcj --enable-languages=c,c++,fortran --enable-shared --enable-threads=posix --enable-__cxa_atexit --enable-clocale=gnu
Thread model: posix
gcc version 4.1.1 (Gentoo 4.1.1-r3)
configure:3800: $? = 0
configure:3807: g++ -V >&5
g++: '-V' option must have argument
configure:3810: $? = 1
configure:3813: checking whether we are using the GNU C++ compiler
configure:3842: g++ -c conftest.cpp >&5
configure:3848: $? = 0
configure:3865: result: yes
configure:3870: checking whether g++ accepts -g
configure:3900: g++ -c -g conftest.cpp >&5
configure:3906: $? = 0
configure:4005: result: yes
configure:4033: checking how to run the C++ preprocessor
configure:4069: g++ -E conftest.cpp
configure:4075: $? = 0
configure:4106: g++ -E conftest.cpp
conftest.cpp:10:28: error: ac_nonexistent.h: No such file or directory
configure:4112: $? = 1
configure: failed program was:
| /* confdefs.h. */
| #define PACKAGE_NAME "aranym"
| #define PACKAGE_TARNAME "aranym"
| #define PACKAGE_VERSION "0.9"
| #define PACKAGE_STRING "aranym 0.9"
| #define PACKAGE_BUGREPORT "aranym@bobek.sh.cvut.cz"
| #define OS_TYPE "linux"
| #define CPU_TYPE "powerpc"
| /* end confdefs.h. */
| #include <ac_nonexistent.h>
configure:4145: result: g++ -E
configure:4174: g++ -E conftest.cpp
configure:4180: $? = 0
configure:4211: g++ -E conftest.cpp
conftest.cpp:10:28: error: ac_nonexistent.h: No such file or directory
configure:4217: $? = 1
configure: failed program was:
| /* confdefs.h. */
| #define PACKAGE_NAME "aranym"
| #define PACKAGE_TARNAME "aranym"
| #define PACKAGE_VERSION "0.9"
| #define PACKAGE_STRING "aranym 0.9"
| #define PACKAGE_BUGREPORT "aranym@bobek.sh.cvut.cz"
| #define OS_TYPE "linux"
| #define CPU_TYPE "powerpc"
| /* end confdefs.h. */
| #include <ac_nonexistent.h>
configure:4254: checking whether make sets $(MAKE)
configure:4275: result: yes
configure:4297: checking for a BSD-compatible install
configure:4353: result: /bin/install -c
configure:4367: checking for grep that handles long lines and -e
configure:4441: result: /bin/grep
configure:4446: checking for egrep
configure:4524: result: /bin/grep -E
configure:4529: checking for ANSI C header files
configure:4559: gcc -c -g -O2 conftest.c >&5
configure:4565: $? = 0
configure:4664: gcc -o conftest -g -O2 conftest.c >&5
configure:4667: $? = 0
configure:4673: ./conftest
configure:4676: $? = 0
configure:4693: result: yes
configure:4711: checking for dirent.h that defines DIR
configure:4740: gcc -c -g -O2 conftest.c >&5
configure:4746: $? = 0
configure:4762: result: yes
configure:4775: checking for library containing opendir
configure:4816: gcc -o conftest -g -O2 conftest.c >&5
configure:4822: $? = 0
configure:4850: result: none required
configure:4958: checking for sys/types.h
configure:4979: gcc -c -g -O2 conftest.c >&5
configure:4985: $? = 0
configure:5001: result: yes
configure:4958: checking for sys/stat.h
configure:4979: gcc -c -g -O2 conftest.c >&5
configure:4985: $? = 0
configure:5001: result: yes
configure:4958: checking for stdlib.h
configure:4979: gcc -c -g -O2 conftest.c >&5
configure:4985: $? = 0
configure:5001: result: yes
configure:4958: checking for string.h
configure:4979: gcc -c -g -O2 conftest.c >&5
configure:4985: $? = 0
configure:5001: result: yes
configure:4958: checking for memory.h
configure:4979: gcc -c -g -O2 conftest.c >&5
configure:4985: $? = 0
configure:5001: result: yes
configure:4958: checking for strings.h
configure:4979: gcc -c -g -O2 conftest.c >&5
configure:4985: $? = 0
configure:5001: result: yes
configure:4958: checking for inttypes.h
configure:4979: gcc -c -g -O2 conftest.c >&5
configure:4985: $? = 0
configure:5001: result: yes
configure:4958: checking for stdint.h
configure:4979: gcc -c -g -O2 conftest.c >&5
configure:4985: $? = 0
configure:5001: result: yes
configure:4958: checking for unistd.h
configure:4979: gcc -c -g -O2 conftest.c >&5
configure:4985: $? = 0
configure:5001: result: yes
configure:5022: checking for unistd.h
configure:5028: result: yes
configure:5032: checking fcntl.h usability
configure:5049: gcc -c -g -O2 conftest.c >&5
configure:5055: $? = 0
configure:5069: result: yes
configure:5073: checking fcntl.h presence
configure:5088: gcc -E conftest.c
configure:5094: $? = 0
configure:5108: result: yes
configure:5141: checking for fcntl.h
configure:5149: result: yes
configure:5032: checking sys/mman.h usability
configure:5049: gcc -c -g -O2 conftest.c >&5
configure:5055: $? = 0
configure:5069: result: yes
configure:5073: checking sys/mman.h presence
configure:5088: gcc -E conftest.c
configure:5094: $? = 0
configure:5108: result: yes
configure:5141: checking for sys/mman.h
configure:5149: result: yes
configure:5032: checking mach/mach.h usability
configure:5049: gcc -c -g -O2 conftest.c >&5
conftest.c:57:23: error: mach/mach.h: No such file or directory
configure:5055: $? = 1
configure: failed program was:
| /* confdefs.h. */
| #define PACKAGE_NAME "aranym"
| #define PACKAGE_TARNAME "aranym"
| #define PACKAGE_VERSION "0.9"
| #define PACKAGE_STRING "aranym 0.9"
| #define PACKAGE_BUGREPORT "aranym@bobek.sh.cvut.cz"
| #define OS_TYPE "linux"
| #define CPU_TYPE "powerpc"
| #define STDC_HEADERS 1
| #define HAVE_DIRENT_H 1
| #define HAVE_SYS_TYPES_H 1
| #define HAVE_SYS_STAT_H 1
| #define HAVE_STDLIB_H 1
| #define HAVE_STRING_H 1
| #define HAVE_MEMORY_H 1
| #define HAVE_STRINGS_H 1
| #define HAVE_INTTYPES_H 1
| #define HAVE_STDINT_H 1
| #define HAVE_UNISTD_H 1
| #define HAVE_UNISTD_H 1
| #define HAVE_FCNTL_H 1
| #define HAVE_SYS_MMAN_H 1
| /* end confdefs.h. */
| #include <stdio.h>
| #ifdef HAVE_SYS_TYPES_H
| # include <sys/types.h>
| #endif
| #ifdef HAVE_SYS_STAT_H
| # include <sys/stat.h>
| #endif
| #ifdef STDC_HEADERS
| # include <stdlib.h>
| # include <stddef.h>
| #else
| # ifdef HAVE_STDLIB_H
| # include <stdlib.h>
| # endif
| #endif
| #ifdef HAVE_STRING_H
| # if !defined STDC_HEADERS && defined HAVE_MEMORY_H
| # include <memory.h>
| # endif
| # include <string.h>
| #endif
| #ifdef HAVE_STRINGS_H
| # include <strings.h>
| #endif
| #ifdef HAVE_INTTYPES_H
| # include <inttypes.h>
| #endif
| #ifdef HAVE_STDINT_H
| # include <stdint.h>
| #endif
| #ifdef HAVE_UNISTD_H
| # include <unistd.h>
| #endif
| #include <mach/mach.h>
configure:5069: result: no
configure:5073: checking mach/mach.h presence
configure:5088: gcc -E conftest.c
conftest.c:24:23: error: mach/mach.h: No such file or directory
configure:5094: $? = 1
configure: failed program was:
| /* confdefs.h. */
| #define PACKAGE_NAME "aranym"
| #define PACKAGE_TARNAME "aranym"
| #define PACKAGE_VERSION "0.9"
| #define PACKAGE_STRING "aranym 0.9"
| #define PACKAGE_BUGREPORT "aranym@bobek.sh.cvut.cz"
| #define OS_TYPE "linux"
| #define CPU_TYPE "powerpc"
| #define STDC_HEADERS 1
| #define HAVE_DIRENT_H 1
| #define HAVE_SYS_TYPES_H 1
| #define HAVE_SYS_STAT_H 1
| #define HAVE_STDLIB_H 1
| #define HAVE_STRING_H 1
| #define HAVE_MEMORY_H 1
| #define HAVE_STRINGS_H 1
| #define HAVE_INTTYPES_H 1
| #define HAVE_STDINT_H 1
| #define HAVE_UNISTD_H 1
| #define HAVE_UNISTD_H 1
| #define HAVE_FCNTL_H 1
| #define HAVE_SYS_MMAN_H 1
| /* end confdefs.h. */
| #include <mach/mach.h>
configure:5108: result: no
configure:5141: checking for mach/mach.h
configure:5149: result: no
configure:5032: checking sys/ioctl.h usability
configure:5049: gcc -c -g -O2 conftest.c >&5
configure:5055: $? = 0
configure:5069: result: yes
configure:5073: checking sys/ioctl.h presence
configure:5088: gcc -E conftest.c
configure:5094: $? = 0
configure:5108: result: yes
configure:5141: checking for sys/ioctl.h
configure:5149: result: yes
configure:5177: checking getopt.h usability
configure:5194: gcc -c -g -O2 conftest.c >&5
configure:5200: $? = 0
configure:5214: result: yes
configure:5218: checking getopt.h presence
configure:5233: gcc -E conftest.c
configure:5239: $? = 0
configure:5253: result: yes
configure:5286: checking for getopt.h
configure:5294: result: yes
configure:5326: checking termios.h usability
configure:5343: gcc -c -g -O2 conftest.c >&5
configure:5349: $? = 0
configure:5363: result: yes
configure:5367: checking termios.h presence
configure:5382: gcc -E conftest.c
configure:5388: $? = 0
configure:5402: result: yes
configure:5435: checking for termios.h
configure:5443: result: yes
configure:5326: checking termio.h usability
configure:5343: gcc -c -g -O2 conftest.c >&5
configure:5349: $? = 0
configure:5363: result: yes
configure:5367: checking termio.h presence
configure:5382: gcc -E conftest.c
configure:5388: $? = 0
configure:5402: result: yes
configure:5435: checking for termio.h
configure:5443: result: yes
configure:5326: checking alloca.h usability
configure:5343: gcc -c -g -O2 conftest.c >&5
configure:5349: $? = 0
configure:5363: result: yes
configure:5367: checking alloca.h presence
configure:5382: gcc -E conftest.c
configure:5388: $? = 0
configure:5402: result: yes
configure:5435: checking for alloca.h
configure:5443: result: yes
configure:5326: checking sys/statfs.h usability
configure:5343: gcc -c -g -O2 conftest.c >&5
configure:5349: $? = 0
configure:5363: result: yes
configure:5367: checking sys/statfs.h presence
configure:5382: gcc -E conftest.c
configure:5388: $? = 0
configure:5402: result: yes
configure:5435: checking for sys/statfs.h
configure:5443: result: yes
configure:5326: checking sys/statvfs.h usability
configure:5343: gcc -c -g -O2 conftest.c >&5
configure:5349: $? = 0
configure:5363: result: yes
configure:5367: checking sys/statvfs.h presence
configure:5382: gcc -E conftest.c
configure:5388: $? = 0
configure:5402: result: yes
configure:5435: checking for sys/statvfs.h
configure:5443: result: yes
configure:5465: checking for sys/types.h
configure:5471: result: yes
configure:5465: checking for sys/stat.h
configure:5471: result: yes
configure:5475: checking sys/vfs.h usability
configure:5492: gcc -c -g -O2 conftest.c >&5
configure:5498: $? = 0
configure:5512: result: yes
configure:5516: checking sys/vfs.h presence
configure:5531: gcc -E conftest.c
configure:5537: $? = 0
configure:5551: result: yes
configure:5584: checking for sys/vfs.h
configure:5592: result: yes
configure:5475: checking utime.h usability
configure:5492: gcc -c -g -O2 conftest.c >&5
configure:5498: $? = 0
configure:5512: result: yes
configure:5516: checking utime.h presence
configure:5531: gcc -E conftest.c
configure:5537: $? = 0
configure:5551: result: yes
configure:5584: checking for utime.h
configure:5592: result: yes
configure:5475: checking sys/param.h usability
configure:5492: gcc -c -g -O2 conftest.c >&5
configure:5498: $? = 0
configure:5512: result: yes
configure:5516: checking sys/param.h presence
configure:5531: gcc -E conftest.c
configure:5537: $? = 0
configure:5551: result: yes
configure:5584: checking for sys/param.h
configure:5592: result: yes
configure:5622: checking sys/mount.h usability
configure:5639: gcc -c -g -O2 conftest.c >&5
configure:5645: $? = 0
configure:5659: result: yes
configure:5663: checking sys/mount.h presence
configure:5678: gcc -E conftest.c
configure:5684: $? = 0
configure:5698: result: yes
configure:5731: checking for sys/mount.h
configure:5739: result: yes
configure:5622: checking types.h usability
configure:5639: gcc -c -g -O2 conftest.c >&5
conftest.c:70:19: error: types.h: No such file or directory
configure:5645: $? = 1
configure: failed program was:
| /* confdefs.h. */
| #define PACKAGE_NAME "aranym"
| #define PACKAGE_TARNAME "aranym"
| #define PACKAGE_VERSION "0.9"
| #define PACKAGE_STRING "aranym 0.9"
| #define PACKAGE_BUGREPORT "aranym@bobek.sh.cvut.cz"
| #define OS_TYPE "linux"
| #define CPU_TYPE "powerpc"
| #define STDC_HEADERS 1
| #define HAVE_DIRENT_H 1
| #define HAVE_SYS_TYPES_H 1
| #define HAVE_SYS_STAT_H 1
| #define HAVE_STDLIB_H 1
| #define HAVE_STRING_H 1
| #define HAVE_MEMORY_H 1
| #define HAVE_STRINGS_H 1
| #define HAVE_INTTYPES_H 1
| #define HAVE_STDINT_H 1
| #define HAVE_UNISTD_H 1
| #define HAVE_UNISTD_H 1
| #define HAVE_FCNTL_H 1
| #define HAVE_SYS_MMAN_H 1
| #define HAVE_SYS_IOCTL_H 1
| #define HAVE_GETOPT_H 1
| #define HAVE_TERMIOS_H 1
| #define HAVE_TERMIO_H 1
| #define HAVE_ALLOCA_H 1
| #define HAVE_SYS_STATFS_H 1
| #define HAVE_SYS_STATVFS_H 1
| #define HAVE_SYS_TYPES_H 1
| #define HAVE_SYS_STAT_H 1
| #define HAVE_SYS_VFS_H 1
| #define HAVE_UTIME_H 1
| #define HAVE_SYS_PARAM_H 1
| #define HAVE_SYS_MOUNT_H 1
| /* end confdefs.h. */
| #include <stdio.h>
| #ifdef HAVE_SYS_TYPES_H
| # include <sys/types.h>
| #endif
| #ifdef HAVE_SYS_STAT_H
| # include <sys/stat.h>
| #endif
| #ifdef STDC_HEADERS
| # include <stdlib.h>
| # include <stddef.h>
| #else
| # ifdef HAVE_STDLIB_H
| # include <stdlib.h>
| # endif
| #endif
| #ifdef HAVE_STRING_H
| # if !defined STDC_HEADERS && defined HAVE_MEMORY_H
| # include <memory.h>
| # endif
| # include <string.h>
| #endif
| #ifdef HAVE_STRINGS_H
| # include <strings.h>
| #endif
| #ifdef HAVE_INTTYPES_H
| # include <inttypes.h>
| #endif
| #ifdef HAVE_STDINT_H
| # include <stdint.h>
| #endif
| #ifdef HAVE_UNISTD_H
| # include <unistd.h>
| #endif
| #include <types.h>
configure:5659: result: no
configure:5663: checking types.h presence
configure:5678: gcc -E conftest.c
conftest.c:37:19: error: types.h: No such file or directory
configure:5684: $? = 1
configure: failed program was:
| /* confdefs.h. */
| #define PACKAGE_NAME "aranym"
| #define PACKAGE_TARNAME "aranym"
| #define PACKAGE_VERSION "0.9"
| #define PACKAGE_STRING "aranym 0.9"
| #define PACKAGE_BUGREPORT "aranym@bobek.sh.cvut.cz"
| #define OS_TYPE "linux"
| #define CPU_TYPE "powerpc"
| #define STDC_HEADERS 1
| #define HAVE_DIRENT_H 1
| #define HAVE_SYS_TYPES_H 1
| #define HAVE_SYS_STAT_H 1
| #define HAVE_STDLIB_H 1
| #define HAVE_STRING_H 1
| #define HAVE_MEMORY_H 1
| #define HAVE_STRINGS_H 1
| #define HAVE_INTTYPES_H 1
| #define HAVE_STDINT_H 1
| #define HAVE_UNISTD_H 1
| #define HAVE_UNISTD_H 1
| #define HAVE_FCNTL_H 1
| #define HAVE_SYS_MMAN_H 1
| #define HAVE_SYS_IOCTL_H 1
| #define HAVE_GETOPT_H 1
| #define HAVE_TERMIOS_H 1
| #define HAVE_TERMIO_H 1
| #define HAVE_ALLOCA_H 1
| #define HAVE_SYS_STATFS_H 1
| #define HAVE_SYS_STATVFS_H 1
| #define HAVE_SYS_TYPES_H 1
| #define HAVE_SYS_STAT_H 1
| #define HAVE_SYS_VFS_H 1
| #define HAVE_UTIME_H 1
| #define HAVE_SYS_PARAM_H 1
| #define HAVE_SYS_MOUNT_H 1
| /* end confdefs.h. */
| #include <types.h>
configure:5698: result: no
configure:5731: checking for types.h
configure:5739: result: no
configure:5622: checking stat.h usability
configure:5639: gcc -c -g -O2 conftest.c >&5
conftest.c:70:18: error: stat.h: No such file or directory
configure:5645: $? = 1
configure: failed program was:
| /* confdefs.h. */
| #define PACKAGE_NAME "aranym"
| #define PACKAGE_TARNAME "aranym"
| #define PACKAGE_VERSION "0.9"
| #define PACKAGE_STRING "aranym 0.9"
| #define PACKAGE_BUGREPORT "aranym@bobek.sh.cvut.cz"
| #define OS_TYPE "linux"
| #define CPU_TYPE "powerpc"
| #define STDC_HEADERS 1
| #define HAVE_DIRENT_H 1
| #define HAVE_SYS_TYPES_H 1
| #define HAVE_SYS_STAT_H 1
| #define HAVE_STDLIB_H 1
| #define HAVE_STRING_H 1
| #define HAVE_MEMORY_H 1
| #define HAVE_STRINGS_H 1
| #define HAVE_INTTYPES_H 1
| #define HAVE_STDINT_H 1
| #define HAVE_UNISTD_H 1
| #define HAVE_UNISTD_H 1
| #define HAVE_FCNTL_H 1
| #define HAVE_SYS_MMAN_H 1
| #define HAVE_SYS_IOCTL_H 1
| #define HAVE_GETOPT_H 1
| #define HAVE_TERMIOS_H 1
| #define HAVE_TERMIO_H 1
| #define HAVE_ALLOCA_H 1
| #define HAVE_SYS_STATFS_H 1
| #define HAVE_SYS_STATVFS_H 1
| #define HAVE_SYS_TYPES_H 1
| #define HAVE_SYS_STAT_H 1
| #define HAVE_SYS_VFS_H 1
| #define HAVE_UTIME_H 1
| #define HAVE_SYS_PARAM_H 1
| #define HAVE_SYS_MOUNT_H 1
| /* end confdefs.h. */
| #include <stdio.h>
| #ifdef HAVE_SYS_TYPES_H
| # include <sys/types.h>
| #endif
| #ifdef HAVE_SYS_STAT_H
| # include <sys/stat.h>
| #endif
| #ifdef STDC_HEADERS
| # include <stdlib.h>
| # include <stddef.h>
| #else
| # ifdef HAVE_STDLIB_H
| # include <stdlib.h>
| # endif
| #endif
| #ifdef HAVE_STRING_H
| # if !defined STDC_HEADERS && defined HAVE_MEMORY_H
| # include <memory.h>
| # endif
| # include <string.h>
| #endif
| #ifdef HAVE_STRINGS_H
| # include <strings.h>
| #endif
| #ifdef HAVE_INTTYPES_H
| # include <inttypes.h>
| #endif
| #ifdef HAVE_STDINT_H
| # include <stdint.h>
| #endif
| #ifdef HAVE_UNISTD_H
| # include <unistd.h>
| #endif
| #include <stat.h>
configure:5659: result: no
configure:5663: checking stat.h presence
configure:5678: gcc -E conftest.c
conftest.c:37:18: error: stat.h: No such file or directory
configure:5684: $? = 1
configure: failed program was:
| /* confdefs.h. */
| #define PACKAGE_NAME "aranym"
| #define PACKAGE_TARNAME "aranym"
| #define PACKAGE_VERSION "0.9"
| #define PACKAGE_STRING "aranym 0.9"
| #define PACKAGE_BUGREPORT "aranym@bobek.sh.cvut.cz"
| #define OS_TYPE "linux"
| #define CPU_TYPE "powerpc"
| #define STDC_HEADERS 1
| #define HAVE_DIRENT_H 1
| #define HAVE_SYS_TYPES_H 1
| #define HAVE_SYS_STAT_H 1
| #define HAVE_STDLIB_H 1
| #define HAVE_STRING_H 1
| #define HAVE_MEMORY_H 1
| #define HAVE_STRINGS_H 1
| #define HAVE_INTTYPES_H 1
| #define HAVE_STDINT_H 1
| #define HAVE_UNISTD_H 1
| #define HAVE_UNISTD_H 1
| #define HAVE_FCNTL_H 1
| #define HAVE_SYS_MMAN_H 1
| #define HAVE_SYS_IOCTL_H 1
| #define HAVE_GETOPT_H 1
| #define HAVE_TERMIOS_H 1
| #define HAVE_TERMIO_H 1
| #define HAVE_ALLOCA_H 1
| #define HAVE_SYS_STATFS_H 1
| #define HAVE_SYS_STATVFS_H 1
| #define HAVE_SYS_TYPES_H 1
| #define HAVE_SYS_STAT_H 1
| #define HAVE_SYS_VFS_H 1
| #define HAVE_UTIME_H 1
| #define HAVE_SYS_PARAM_H 1
| #define HAVE_SYS_MOUNT_H 1
| /* end confdefs.h. */
| #include <stat.h>
configure:5698: result: no
configure:5731: checking for stat.h
configure:5739: result: no
configure:5767: checking sys/socket.h usability
configure:5784: gcc -c -g -O2 conftest.c >&5
configure:5790: $? = 0
configure:5804: result: yes
configure:5808: checking sys/socket.h presence
configure:5823: gcc -E conftest.c
configure:5829: $? = 0
configure:5843: result: yes
configure:5876: checking for sys/socket.h
configure:5884: result: yes
configure:5904: checking for linux/if.h
configure:5929: gcc -c -g -O2 conftest.c >&5
configure:5935: $? = 0
configure:5951: result: yes
configure:5904: checking for linux/if_tun.h
configure:5929: gcc -c -g -O2 conftest.c >&5
configure:5935: $? = 0
configure:5951: result: yes
configure:5904: checking for net/if.h
configure:5929: gcc -c -g -O2 conftest.c >&5
configure:5935: $? = 0
configure:5951: result: yes
configure:5904: checking for net/if_tun.h
configure:5929: gcc -c -g -O2 conftest.c >&5
conftest.c:47:24: error: net/if_tun.h: No such file or directory
configure:5935: $? = 1
configure: failed program was:
| /* confdefs.h. */
| #define PACKAGE_NAME "aranym"
| #define PACKAGE_TARNAME "aranym"
| #define PACKAGE_VERSION "0.9"
| #define PACKAGE_STRING "aranym 0.9"
| #define PACKAGE_BUGREPORT "aranym@bobek.sh.cvut.cz"
| #define OS_TYPE "linux"
| #define CPU_TYPE "powerpc"
| #define STDC_HEADERS 1
| #define HAVE_DIRENT_H 1
| #define HAVE_SYS_TYPES_H 1
| #define HAVE_SYS_STAT_H 1
| #define HAVE_STDLIB_H 1
| #define HAVE_STRING_H 1
| #define HAVE_MEMORY_H 1
| #define HAVE_STRINGS_H 1
| #define HAVE_INTTYPES_H 1
| #define HAVE_STDINT_H 1
| #define HAVE_UNISTD_H 1
| #define HAVE_UNISTD_H 1
| #define HAVE_FCNTL_H 1
| #define HAVE_SYS_MMAN_H 1
| #define HAVE_SYS_IOCTL_H 1
| #define HAVE_GETOPT_H 1
| #define HAVE_TERMIOS_H 1
| #define HAVE_TERMIO_H 1
| #define HAVE_ALLOCA_H 1
| #define HAVE_SYS_STATFS_H 1
| #define HAVE_SYS_STATVFS_H 1
| #define HAVE_SYS_TYPES_H 1
| #define HAVE_SYS_STAT_H 1
| #define HAVE_SYS_VFS_H 1
| #define HAVE_UTIME_H 1
| #define HAVE_SYS_PARAM_H 1
| #define HAVE_SYS_MOUNT_H 1
| #define HAVE_SYS_SOCKET_H 1
| #define HAVE_LINUX_IF_H 1
| #define HAVE_LINUX_IF_TUN_H 1
| #define HAVE_NET_IF_H 1
| /* end confdefs.h. */
|
| #ifdef HAVE_SYS_SOCKET_H
| #include <sys/socket.h>
| #endif
|
|
| #include <net/if_tun.h>
configure:5951: result: no
configure:5963: checking whether byte ordering is bigendian
configure:5996: gcc -c -g -O2 conftest.c >&5
configure:6002: $? = 0
configure:6034: gcc -c -g -O2 conftest.c >&5
configure:6040: $? = 0
configure:6180: result: yes
configure:6199: checking for an ANSI C-conforming const
configure:6274: gcc -c -g -O2 conftest.c >&5
configure:6280: $? = 0
configure:6295: result: yes
configure:6305: checking for inline
configure:6331: gcc -c -g -O2 conftest.c >&5
configure:6337: $? = 0
configure:6355: result: inline
configure:6374: checking for working volatile
configure:6403: gcc -c -g -O2 conftest.c >&5
configure:6409: $? = 0
configure:6424: result: yes
configure:6434: checking for short
configure:6464: gcc -c -g -O2 conftest.c >&5
configure:6470: $? = 0
configure:6485: result: yes
configure:6492: checking size of short
configure:6794: gcc -o conftest -g -O2 conftest.c >&5
configure:6797: $? = 0
configure:6803: ./conftest
configure:6806: $? = 0
configure:6829: result: 2
configure:6839: checking for int
configure:6869: gcc -c -g -O2 conftest.c >&5
configure:6875: $? = 0
configure:6890: result: yes
configure:6897: checking size of int
configure:7199: gcc -o conftest -g -O2 conftest.c >&5
configure:7202: $? = 0
configure:7208: ./conftest
configure:7211: $? = 0
configure:7234: result: 4
configure:7244: checking for long
configure:7274: gcc -c -g -O2 conftest.c >&5
configure:7280: $? = 0
configure:7295: result: yes
configure:7302: checking size of long
configure:7604: gcc -o conftest -g -O2 conftest.c >&5
configure:7607: $? = 0
configure:7613: ./conftest
configure:7616: $? = 0
configure:7639: result: 4
configure:7649: checking for long long
configure:7679: gcc -c -g -O2 conftest.c >&5
configure:7685: $? = 0
configure:7700: result: yes
configure:7707: checking size of long long
configure:8009: gcc -o conftest -g -O2 conftest.c >&5
configure:8012: $? = 0
configure:8018: ./conftest
configure:8021: $? = 0
configure:8044: result: 8
configure:8054: checking for float
configure:8084: gcc -c -g -O2 conftest.c >&5
configure:8090: $? = 0
configure:8105: result: yes
configure:8112: checking size of float
configure:8414: gcc -o conftest -g -O2 conftest.c >&5
configure:8417: $? = 0
configure:8423: ./conftest
configure:8426: $? = 0
configure:8449: result: 4
configure:8459: checking for double
configure:8489: gcc -c -g -O2 conftest.c >&5
configure:8495: $? = 0
configure:8510: result: yes
configure:8517: checking size of double
configure:8819: gcc -o conftest -g -O2 conftest.c >&5
configure:8822: $? = 0
configure:8828: ./conftest
configure:8831: $? = 0
configure:8854: result: 8
configure:8864: checking for long double
configure:8894: gcc -c -g -O2 conftest.c >&5
configure:8900: $? = 0
configure:8915: result: yes
configure:8922: checking size of long double
configure:9224: gcc -o conftest -g -O2 conftest.c >&5
configure:9227: $? = 0
configure:9233: ./conftest
configure:9236: $? = 0
configure:9259: result: 8
configure:9269: checking for void *
configure:9299: gcc -c -g -O2 conftest.c >&5
configure:9305: $? = 0
configure:9320: result: yes
configure:9327: checking size of void *
configure:9629: gcc -o conftest -g -O2 conftest.c >&5
configure:9632: $? = 0
configure:9638: ./conftest
configure:9641: $? = 0
configure:9664: result: 4
configure:9674: checking for off_t
configure:9704: gcc -c -g -O2 conftest.c >&5
configure:9710: $? = 0
configure:9725: result: yes
configure:9737: checking for loff_t
configure:9767: gcc -c -g -O2 conftest.c >&5
configure:9773: $? = 0
configure:9788: result: yes
configure:9800: checking for size_t
configure:9830: gcc -c -g -O2 conftest.c >&5
configure:9836: $? = 0
configure:9851: result: yes
configure:9863: checking for ssize_t
configure:9893: gcc -c -g -O2 conftest.c >&5
configure:9899: $? = 0
configure:9914: result: yes
configure:9926: checking return type of signal handlers
configure:9954: gcc -c -g -O2 conftest.c >&5
conftest.c: In function 'main':
conftest.c:56: error: void value not ignored as it ought to be
configure:9960: $? = 1
configure: failed program was:
| /* confdefs.h. */
| #define PACKAGE_NAME "aranym"
| #define PACKAGE_TARNAME "aranym"
| #define PACKAGE_VERSION "0.9"
| #define PACKAGE_STRING "aranym 0.9"
| #define PACKAGE_BUGREPORT "aranym@bobek.sh.cvut.cz"
| #define OS_TYPE "linux"
| #define CPU_TYPE "powerpc"
| #define STDC_HEADERS 1
| #define HAVE_DIRENT_H 1
| #define HAVE_SYS_TYPES_H 1
| #define HAVE_SYS_STAT_H 1
| #define HAVE_STDLIB_H 1
| #define HAVE_STRING_H 1
| #define HAVE_MEMORY_H 1
| #define HAVE_STRINGS_H 1
| #define HAVE_INTTYPES_H 1
| #define HAVE_STDINT_H 1
| #define HAVE_UNISTD_H 1
| #define HAVE_UNISTD_H 1
| #define HAVE_FCNTL_H 1
| #define HAVE_SYS_MMAN_H 1
| #define HAVE_SYS_IOCTL_H 1
| #define HAVE_GETOPT_H 1
| #define HAVE_TERMIOS_H 1
| #define HAVE_TERMIO_H 1
| #define HAVE_ALLOCA_H 1
| #define HAVE_SYS_STATFS_H 1
| #define HAVE_SYS_STATVFS_H 1
| #define HAVE_SYS_TYPES_H 1
| #define HAVE_SYS_STAT_H 1
| #define HAVE_SYS_VFS_H 1
| #define HAVE_UTIME_H 1
| #define HAVE_SYS_PARAM_H 1
| #define HAVE_SYS_MOUNT_H 1
| #define HAVE_SYS_SOCKET_H 1
| #define HAVE_LINUX_IF_H 1
| #define HAVE_LINUX_IF_TUN_H 1
| #define HAVE_NET_IF_H 1
| #define WORDS_BIGENDIAN 1
| #define SIZEOF_SHORT 2
| #define SIZEOF_INT 4
| #define SIZEOF_LONG 4
| #define SIZEOF_LONG_LONG 8
| #define SIZEOF_FLOAT 4
| #define SIZEOF_DOUBLE 8
| #define SIZEOF_LONG_DOUBLE 8
| #define SIZEOF_VOID_P 4
| /* end confdefs.h. */
| #include <sys/types.h>
| #include <signal.h>
|
| int
| main ()
| {
| return *(signal (0, 0)) (0) == 1;
| ;
| return 0;
| }
configure:9975: result: void
configure:9983: checking whether time.h and sys/time.h may both be included
configure:10013: gcc -c -g -O2 conftest.c >&5
configure:10019: $? = 0
configure:10034: result: yes
configure:10044: checking whether struct tm is in sys/time.h or time.h
configure:10074: gcc -c -g -O2 conftest.c >&5
configure:10080: $? = 0
configure:10095: result: time.h
configure:10112: checking for special C compiler options needed for large files
configure:10205: result: no
configure:10211: checking for _FILE_OFFSET_BITS value needed for large files
configure:10246: gcc -c -g -O2 conftest.c >&5
conftest.c:58: warning: left shift count >= width of type
conftest.c:58: warning: left shift count >= width of type
conftest.c:60: error: size of array 'off_t_is_large' is negative
configure:10252: $? = 1
configure: failed program was:
| /* confdefs.h. */
| #define PACKAGE_NAME "aranym"
| #define PACKAGE_TARNAME "aranym"
| #define PACKAGE_VERSION "0.9"
| #define PACKAGE_STRING "aranym 0.9"
| #define PACKAGE_BUGREPORT "aranym@bobek.sh.cvut.cz"
| #define OS_TYPE "linux"
| #define CPU_TYPE "powerpc"
| #define STDC_HEADERS 1
| #define HAVE_DIRENT_H 1
| #define HAVE_SYS_TYPES_H 1
| #define HAVE_SYS_STAT_H 1
| #define HAVE_STDLIB_H 1
| #define HAVE_STRING_H 1
| #define HAVE_MEMORY_H 1
| #define HAVE_STRINGS_H 1
| #define HAVE_INTTYPES_H 1
| #define HAVE_STDINT_H 1
| #define HAVE_UNISTD_H 1
| #define HAVE_UNISTD_H 1
| #define HAVE_FCNTL_H 1
| #define HAVE_SYS_MMAN_H 1
| #define HAVE_SYS_IOCTL_H 1
| #define HAVE_GETOPT_H 1
| #define HAVE_TERMIOS_H 1
| #define HAVE_TERMIO_H 1
| #define HAVE_ALLOCA_H 1
| #define HAVE_SYS_STATFS_H 1
| #define HAVE_SYS_STATVFS_H 1
| #define HAVE_SYS_TYPES_H 1
| #define HAVE_SYS_STAT_H 1
| #define HAVE_SYS_VFS_H 1
| #define HAVE_UTIME_H 1
| #define HAVE_SYS_PARAM_H 1
| #define HAVE_SYS_MOUNT_H 1
| #define HAVE_SYS_SOCKET_H 1
| #define HAVE_LINUX_IF_H 1
| #define HAVE_LINUX_IF_TUN_H 1
| #define HAVE_NET_IF_H 1
| #define WORDS_BIGENDIAN 1
| #define SIZEOF_SHORT 2
| #define SIZEOF_INT 4
| #define SIZEOF_LONG 4
| #define SIZEOF_LONG_LONG 8
| #define SIZEOF_FLOAT 4
| #define SIZEOF_DOUBLE 8
| #define SIZEOF_LONG_DOUBLE 8
| #define SIZEOF_VOID_P 4
| #define RETSIGTYPE void
| #define TIME_WITH_SYS_TIME 1
| /* end confdefs.h. */
| #include <sys/types.h>
| /* Check that off_t can represent 2**63 - 1 correctly.
| We can't simply define LARGE_OFF_T to be 9223372036854775807,
| since some C++ compilers masquerading as C compilers
| incorrectly reject 9223372036854775807. */
| #define LARGE_OFF_T (((off_t) 1 << 62) - 1 + ((off_t) 1 << 62))
| int off_t_is_large[(LARGE_OFF_T % 2147483629 == 721
| && LARGE_OFF_T % 2147483647 == 1)
| ? 1 : -1];
| int
| main ()
| {
|
| ;
| return 0;
| }
configure:10296: gcc -c -g -O2 conftest.c >&5
configure:10302: $? = 0
configure:10320: result: 64
configure:10457: checking whether the compiler recognizes bool as a built-in type
configure:10494: g++ -c -g -O2 conftest.cpp >&5
configure:10500: $? = 0
configure:10522: result: yes
configure:10534: checking for sin in -lm
configure:10569: gcc -o conftest -g -O2 conftest.c -lm >&5
conftest.c:61: warning: conflicting types for built-in function 'sin'
configure:10575: $? = 0
configure:10593: result: yes
configure:10609: checking for strdup
configure:10665: gcc -o conftest -g -O2 conftest.c -lm >&5
conftest.c:78: warning: conflicting types for built-in function 'strdup'
configure:10671: $? = 0
configure:10689: result: yes
configure:10704: checking for sigaction
configure:10760: gcc -o conftest -g -O2 conftest.c -lm >&5
configure:10766: $? = 0
configure:10784: result: yes
configure:10704: checking for signal
configure:10760: gcc -o conftest -g -O2 conftest.c -lm >&5
configure:10766: $? = 0
configure:10784: result: yes
configure:10800: checking for mmap
configure:10856: gcc -o conftest -g -O2 conftest.c -lm >&5
configure:10862: $? = 0
configure:10880: result: yes
configure:10800: checking for mprotect
configure:10856: gcc -o conftest -g -O2 conftest.c -lm >&5
configure:10862: $? = 0
configure:10880: result: yes
configure:10800: checking for munmap
configure:10856: gcc -o conftest -g -O2 conftest.c -lm >&5
configure:10862: $? = 0
configure:10880: result: yes
configure:10896: checking for vm_allocate
configure:10952: gcc -o conftest -g -O2 conftest.c -lm >&5
/tmp/cc088zk1.o: In function `main':
/mnt/usbdrive/aranym/src/Unix/conftest.c:95: undefined reference to `vm_allocate'
collect2: ld returned 1 exit status
configure:10958: $? = 1
configure: failed program was:
| /* confdefs.h. */
| #define PACKAGE_NAME "aranym"
| #define PACKAGE_TARNAME "aranym"
| #define PACKAGE_VERSION "0.9"
| #define PACKAGE_STRING "aranym 0.9"
| #define PACKAGE_BUGREPORT "aranym@bobek.sh.cvut.cz"
| #define OS_TYPE "linux"
| #define CPU_TYPE "powerpc"
| #define STDC_HEADERS 1
| #define HAVE_DIRENT_H 1
| #define HAVE_SYS_TYPES_H 1
| #define HAVE_SYS_STAT_H 1
| #define HAVE_STDLIB_H 1
| #define HAVE_STRING_H 1
| #define HAVE_MEMORY_H 1
| #define HAVE_STRINGS_H 1
| #define HAVE_INTTYPES_H 1
| #define HAVE_STDINT_H 1
| #define HAVE_UNISTD_H 1
| #define HAVE_UNISTD_H 1
| #define HAVE_FCNTL_H 1
| #define HAVE_SYS_MMAN_H 1
| #define HAVE_SYS_IOCTL_H 1
| #define HAVE_GETOPT_H 1
| #define HAVE_TERMIOS_H 1
| #define HAVE_TERMIO_H 1
| #define HAVE_ALLOCA_H 1
| #define HAVE_SYS_STATFS_H 1
| #define HAVE_SYS_STATVFS_H 1
| #define HAVE_SYS_TYPES_H 1
| #define HAVE_SYS_STAT_H 1
| #define HAVE_SYS_VFS_H 1
| #define HAVE_UTIME_H 1
| #define HAVE_SYS_PARAM_H 1
| #define HAVE_SYS_MOUNT_H 1
| #define HAVE_SYS_SOCKET_H 1
| #define HAVE_LINUX_IF_H 1
| #define HAVE_LINUX_IF_TUN_H 1
| #define HAVE_NET_IF_H 1
| #define WORDS_BIGENDIAN 1
| #define SIZEOF_SHORT 2
| #define SIZEOF_INT 4
| #define SIZEOF_LONG 4
| #define SIZEOF_LONG_LONG 8
| #define SIZEOF_FLOAT 4
| #define SIZEOF_DOUBLE 8
| #define SIZEOF_LONG_DOUBLE 8
| #define SIZEOF_VOID_P 4
| #define RETSIGTYPE void
| #define TIME_WITH_SYS_TIME 1
| #define _FILE_OFFSET_BITS 64
| #define HAVE_BOOL
| #define HAVE_LIBM 1
| #define HAVE_STRDUP 1
| #define HAVE_SIGACTION 1
| #define HAVE_SIGNAL 1
| #define HAVE_MMAP 1
| #define HAVE_MPROTECT 1
| #define HAVE_MUNMAP 1
| /* end confdefs.h. */
| /* Define vm_allocate to an innocuous variant, in case <limits.h> declares vm_allocate.
| For example, HP-UX 11i <limits.h> declares gettimeofday. */
| #define vm_allocate innocuous_vm_allocate
|
| /* System header to define __stub macros and hopefully few prototypes,
| which can conflict with char vm_allocate (); below.
| Prefer <limits.h> to <assert.h> if __STDC__ is defined, since
| <limits.h> exists even on freestanding compilers. */
|
| #ifdef __STDC__
| # include <limits.h>
| #else
| # include <assert.h>
| #endif
|
| #undef vm_allocate
|
| /* Override any GCC internal prototype to avoid an error.
| Use char because int might match the return type of a GCC
| builtin and then its argument prototype would still apply. */
| #ifdef __cplusplus
| extern "C"
| #endif
| char vm_allocate ();
| /* The GNU C library defines this for functions which it implements
| to always fail with ENOSYS. Some functions are actually named
| something starting with __ and the normal name is an alias. */
| #if defined __stub_vm_allocate || defined __stub___vm_allocate
| choke me
| #endif
|
| int
| main ()
| {
| return vm_allocate ();
| ;
| return 0;
| }
configure:10976: result: no
configure:10896: checking for vm_deallocate
configure:10952: gcc -o conftest -g -O2 conftest.c -lm >&5
/tmp/ccqGeKFf.o: In function `main':
/mnt/usbdrive/aranym/src/Unix/conftest.c:95: undefined reference to `vm_deallocate'
collect2: ld returned 1 exit status
configure:10958: $? = 1
configure: failed program was:
| /* confdefs.h. */
| #define PACKAGE_NAME "aranym"
| #define PACKAGE_TARNAME "aranym"
| #define PACKAGE_VERSION "0.9"
| #define PACKAGE_STRING "aranym 0.9"
| #define PACKAGE_BUGREPORT "aranym@bobek.sh.cvut.cz"
| #define OS_TYPE "linux"
| #define CPU_TYPE "powerpc"
| #define STDC_HEADERS 1
| #define HAVE_DIRENT_H 1
| #define HAVE_SYS_TYPES_H 1
| #define HAVE_SYS_STAT_H 1
| #define HAVE_STDLIB_H 1
| #define HAVE_STRING_H 1
| #define HAVE_MEMORY_H 1
| #define HAVE_STRINGS_H 1
| #define HAVE_INTTYPES_H 1
| #define HAVE_STDINT_H 1
| #define HAVE_UNISTD_H 1
| #define HAVE_UNISTD_H 1
| #define HAVE_FCNTL_H 1
| #define HAVE_SYS_MMAN_H 1
| #define HAVE_SYS_IOCTL_H 1
| #define HAVE_GETOPT_H 1
| #define HAVE_TERMIOS_H 1
| #define HAVE_TERMIO_H 1
| #define HAVE_ALLOCA_H 1
| #define HAVE_SYS_STATFS_H 1
| #define HAVE_SYS_STATVFS_H 1
| #define HAVE_SYS_TYPES_H 1
| #define HAVE_SYS_STAT_H 1
| #define HAVE_SYS_VFS_H 1
| #define HAVE_UTIME_H 1
| #define HAVE_SYS_PARAM_H 1
| #define HAVE_SYS_MOUNT_H 1
| #define HAVE_SYS_SOCKET_H 1
| #define HAVE_LINUX_IF_H 1
| #define HAVE_LINUX_IF_TUN_H 1
| #define HAVE_NET_IF_H 1
| #define WORDS_BIGENDIAN 1
| #define SIZEOF_SHORT 2
| #define SIZEOF_INT 4
| #define SIZEOF_LONG 4
| #define SIZEOF_LONG_LONG 8
| #define SIZEOF_FLOAT 4
| #define SIZEOF_DOUBLE 8
| #define SIZEOF_LONG_DOUBLE 8
| #define SIZEOF_VOID_P 4
| #define RETSIGTYPE void
| #define TIME_WITH_SYS_TIME 1
| #define _FILE_OFFSET_BITS 64
| #define HAVE_BOOL
| #define HAVE_LIBM 1
| #define HAVE_STRDUP 1
| #define HAVE_SIGACTION 1
| #define HAVE_SIGNAL 1
| #define HAVE_MMAP 1
| #define HAVE_MPROTECT 1
| #define HAVE_MUNMAP 1
| /* end confdefs.h. */
| /* Define vm_deallocate to an innocuous variant, in case <limits.h> declares vm_deallocate.
| For example, HP-UX 11i <limits.h> declares gettimeofday. */
| #define vm_deallocate innocuous_vm_deallocate
|
| /* System header to define __stub macros and hopefully few prototypes,
| which can conflict with char vm_deallocate (); below.
| Prefer <limits.h> to <assert.h> if __STDC__ is defined, since
| <limits.h> exists even on freestanding compilers. */
|
| #ifdef __STDC__
| # include <limits.h>
| #else
| # include <assert.h>
| #endif
|
| #undef vm_deallocate
|
| /* Override any GCC internal prototype to avoid an error.
| Use char because int might match the return type of a GCC
| builtin and then its argument prototype would still apply. */
| #ifdef __cplusplus
| extern "C"
| #endif
| char vm_deallocate ();
| /* The GNU C library defines this for functions which it implements
| to always fail with ENOSYS. Some functions are actually named
| something starting with __ and the normal name is an alias. */
| #if defined __stub_vm_deallocate || defined __stub___vm_deallocate
| choke me
| #endif
|
| int
| main ()
| {
| return vm_deallocate ();
| ;
| return 0;
| }
configure:10976: result: no
configure:10896: checking for vm_protect
configure:10952: gcc -o conftest -g -O2 conftest.c -lm >&5
/tmp/ccEUR7pM.o: In function `main':
/mnt/usbdrive/aranym/src/Unix/conftest.c:95: undefined reference to `vm_protect'
collect2: ld returned 1 exit status
configure:10958: $? = 1
configure: failed program was:
| /* confdefs.h. */
| #define PACKAGE_NAME "aranym"
| #define PACKAGE_TARNAME "aranym"
| #define PACKAGE_VERSION "0.9"
| #define PACKAGE_STRING "aranym 0.9"
| #define PACKAGE_BUGREPORT "aranym@bobek.sh.cvut.cz"
| #define OS_TYPE "linux"
| #define CPU_TYPE "powerpc"
| #define STDC_HEADERS 1
| #define HAVE_DIRENT_H 1
| #define HAVE_SYS_TYPES_H 1
| #define HAVE_SYS_STAT_H 1
| #define HAVE_STDLIB_H 1
| #define HAVE_STRING_H 1
| #define HAVE_MEMORY_H 1
| #define HAVE_STRINGS_H 1
| #define HAVE_INTTYPES_H 1
| #define HAVE_STDINT_H 1
| #define HAVE_UNISTD_H 1
| #define HAVE_UNISTD_H 1
| #define HAVE_FCNTL_H 1
| #define HAVE_SYS_MMAN_H 1
| #define HAVE_SYS_IOCTL_H 1
| #define HAVE_GETOPT_H 1
| #define HAVE_TERMIOS_H 1
| #define HAVE_TERMIO_H 1
| #define HAVE_ALLOCA_H 1
| #define HAVE_SYS_STATFS_H 1
| #define HAVE_SYS_STATVFS_H 1
| #define HAVE_SYS_TYPES_H 1
| #define HAVE_SYS_STAT_H 1
| #define HAVE_SYS_VFS_H 1
| #define HAVE_UTIME_H 1
| #define HAVE_SYS_PARAM_H 1
| #define HAVE_SYS_MOUNT_H 1
| #define HAVE_SYS_SOCKET_H 1
| #define HAVE_LINUX_IF_H 1
| #define HAVE_LINUX_IF_TUN_H 1
| #define HAVE_NET_IF_H 1
| #define WORDS_BIGENDIAN 1
| #define SIZEOF_SHORT 2
| #define SIZEOF_INT 4
| #define SIZEOF_LONG 4
| #define SIZEOF_LONG_LONG 8
| #define SIZEOF_FLOAT 4
| #define SIZEOF_DOUBLE 8
| #define SIZEOF_LONG_DOUBLE 8
| #define SIZEOF_VOID_P 4
| #define RETSIGTYPE void
| #define TIME_WITH_SYS_TIME 1
| #define _FILE_OFFSET_BITS 64
| #define HAVE_BOOL
| #define HAVE_LIBM 1
| #define HAVE_STRDUP 1
| #define HAVE_SIGACTION 1
| #define HAVE_SIGNAL 1
| #define HAVE_MMAP 1
| #define HAVE_MPROTECT 1
| #define HAVE_MUNMAP 1
| /* end confdefs.h. */
| /* Define vm_protect to an innocuous variant, in case <limits.h> declares vm_protect.
| For example, HP-UX 11i <limits.h> declares gettimeofday. */
| #define vm_protect innocuous_vm_protect
|
| /* System header to define __stub macros and hopefully few prototypes,
| which can conflict with char vm_protect (); below.
| Prefer <limits.h> to <assert.h> if __STDC__ is defined, since
| <limits.h> exists even on freestanding compilers. */
|
| #ifdef __STDC__
| # include <limits.h>
| #else
| # include <assert.h>
| #endif
|
| #undef vm_protect
|
| /* Override any GCC internal prototype to avoid an error.
| Use char because int might match the return type of a GCC
| builtin and then its argument prototype would still apply. */
| #ifdef __cplusplus
| extern "C"
| #endif
| char vm_protect ();
| /* The GNU C library defines this for functions which it implements
| to always fail with ENOSYS. Some functions are actually named
| something starting with __ and the normal name is an alias. */
| #if defined __stub_vm_protect || defined __stub___vm_protect
| choke me
| #endif
|
| int
| main ()
| {
| return vm_protect ();
| ;
| return 0;
| }
configure:10976: result: no
configure:10992: checking for strchr
configure:11048: gcc -o conftest -g -O2 conftest.c -lm >&5
conftest.c:84: warning: conflicting types for built-in function 'strchr'
configure:11054: $? = 0
configure:11072: result: yes
configure:10992: checking for memcpy
configure:11048: gcc -o conftest -g -O2 conftest.c -lm >&5
conftest.c:85: warning: conflicting types for built-in function 'memcpy'
configure:11054: $? = 0
configure:11072: result: yes
configure:10992: checking for bcopy
configure:11048: gcc -o conftest -g -O2 conftest.c -lm >&5
conftest.c:86: warning: conflicting types for built-in function 'bcopy'
configure:11054: $? = 0
configure:11072: result: yes
configure:11087: checking for usleep
configure:11143: gcc -o conftest -g -O2 conftest.c -lm >&5
configure:11149: $? = 0
configure:11167: result: yes
configure:11087: checking for gettimeofday
configure:11143: gcc -o conftest -g -O2 conftest.c -lm >&5
configure:11149: $? = 0
configure:11167: result: yes
configure:11178: checking for caddr_t
configure:11208: gcc -c -g -O2 conftest.c >&5
configure:11214: $? = 0
configure:11229: result: yes
configure:11248: checking for mach_task_self
configure:11304: gcc -o conftest -g -O2 conftest.c -lm >&5
/tmp/cc6gD93c.o: In function `main':
/mnt/usbdrive/aranym/src/Unix/conftest.c:101: undefined reference to `mach_task_self'
collect2: ld returned 1 exit status
configure:11310: $? = 1
configure: failed program was:
| /* confdefs.h. */
| #define PACKAGE_NAME "aranym"
| #define PACKAGE_TARNAME "aranym"
| #define PACKAGE_VERSION "0.9"
| #define PACKAGE_STRING "aranym 0.9"
| #define PACKAGE_BUGREPORT "aranym@bobek.sh.cvut.cz"
| #define OS_TYPE "linux"
| #define CPU_TYPE "powerpc"
| #define STDC_HEADERS 1
| #define HAVE_DIRENT_H 1
| #define HAVE_SYS_TYPES_H 1
| #define HAVE_SYS_STAT_H 1
| #define HAVE_STDLIB_H 1
| #define HAVE_STRING_H 1
| #define HAVE_MEMORY_H 1
| #define HAVE_STRINGS_H 1
| #define HAVE_INTTYPES_H 1
| #define HAVE_STDINT_H 1
| #define HAVE_UNISTD_H 1
| #define HAVE_UNISTD_H 1
| #define HAVE_FCNTL_H 1
| #define HAVE_SYS_MMAN_H 1
| #define HAVE_SYS_IOCTL_H 1
| #define HAVE_GETOPT_H 1
| #define HAVE_TERMIOS_H 1
| #define HAVE_TERMIO_H 1
| #define HAVE_ALLOCA_H 1
| #define HAVE_SYS_STATFS_H 1
| #define HAVE_SYS_STATVFS_H 1
| #define HAVE_SYS_TYPES_H 1
| #define HAVE_SYS_STAT_H 1
| #define HAVE_SYS_VFS_H 1
| #define HAVE_UTIME_H 1
| #define HAVE_SYS_PARAM_H 1
| #define HAVE_SYS_MOUNT_H 1
| #define HAVE_SYS_SOCKET_H 1
| #define HAVE_LINUX_IF_H 1
| #define HAVE_LINUX_IF_TUN_H 1
| #define HAVE_NET_IF_H 1
| #define WORDS_BIGENDIAN 1
| #define SIZEOF_SHORT 2
| #define SIZEOF_INT 4
| #define SIZEOF_LONG 4
| #define SIZEOF_LONG_LONG 8
| #define SIZEOF_FLOAT 4
| #define SIZEOF_DOUBLE 8
| #define SIZEOF_LONG_DOUBLE 8
| #define SIZEOF_VOID_P 4
| #define RETSIGTYPE void
| #define TIME_WITH_SYS_TIME 1
| #define _FILE_OFFSET_BITS 64
| #define HAVE_BOOL
| #define HAVE_LIBM 1
| #define HAVE_STRDUP 1
| #define HAVE_SIGACTION 1
| #define HAVE_SIGNAL 1
| #define HAVE_MMAP 1
| #define HAVE_MPROTECT 1
| #define HAVE_MUNMAP 1
| #define HAVE_STRCHR 1
| #define HAVE_MEMCPY 1
| #define HAVE_BCOPY 1
| #define HAVE_USLEEP 1
| #define HAVE_GETTIMEOFDAY 1
| #define HAVE_CADDR_T 1
| /* end confdefs.h. */
| /* Define mach_task_self to an innocuous variant, in case <limits.h> declares mach_task_self.
| For example, HP-UX 11i <limits.h> declares gettimeofday. */
| #define mach_task_self innocuous_mach_task_self
|
| /* System header to define __stub macros and hopefully few prototypes,
| which can conflict with char mach_task_self (); below.
| Prefer <limits.h> to <assert.h> if __STDC__ is defined, since
| <limits.h> exists even on freestanding compilers. */
|
| #ifdef __STDC__
| # include <limits.h>
| #else
| # include <assert.h>
| #endif
|
| #undef mach_task_self
|
| /* Override any GCC internal prototype to avoid an error.
| Use char because int might match the return type of a GCC
| builtin and then its argument prototype would still apply. */
| #ifdef __cplusplus
| extern "C"
| #endif
| char mach_task_self ();
| /* The GNU C library defines this for functions which it implements
| to always fail with ENOSYS. Some functions are actually named
| something starting with __ and the normal name is an alias. */
| #if defined __stub_mach_task_self || defined __stub___mach_task_self
| choke me
| #endif
|
| int
| main ()
| {
| return mach_task_self ();
| ;
| return 0;
| }
configure:11328: result: no
configure:11248: checking for task_self
configure:11304: gcc -o conftest -g -O2 conftest.c -lm >&5
/tmp/ccqR4Fgq.o: In function `main':
/mnt/usbdrive/aranym/src/Unix/conftest.c:101: undefined reference to `task_self'
collect2: ld returned 1 exit status
configure:11310: $? = 1
configure: failed program was:
| /* confdefs.h. */
| #define PACKAGE_NAME "aranym"
| #define PACKAGE_TARNAME "aranym"
| #define PACKAGE_VERSION "0.9"
| #define PACKAGE_STRING "aranym 0.9"
| #define PACKAGE_BUGREPORT "aranym@bobek.sh.cvut.cz"
| #define OS_TYPE "linux"
| #define CPU_TYPE "powerpc"
| #define STDC_HEADERS 1
| #define HAVE_DIRENT_H 1
| #define HAVE_SYS_TYPES_H 1
| #define HAVE_SYS_STAT_H 1
| #define HAVE_STDLIB_H 1
| #define HAVE_STRING_H 1
| #define HAVE_MEMORY_H 1
| #define HAVE_STRINGS_H 1
| #define HAVE_INTTYPES_H 1
| #define HAVE_STDINT_H 1
| #define HAVE_UNISTD_H 1
| #define HAVE_UNISTD_H 1
| #define HAVE_FCNTL_H 1
| #define HAVE_SYS_MMAN_H 1
| #define HAVE_SYS_IOCTL_H 1
| #define HAVE_GETOPT_H 1
| #define HAVE_TERMIOS_H 1
| #define HAVE_TERMIO_H 1
| #define HAVE_ALLOCA_H 1
| #define HAVE_SYS_STATFS_H 1
| #define HAVE_SYS_STATVFS_H 1
| #define HAVE_SYS_TYPES_H 1
| #define HAVE_SYS_STAT_H 1
| #define HAVE_SYS_VFS_H 1
| #define HAVE_UTIME_H 1
| #define HAVE_SYS_PARAM_H 1
| #define HAVE_SYS_MOUNT_H 1
| #define HAVE_SYS_SOCKET_H 1
| #define HAVE_LINUX_IF_H 1
| #define HAVE_LINUX_IF_TUN_H 1
| #define HAVE_NET_IF_H 1
| #define WORDS_BIGENDIAN 1
| #define SIZEOF_SHORT 2
| #define SIZEOF_INT 4
| #define SIZEOF_LONG 4
| #define SIZEOF_LONG_LONG 8
| #define SIZEOF_FLOAT 4
| #define SIZEOF_DOUBLE 8
| #define SIZEOF_LONG_DOUBLE 8
| #define SIZEOF_VOID_P 4
| #define RETSIGTYPE void
| #define TIME_WITH_SYS_TIME 1
| #define _FILE_OFFSET_BITS 64
| #define HAVE_BOOL
| #define HAVE_LIBM 1
| #define HAVE_STRDUP 1
| #define HAVE_SIGACTION 1
| #define HAVE_SIGNAL 1
| #define HAVE_MMAP 1
| #define HAVE_MPROTECT 1
| #define HAVE_MUNMAP 1
| #define HAVE_STRCHR 1
| #define HAVE_MEMCPY 1
| #define HAVE_BCOPY 1
| #define HAVE_USLEEP 1
| #define HAVE_GETTIMEOFDAY 1
| #define HAVE_CADDR_T 1
| /* end confdefs.h. */
| /* Define task_self to an innocuous variant, in case <limits.h> declares task_self.
| For example, HP-UX 11i <limits.h> declares gettimeofday. */
| #define task_self innocuous_task_self
|
| /* System header to define __stub macros and hopefully few prototypes,
| which can conflict with char task_self (); below.
| Prefer <limits.h> to <assert.h> if __STDC__ is defined, since
| <limits.h> exists even on freestanding compilers. */
|
| #ifdef __STDC__
| # include <limits.h>
| #else
| # include <assert.h>
| #endif
|
| #undef task_self
|
| /* Override any GCC internal prototype to avoid an error.
| Use char because int might match the return type of a GCC
| builtin and then its argument prototype would still apply. */
| #ifdef __cplusplus
| extern "C"
| #endif
| char task_self ();
| /* The GNU C library defines this for functions which it implements
| to always fail with ENOSYS. Some functions are actually named
| something starting with __ and the normal name is an alias. */
| #if defined __stub_task_self || defined __stub___task_self
| choke me
| #endif
|
| int
| main ()
| {
| return task_self ();
| ;
| return 0;
| }
configure:11328: result: no
configure:11626: checking for __wchar_t
configure:11661: g++ -o conftest -g -O2 conftest.cpp -lm >&5
/mnt/livecd/usr/powerpc-unknown-linux-gnu/gcc-bin/4.1.1/../../../lib/gcc/powerpc-unknown-linux-gnu/4.1.1/../../../crt1.o:(.rodata+0x4): undefined reference to `main'
collect2: ld returned 1 exit status
configure:11664: $? = 1
configure: program exited with status 1
configure: failed program was:
| /* confdefs.h. */
| #define PACKAGE_NAME "aranym"
| #define PACKAGE_TARNAME "aranym"
| #define PACKAGE_VERSION "0.9"
| #define PACKAGE_STRING "aranym 0.9"
| #define PACKAGE_BUGREPORT "aranym@bobek.sh.cvut.cz"
| #define OS_TYPE "linux"
| #define CPU_TYPE "powerpc"
| #define STDC_HEADERS 1
| #define HAVE_DIRENT_H 1
| #define HAVE_SYS_TYPES_H 1
| #define HAVE_SYS_STAT_H 1
| #define HAVE_STDLIB_H 1
| #define HAVE_STRING_H 1
| #define HAVE_MEMORY_H 1
| #define HAVE_STRINGS_H 1
| #define HAVE_INTTYPES_H 1
| #define HAVE_STDINT_H 1
| #define HAVE_UNISTD_H 1
| #define HAVE_UNISTD_H 1
| #define HAVE_FCNTL_H 1
| #define HAVE_SYS_MMAN_H 1
| #define HAVE_SYS_IOCTL_H 1
| #define HAVE_GETOPT_H 1
| #define HAVE_TERMIOS_H 1
| #define HAVE_TERMIO_H 1
| #define HAVE_ALLOCA_H 1
| #define HAVE_SYS_STATFS_H 1
| #define HAVE_SYS_STATVFS_H 1
| #define HAVE_SYS_TYPES_H 1
| #define HAVE_SYS_STAT_H 1
| #define HAVE_SYS_VFS_H 1
| #define HAVE_UTIME_H 1
| #define HAVE_SYS_PARAM_H 1
| #define HAVE_SYS_MOUNT_H 1
| #define HAVE_SYS_SOCKET_H 1
| #define HAVE_LINUX_IF_H 1
| #define HAVE_LINUX_IF_TUN_H 1
| #define HAVE_NET_IF_H 1
| #define WORDS_BIGENDIAN 1
| #define SIZEOF_SHORT 2
| #define SIZEOF_INT 4
| #define SIZEOF_LONG 4
| #define SIZEOF_LONG_LONG 8
| #define SIZEOF_FLOAT 4
| #define SIZEOF_DOUBLE 8
| #define SIZEOF_LONG_DOUBLE 8
| #define SIZEOF_VOID_P 4
| #define RETSIGTYPE void
| #define TIME_WITH_SYS_TIME 1
| #define _FILE_OFFSET_BITS 64
| #define HAVE_BOOL
| #define HAVE_LIBM 1
| #define HAVE_STRDUP 1
| #define HAVE_SIGACTION 1
| #define HAVE_SIGNAL 1
| #define HAVE_MMAP 1
| #define HAVE_MPROTECT 1
| #define HAVE_MUNMAP 1
| #define HAVE_STRCHR 1
| #define HAVE_MEMCPY 1
| #define HAVE_BCOPY 1
| #define HAVE_USLEEP 1
| #define HAVE_GETTIMEOFDAY 1
| #define HAVE_CADDR_T 1
| #define DIRSEPARATOR "/"
| /* end confdefs.h. */
|
| #include <errno.h>
| #include <stdlib.h>
| #include <stdio.h>
|
configure:11696: result: no
configure:11708: checking whether TUN/TAP is supported
configure:11751: gcc -c -g -O2 conftest.c >&5
conftest.c: In function 'main':
conftest.c:86: warning: incompatible implicit declaration of built-in function 'memset'
configure:11757: $? = 0
configure:11774: result: yes
configure:11972: checking whether mmap supports MAP_ANON
configure:12008: g++ -o conftest -g -O2 conftest.cpp -lm >&5
configure:12011: $? = 0
configure:12017: ./conftest
configure:12020: $? = 0
configure:12044: result: yes
configure:12056: checking whether mmap supports MAP_ANONYMOUS
configure:12092: g++ -o conftest -g -O2 conftest.cpp -lm >&5
configure:12095: $? = 0
configure:12101: ./conftest
configure:12104: $? = 0
configure:12128: result: yes
configure:12140: checking whether mprotect works
configure:12177: g++ -o conftest -g -O2 conftest.cpp -lm >&5
configure:12180: $? = 0
configure:12186: ./conftest
./configure: line 12187: 28504 Segmentation fault ./conftest$ac_exeext
configure:12189: $? = 139
configure: program exited with status 139
configure: failed program was:
| /* confdefs.h. */
| #define PACKAGE_NAME "aranym"
| #define PACKAGE_TARNAME "aranym"
| #define PACKAGE_VERSION "0.9"
| #define PACKAGE_STRING "aranym 0.9"
| #define PACKAGE_BUGREPORT "aranym@bobek.sh.cvut.cz"
| #define OS_TYPE "linux"
| #define CPU_TYPE "powerpc"
| #define STDC_HEADERS 1
| #define HAVE_DIRENT_H 1
| #define HAVE_SYS_TYPES_H 1
| #define HAVE_SYS_STAT_H 1
| #define HAVE_STDLIB_H 1
| #define HAVE_STRING_H 1
| #define HAVE_MEMORY_H 1
| #define HAVE_STRINGS_H 1
| #define HAVE_INTTYPES_H 1
| #define HAVE_STDINT_H 1
| #define HAVE_UNISTD_H 1
| #define HAVE_UNISTD_H 1
| #define HAVE_FCNTL_H 1
| #define HAVE_SYS_MMAN_H 1
| #define HAVE_SYS_IOCTL_H 1
| #define HAVE_GETOPT_H 1
| #define HAVE_TERMIOS_H 1
| #define HAVE_TERMIO_H 1
| #define HAVE_ALLOCA_H 1
| #define HAVE_SYS_STATFS_H 1
| #define HAVE_SYS_STATVFS_H 1
| #define HAVE_SYS_TYPES_H 1
| #define HAVE_SYS_STAT_H 1
| #define HAVE_SYS_VFS_H 1
| #define HAVE_UTIME_H 1
| #define HAVE_SYS_PARAM_H 1
| #define HAVE_SYS_MOUNT_H 1
| #define HAVE_SYS_SOCKET_H 1
| #define HAVE_LINUX_IF_H 1
| #define HAVE_LINUX_IF_TUN_H 1
| #define HAVE_NET_IF_H 1
| #define WORDS_BIGENDIAN 1
| #define SIZEOF_SHORT 2
| #define SIZEOF_INT 4
| #define SIZEOF_LONG 4
| #define SIZEOF_LONG_LONG 8
| #define SIZEOF_FLOAT 4
| #define SIZEOF_DOUBLE 8
| #define SIZEOF_LONG_DOUBLE 8
| #define SIZEOF_VOID_P 4
| #define RETSIGTYPE void
| #define TIME_WITH_SYS_TIME 1
| #define _FILE_OFFSET_BITS 64
| #define HAVE_BOOL
| #define HAVE_LIBM 1
| #define HAVE_STRDUP 1
| #define HAVE_SIGACTION 1
| #define HAVE_SIGNAL 1
| #define HAVE_MMAP 1
| #define HAVE_MPROTECT 1
| #define HAVE_MUNMAP 1
| #define HAVE_STRCHR 1
| #define HAVE_MEMCPY 1
| #define HAVE_BCOPY 1
| #define HAVE_USLEEP 1
| #define HAVE_GETTIMEOFDAY 1
| #define HAVE_CADDR_T 1
| #define DIRSEPARATOR "/"
| #define ENABLE_TUNTAP 1
| #define HAVE_MMAP_VM 1
| #define HAVE_MMAP_ANON 1
| #define HAVE_MMAP_ANONYMOUS 1
| /* end confdefs.h. */
|
| #define CONFIGURE_TEST_VM_MAP
| #define TEST_VM_PROT_NONE_READ
| #include "./vm_alloc.cpp"
|
configure:12177: g++ -o conftest -g -O2 conftest.cpp -lm >&5
configure:12180: $? = 0
configure:12186: ./conftest
./configure: line 12187: 28524 Segmentation fault ./conftest$ac_exeext
configure:12189: $? = 139
configure: program exited with status 139
configure: failed program was:
| /* confdefs.h. */
| #define PACKAGE_NAME "aranym"
| #define PACKAGE_TARNAME "aranym"
| #define PACKAGE_VERSION "0.9"
| #define PACKAGE_STRING "aranym 0.9"
| #define PACKAGE_BUGREPORT "aranym@bobek.sh.cvut.cz"
| #define OS_TYPE "linux"
| #define CPU_TYPE "powerpc"
| #define STDC_HEADERS 1
| #define HAVE_DIRENT_H 1
| #define HAVE_SYS_TYPES_H 1
| #define HAVE_SYS_STAT_H 1
| #define HAVE_STDLIB_H 1
| #define HAVE_STRING_H 1
| #define HAVE_MEMORY_H 1
| #define HAVE_STRINGS_H 1
| #define HAVE_INTTYPES_H 1
| #define HAVE_STDINT_H 1
| #define HAVE_UNISTD_H 1
| #define HAVE_UNISTD_H 1
| #define HAVE_FCNTL_H 1
| #define HAVE_SYS_MMAN_H 1
| #define HAVE_SYS_IOCTL_H 1
| #define HAVE_GETOPT_H 1
| #define HAVE_TERMIOS_H 1
| #define HAVE_TERMIO_H 1
| #define HAVE_ALLOCA_H 1
| #define HAVE_SYS_STATFS_H 1
| #define HAVE_SYS_STATVFS_H 1
| #define HAVE_SYS_TYPES_H 1
| #define HAVE_SYS_STAT_H 1
| #define HAVE_SYS_VFS_H 1
| #define HAVE_UTIME_H 1
| #define HAVE_SYS_PARAM_H 1
| #define HAVE_SYS_MOUNT_H 1
| #define HAVE_SYS_SOCKET_H 1
| #define HAVE_LINUX_IF_H 1
| #define HAVE_LINUX_IF_TUN_H 1
| #define HAVE_NET_IF_H 1
| #define WORDS_BIGENDIAN 1
| #define SIZEOF_SHORT 2
| #define SIZEOF_INT 4
| #define SIZEOF_LONG 4
| #define SIZEOF_LONG_LONG 8
| #define SIZEOF_FLOAT 4
| #define SIZEOF_DOUBLE 8
| #define SIZEOF_LONG_DOUBLE 8
| #define SIZEOF_VOID_P 4
| #define RETSIGTYPE void
| #define TIME_WITH_SYS_TIME 1
| #define _FILE_OFFSET_BITS 64
| #define HAVE_BOOL
| #define HAVE_LIBM 1
| #define HAVE_STRDUP 1
| #define HAVE_SIGACTION 1
| #define HAVE_SIGNAL 1
| #define HAVE_MMAP 1
| #define HAVE_MPROTECT 1
| #define HAVE_MUNMAP 1
| #define HAVE_STRCHR 1
| #define HAVE_MEMCPY 1
| #define HAVE_BCOPY 1
| #define HAVE_USLEEP 1
| #define HAVE_GETTIMEOFDAY 1
| #define HAVE_CADDR_T 1
| #define DIRSEPARATOR "/"
| #define ENABLE_TUNTAP 1
| #define HAVE_MMAP_VM 1
| #define HAVE_MMAP_ANON 1
| #define HAVE_MMAP_ANONYMOUS 1
| /* end confdefs.h. */
|
| #define CONFIGURE_TEST_VM_MAP
| #define TEST_VM_PROT_NONE_WRITE
| #include "./vm_alloc.cpp"
|
configure:12177: g++ -o conftest -g -O2 conftest.cpp -lm >&5
configure:12180: $? = 0
configure:12186: ./conftest
./configure: line 12187: 28544 Segmentation fault ./conftest$ac_exeext
configure:12189: $? = 139
configure: program exited with status 139
configure: failed program was:
| /* confdefs.h. */
| #define PACKAGE_NAME "aranym"
| #define PACKAGE_TARNAME "aranym"
| #define PACKAGE_VERSION "0.9"
| #define PACKAGE_STRING "aranym 0.9"
| #define PACKAGE_BUGREPORT "aranym@bobek.sh.cvut.cz"
| #define OS_TYPE "linux"
| #define CPU_TYPE "powerpc"
| #define STDC_HEADERS 1
| #define HAVE_DIRENT_H 1
| #define HAVE_SYS_TYPES_H 1
| #define HAVE_SYS_STAT_H 1
| #define HAVE_STDLIB_H 1
| #define HAVE_STRING_H 1
| #define HAVE_MEMORY_H 1
| #define HAVE_STRINGS_H 1
| #define HAVE_INTTYPES_H 1
| #define HAVE_STDINT_H 1
| #define HAVE_UNISTD_H 1
| #define HAVE_UNISTD_H 1
| #define HAVE_FCNTL_H 1
| #define HAVE_SYS_MMAN_H 1
| #define HAVE_SYS_IOCTL_H 1
| #define HAVE_GETOPT_H 1
| #define HAVE_TERMIOS_H 1
| #define HAVE_TERMIO_H 1
| #define HAVE_ALLOCA_H 1
| #define HAVE_SYS_STATFS_H 1
| #define HAVE_SYS_STATVFS_H 1
| #define HAVE_SYS_TYPES_H 1
| #define HAVE_SYS_STAT_H 1
| #define HAVE_SYS_VFS_H 1
| #define HAVE_UTIME_H 1
| #define HAVE_SYS_PARAM_H 1
| #define HAVE_SYS_MOUNT_H 1
| #define HAVE_SYS_SOCKET_H 1
| #define HAVE_LINUX_IF_H 1
| #define HAVE_LINUX_IF_TUN_H 1
| #define HAVE_NET_IF_H 1
| #define WORDS_BIGENDIAN 1
| #define SIZEOF_SHORT 2
| #define SIZEOF_INT 4
| #define SIZEOF_LONG 4
| #define SIZEOF_LONG_LONG 8
| #define SIZEOF_FLOAT 4
| #define SIZEOF_DOUBLE 8
| #define SIZEOF_LONG_DOUBLE 8
| #define SIZEOF_VOID_P 4
| #define RETSIGTYPE void
| #define TIME_WITH_SYS_TIME 1
| #define _FILE_OFFSET_BITS 64
| #define HAVE_BOOL
| #define HAVE_LIBM 1
| #define HAVE_STRDUP 1
| #define HAVE_SIGACTION 1
| #define HAVE_SIGNAL 1
| #define HAVE_MMAP 1
| #define HAVE_MPROTECT 1
| #define HAVE_MUNMAP 1
| #define HAVE_STRCHR 1
| #define HAVE_MEMCPY 1
| #define HAVE_BCOPY 1
| #define HAVE_USLEEP 1
| #define HAVE_GETTIMEOFDAY 1
| #define HAVE_CADDR_T 1
| #define DIRSEPARATOR "/"
| #define ENABLE_TUNTAP 1
| #define HAVE_MMAP_VM 1
| #define HAVE_MMAP_ANON 1
| #define HAVE_MMAP_ANONYMOUS 1
| /* end confdefs.h. */
|
| #define CONFIGURE_TEST_VM_MAP
| #define TEST_VM_PROT_READ_WRITE
| #include "./vm_alloc.cpp"
|
configure:12227: g++ -o conftest -g -O2 conftest.cpp -lm >&5
configure:12230: $? = 0
configure:12236: ./conftest
configure:12239: $? = 0
configure:12263: result: yes
configure:12283: checking whether we can map Low Memory area 0x0000-0x1000000
configure:12325: g++ -o conftest -g -O2 conftest.cpp -lm >&5
configure:12328: $? = 0
configure:12334: ./conftest
configure:12337: $? = 0
configure:12361: result: yes
configure:12364: checking whether POSIX shared memory is working
configure:12405: g++ -o conftest -g -O2 conftest.cpp -lm >&5
conftest.cpp: In function 'int main()':
conftest.cpp:79: error: 'VM_MAP_33BIT' was not declared in this scope
configure:12408: $? = 1
configure: program exited with status 1
configure: failed program was:
| /* confdefs.h. */
| #define PACKAGE_NAME "aranym"
| #define PACKAGE_TARNAME "aranym"
| #define PACKAGE_VERSION "0.9"
| #define PACKAGE_STRING "aranym 0.9"
| #define PACKAGE_BUGREPORT "aranym@bobek.sh.cvut.cz"
| #define OS_TYPE "linux"
| #define CPU_TYPE "powerpc"
| #define STDC_HEADERS 1
| #define HAVE_DIRENT_H 1
| #define HAVE_SYS_TYPES_H 1
| #define HAVE_SYS_STAT_H 1
| #define HAVE_STDLIB_H 1
| #define HAVE_STRING_H 1
| #define HAVE_MEMORY_H 1
| #define HAVE_STRINGS_H 1
| #define HAVE_INTTYPES_H 1
| #define HAVE_STDINT_H 1
| #define HAVE_UNISTD_H 1
| #define HAVE_UNISTD_H 1
| #define HAVE_FCNTL_H 1
| #define HAVE_SYS_MMAN_H 1
| #define HAVE_SYS_IOCTL_H 1
| #define HAVE_GETOPT_H 1
| #define HAVE_TERMIOS_H 1
| #define HAVE_TERMIO_H 1
| #define HAVE_ALLOCA_H 1
| #define HAVE_SYS_STATFS_H 1
| #define HAVE_SYS_STATVFS_H 1
| #define HAVE_SYS_TYPES_H 1
| #define HAVE_SYS_STAT_H 1
| #define HAVE_SYS_VFS_H 1
| #define HAVE_UTIME_H 1
| #define HAVE_SYS_PARAM_H 1
| #define HAVE_SYS_MOUNT_H 1
| #define HAVE_SYS_SOCKET_H 1
| #define HAVE_LINUX_IF_H 1
| #define HAVE_LINUX_IF_TUN_H 1
| #define HAVE_NET_IF_H 1
| #define WORDS_BIGENDIAN 1
| #define SIZEOF_SHORT 2
| #define SIZEOF_INT 4
| #define SIZEOF_LONG 4
| #define SIZEOF_LONG_LONG 8
| #define SIZEOF_FLOAT 4
| #define SIZEOF_DOUBLE 8
| #define SIZEOF_LONG_DOUBLE 8
| #define SIZEOF_VOID_P 4
| #define RETSIGTYPE void
| #define TIME_WITH_SYS_TIME 1
| #define _FILE_OFFSET_BITS 64
| #define HAVE_BOOL
| #define HAVE_LIBM 1
| #define HAVE_STRDUP 1
| #define HAVE_SIGACTION 1
| #define HAVE_SIGNAL 1
| #define HAVE_MMAP 1
| #define HAVE_MPROTECT 1
| #define HAVE_MUNMAP 1
| #define HAVE_STRCHR 1
| #define HAVE_MEMCPY 1
| #define HAVE_BCOPY 1
| #define HAVE_USLEEP 1
| #define HAVE_GETTIMEOFDAY 1
| #define HAVE_CADDR_T 1
| #define DIRSEPARATOR "/"
| #define ENABLE_TUNTAP 1
| #define HAVE_MMAP_VM 1
| #define HAVE_MMAP_ANON 1
| #define HAVE_MMAP_ANONYMOUS 1
| #define HAVE_MMAP_VM 1
| /* end confdefs.h. */
|
| #define HAVE_POSIX_SHM
|
| #include "./vm_alloc.cpp"
| int main(void) { /* returns 0 if we have working POSIX shm */
| if (vm_init() < 0) exit(2);
| char *m1 = (char *)vm_acquire(32768, VM_MAP_DEFAULT | VM_MAP_33BIT);
| if (m1 == VM_MAP_FAILED) exit(3);
| vm_exit(); exit(0);
| }
|
configure:12441: result: no
configure:12453: checking whether 33-bit memory addressing is working
configure:12497: g++ -o conftest -g -O2 conftest.cpp -lm >&5
conftest.cpp: In function 'int main()':
conftest.cpp:79: error: 'VM_MAP_33BIT' was not declared in this scope
conftest.cpp:81: warning: left shift count >= width of type
configure:12500: $? = 1
configure: program exited with status 1
configure: failed program was:
| /* confdefs.h. */
| #define PACKAGE_NAME "aranym"
| #define PACKAGE_TARNAME "aranym"
| #define PACKAGE_VERSION "0.9"
| #define PACKAGE_STRING "aranym 0.9"
| #define PACKAGE_BUGREPORT "aranym@bobek.sh.cvut.cz"
| #define OS_TYPE "linux"
| #define CPU_TYPE "powerpc"
| #define STDC_HEADERS 1
| #define HAVE_DIRENT_H 1
| #define HAVE_SYS_TYPES_H 1
| #define HAVE_SYS_STAT_H 1
| #define HAVE_STDLIB_H 1
| #define HAVE_STRING_H 1
| #define HAVE_MEMORY_H 1
| #define HAVE_STRINGS_H 1
| #define HAVE_INTTYPES_H 1
| #define HAVE_STDINT_H 1
| #define HAVE_UNISTD_H 1
| #define HAVE_UNISTD_H 1
| #define HAVE_FCNTL_H 1
| #define HAVE_SYS_MMAN_H 1
| #define HAVE_SYS_IOCTL_H 1
| #define HAVE_GETOPT_H 1
| #define HAVE_TERMIOS_H 1
| #define HAVE_TERMIO_H 1
| #define HAVE_ALLOCA_H 1
| #define HAVE_SYS_STATFS_H 1
| #define HAVE_SYS_STATVFS_H 1
| #define HAVE_SYS_TYPES_H 1
| #define HAVE_SYS_STAT_H 1
| #define HAVE_SYS_VFS_H 1
| #define HAVE_UTIME_H 1
| #define HAVE_SYS_PARAM_H 1
| #define HAVE_SYS_MOUNT_H 1
| #define HAVE_SYS_SOCKET_H 1
| #define HAVE_LINUX_IF_H 1
| #define HAVE_LINUX_IF_TUN_H 1
| #define HAVE_NET_IF_H 1
| #define WORDS_BIGENDIAN 1
| #define SIZEOF_SHORT 2
| #define SIZEOF_INT 4
| #define SIZEOF_LONG 4
| #define SIZEOF_LONG_LONG 8
| #define SIZEOF_FLOAT 4
| #define SIZEOF_DOUBLE 8
| #define SIZEOF_LONG_DOUBLE 8
| #define SIZEOF_VOID_P 4
| #define RETSIGTYPE void
| #define TIME_WITH_SYS_TIME 1
| #define _FILE_OFFSET_BITS 64
| #define HAVE_BOOL
| #define HAVE_LIBM 1
| #define HAVE_STRDUP 1
| #define HAVE_SIGACTION 1
| #define HAVE_SIGNAL 1
| #define HAVE_MMAP 1
| #define HAVE_MPROTECT 1
| #define HAVE_MUNMAP 1
| #define HAVE_STRCHR 1
| #define HAVE_MEMCPY 1
| #define HAVE_BCOPY 1
| #define HAVE_USLEEP 1
| #define HAVE_GETTIMEOFDAY 1
| #define HAVE_CADDR_T 1
| #define DIRSEPARATOR "/"
| #define ENABLE_TUNTAP 1
| #define HAVE_MMAP_VM 1
| #define HAVE_MMAP_ANON 1
| #define HAVE_MMAP_ANONYMOUS 1
| #define HAVE_MMAP_VM 1
| /* end confdefs.h. */
|
| #define USE_33BIT_ADDRESSING 1
| #include "./vm_alloc.cpp"
| int main(void) { /* returns 0 if we have working 33-bit addressing */
| if (sizeof(void *) < 8) exit(1);
| if (vm_init() < 0) exit(2);
| char *m1 = (char *)vm_acquire(32768, VM_MAP_DEFAULT | VM_MAP_33BIT);
| if (m1 == VM_MAP_FAILED) exit(3);
| char *m2 = m1 + (1L << 32);
| m1[0] = 0x12; if (m2[0] != 0x12) exit(4);
| m2[0] = 0x34; if (m1[0] != 0x34) exit(5);
| vm_exit(); exit(0);
| }
|
configure:12533: result: no
configure:12536: checking whether signal handlers need to be reinstalled
configure:12579: g++ -o conftest -g -O2 conftest.cpp -lm >&5
configure:12582: $? = 0
configure:12588: ./conftest
configure:12591: $? = 1
configure: program exited with status 1
configure: failed program was:
| /* confdefs.h. */
| #define PACKAGE_NAME "aranym"
| #define PACKAGE_TARNAME "aranym"
| #define PACKAGE_VERSION "0.9"
| #define PACKAGE_STRING "aranym 0.9"
| #define PACKAGE_BUGREPORT "aranym@bobek.sh.cvut.cz"
| #define OS_TYPE "linux"
| #define CPU_TYPE "powerpc"
| #define STDC_HEADERS 1
| #define HAVE_DIRENT_H 1
| #define HAVE_SYS_TYPES_H 1
| #define HAVE_SYS_STAT_H 1
| #define HAVE_STDLIB_H 1
| #define HAVE_STRING_H 1
| #define HAVE_MEMORY_H 1
| #define HAVE_STRINGS_H 1
| #define HAVE_INTTYPES_H 1
| #define HAVE_STDINT_H 1
| #define HAVE_UNISTD_H 1
| #define HAVE_UNISTD_H 1
| #define HAVE_FCNTL_H 1
| #define HAVE_SYS_MMAN_H 1
| #define HAVE_SYS_IOCTL_H 1
| #define HAVE_GETOPT_H 1
| #define HAVE_TERMIOS_H 1
| #define HAVE_TERMIO_H 1
| #define HAVE_ALLOCA_H 1
| #define HAVE_SYS_STATFS_H 1
| #define HAVE_SYS_STATVFS_H 1
| #define HAVE_SYS_TYPES_H 1
| #define HAVE_SYS_STAT_H 1
| #define HAVE_SYS_VFS_H 1
| #define HAVE_UTIME_H 1
| #define HAVE_SYS_PARAM_H 1
| #define HAVE_SYS_MOUNT_H 1
| #define HAVE_SYS_SOCKET_H 1
| #define HAVE_LINUX_IF_H 1
| #define HAVE_LINUX_IF_TUN_H 1
| #define HAVE_NET_IF_H 1
| #define WORDS_BIGENDIAN 1
| #define SIZEOF_SHORT 2
| #define SIZEOF_INT 4
| #define SIZEOF_LONG 4
| #define SIZEOF_LONG_LONG 8
| #define SIZEOF_FLOAT 4
| #define SIZEOF_DOUBLE 8
| #define SIZEOF_LONG_DOUBLE 8
| #define SIZEOF_VOID_P 4
| #define RETSIGTYPE void
| #define TIME_WITH_SYS_TIME 1
| #define _FILE_OFFSET_BITS 64
| #define HAVE_BOOL
| #define HAVE_LIBM 1
| #define HAVE_STRDUP 1
| #define HAVE_SIGACTION 1
| #define HAVE_SIGNAL 1
| #define HAVE_MMAP 1
| #define HAVE_MPROTECT 1
| #define HAVE_MUNMAP 1
| #define HAVE_STRCHR 1
| #define HAVE_MEMCPY 1
| #define HAVE_BCOPY 1
| #define HAVE_USLEEP 1
| #define HAVE_GETTIMEOFDAY 1
| #define HAVE_CADDR_T 1
| #define DIRSEPARATOR "/"
| #define ENABLE_TUNTAP 1
| #define HAVE_MMAP_VM 1
| #define HAVE_MMAP_ANON 1
| #define HAVE_MMAP_ANONYMOUS 1
| #define HAVE_MMAP_VM 1
| /* end confdefs.h. */
|
| #include <stdlib.h>
| #ifdef HAVE_UNISTD_H
| #include <unistd.h>
| #endif
| #include <signal.h>
| static int handled_signal = 0;
| RETSIGTYPE sigusr1_handler(int) { handled_signal++; }
| int main(void) { /* returns 0 if signals need not to be reinstalled */
| signal(SIGUSR1, sigusr1_handler); raise(SIGUSR1); raise(SIGUSR1);
| exit(handled_signal == 2);
| }
|
configure:12615: result: no
configure:12627: checking whether sigaction handlers need to be reinstalled
configure:12677: g++ -o conftest -g -O2 conftest.cpp -lm >&5
configure:12680: $? = 0
configure:12686: ./conftest
configure:12689: $? = 1
configure: program exited with status 1
configure: failed program was:
| /* confdefs.h. */
| #define PACKAGE_NAME "aranym"
| #define PACKAGE_TARNAME "aranym"
| #define PACKAGE_VERSION "0.9"
| #define PACKAGE_STRING "aranym 0.9"
| #define PACKAGE_BUGREPORT "aranym@bobek.sh.cvut.cz"
| #define OS_TYPE "linux"
| #define CPU_TYPE "powerpc"
| #define STDC_HEADERS 1
| #define HAVE_DIRENT_H 1
| #define HAVE_SYS_TYPES_H 1
| #define HAVE_SYS_STAT_H 1
| #define HAVE_STDLIB_H 1
| #define HAVE_STRING_H 1
| #define HAVE_MEMORY_H 1
| #define HAVE_STRINGS_H 1
| #define HAVE_INTTYPES_H 1
| #define HAVE_STDINT_H 1
| #define HAVE_UNISTD_H 1
| #define HAVE_UNISTD_H 1
| #define HAVE_FCNTL_H 1
| #define HAVE_SYS_MMAN_H 1
| #define HAVE_SYS_IOCTL_H 1
| #define HAVE_GETOPT_H 1
| #define HAVE_TERMIOS_H 1
| #define HAVE_TERMIO_H 1
| #define HAVE_ALLOCA_H 1
| #define HAVE_SYS_STATFS_H 1
| #define HAVE_SYS_STATVFS_H 1
| #define HAVE_SYS_TYPES_H 1
| #define HAVE_SYS_STAT_H 1
| #define HAVE_SYS_VFS_H 1
| #define HAVE_UTIME_H 1
| #define HAVE_SYS_PARAM_H 1
| #define HAVE_SYS_MOUNT_H 1
| #define HAVE_SYS_SOCKET_H 1
| #define HAVE_LINUX_IF_H 1
| #define HAVE_LINUX_IF_TUN_H 1
| #define HAVE_NET_IF_H 1
| #define WORDS_BIGENDIAN 1
| #define SIZEOF_SHORT 2
| #define SIZEOF_INT 4
| #define SIZEOF_LONG 4
| #define SIZEOF_LONG_LONG 8
| #define SIZEOF_FLOAT 4
| #define SIZEOF_DOUBLE 8
| #define SIZEOF_LONG_DOUBLE 8
| #define SIZEOF_VOID_P 4
| #define RETSIGTYPE void
| #define TIME_WITH_SYS_TIME 1
| #define _FILE_OFFSET_BITS 64
| #define HAVE_BOOL
| #define HAVE_LIBM 1
| #define HAVE_STRDUP 1
| #define HAVE_SIGACTION 1
| #define HAVE_SIGNAL 1
| #define HAVE_MMAP 1
| #define HAVE_MPROTECT 1
| #define HAVE_MUNMAP 1
| #define HAVE_STRCHR 1
| #define HAVE_MEMCPY 1
| #define HAVE_BCOPY 1
| #define HAVE_USLEEP 1
| #define HAVE_GETTIMEOFDAY 1
| #define HAVE_CADDR_T 1
| #define DIRSEPARATOR "/"
| #define ENABLE_TUNTAP 1
| #define HAVE_MMAP_VM 1
| #define HAVE_MMAP_ANON 1
| #define HAVE_MMAP_ANONYMOUS 1
| #define HAVE_MMAP_VM 1
| /* end confdefs.h. */
|
| #include <stdlib.h>
| #ifdef HAVE_UNISTD_H
| #include <unistd.h>
| #endif
| #include <signal.h>
| static int handled_signal = 0;
| RETSIGTYPE sigusr1_handler(int) { handled_signal++; }
| typedef RETSIGTYPE (*signal_handler)(int);
| static signal_handler mysignal(int sig, signal_handler handler) {
| struct sigaction old_sa;
| struct sigaction new_sa;
| new_sa.sa_handler = handler;
| return ((sigaction(sig,&new_sa,&old_sa) < 0) ? SIG_IGN : old_sa.sa_handler);
| }
| int main(void) { /* returns 0 if signals need not to be reinstalled */
| mysignal(SIGUSR1, sigusr1_handler); raise(SIGUSR1); raise(SIGUSR1);
| exit(handled_signal == 2);
| }
|
configure:12713: result: no
configure:12725: checking for vasprintf
configure:12766: g++ -c -g -O2 conftest.cpp >&5
conftest.cpp:74:1: warning: "_GNU_SOURCE" redefined
<command line>:1:1: warning: this is the location of the previous definition
configure:12772: $? = 0
configure:12796: result: yes
configure:12812: checking for sighandler_t
configure:12852: g++ -c -g -O2 conftest.cpp >&5
conftest.cpp:75:1: warning: "_GNU_SOURCE" redefined
<command line>:1:1: warning: this is the location of the previous definition
configure:12858: $? = 0
configure:12882: result: yes
configure:12894: checking for getopt_long
configure:12934: g++ -c -g -O2 conftest.cpp >&5
conftest.cpp:76:1: warning: "_GNU_SOURCE" redefined
<command line>:1:1: warning: this is the location of the previous definition
configure:12940: $? = 0
configure:12964: result: yes
configure:13359: checking for the addressing mode to use
configure:13436: result: real
configure:13446: checking for GAS .p2align feature
configure:13453: result: yes
configure:13457: checking for GCC 2.7 or higher
configure:13472: result: yes
configure:13482: checking for GCC 3.0 or higher
configure:13497: result: yes
configure:13586: checking whether GCC supports store motion
configure:13620: g++ -c -g -O2 -fno-gcse-sm -I$(srcdir)/../gui-sdl conftest.cpp >&5
configure:13626: $? = 0
configure:13648: result: yes
configure:13765: checking floating point format
configure:13800: gcc -c -g -O2 -I$(srcdir)/../gui-sdl conftest.c >&5
configure:13803: $? = 0
configure:13848: result: IEEE (big-endian)
configure:13910: checking ieee754.h usability
configure:13927: gcc -c -g -O2 -I$(srcdir)/../gui-sdl conftest.c >&5
configure:13933: $? = 0
configure:13947: result: yes
configure:13951: checking ieee754.h presence
configure:13966: gcc -E -I$(srcdir)/../gui-sdl conftest.c
configure:13972: $? = 0
configure:13986: result: yes
configure:14019: checking for ieee754.h
configure:14027: result: yes
configure:13910: checking ieeefp.h usability
configure:13927: gcc -c -g -O2 -I$(srcdir)/../gui-sdl conftest.c >&5
conftest.c:119:20: error: ieeefp.h: No such file or directory
configure:13933: $? = 1
configure: failed program was:
| /* confdefs.h. */
| #define PACKAGE_NAME "aranym"
| #define PACKAGE_TARNAME "aranym"
| #define PACKAGE_VERSION "0.9"
| #define PACKAGE_STRING "aranym 0.9"
| #define PACKAGE_BUGREPORT "aranym@bobek.sh.cvut.cz"
| #define OS_TYPE "linux"
| #define CPU_TYPE "powerpc"
| #define STDC_HEADERS 1
| #define HAVE_DIRENT_H 1
| #define HAVE_SYS_TYPES_H 1
| #define HAVE_SYS_STAT_H 1
| #define HAVE_STDLIB_H 1
| #define HAVE_STRING_H 1
| #define HAVE_MEMORY_H 1
| #define HAVE_STRINGS_H 1
| #define HAVE_INTTYPES_H 1
| #define HAVE_STDINT_H 1
| #define HAVE_UNISTD_H 1
| #define HAVE_UNISTD_H 1
| #define HAVE_FCNTL_H 1
| #define HAVE_SYS_MMAN_H 1
| #define HAVE_SYS_IOCTL_H 1
| #define HAVE_GETOPT_H 1
| #define HAVE_TERMIOS_H 1
| #define HAVE_TERMIO_H 1
| #define HAVE_ALLOCA_H 1
| #define HAVE_SYS_STATFS_H 1
| #define HAVE_SYS_STATVFS_H 1
| #define HAVE_SYS_TYPES_H 1
| #define HAVE_SYS_STAT_H 1
| #define HAVE_SYS_VFS_H 1
| #define HAVE_UTIME_H 1
| #define HAVE_SYS_PARAM_H 1
| #define HAVE_SYS_MOUNT_H 1
| #define HAVE_SYS_SOCKET_H 1
| #define HAVE_LINUX_IF_H 1
| #define HAVE_LINUX_IF_TUN_H 1
| #define HAVE_NET_IF_H 1
| #define WORDS_BIGENDIAN 1
| #define SIZEOF_SHORT 2
| #define SIZEOF_INT 4
| #define SIZEOF_LONG 4
| #define SIZEOF_LONG_LONG 8
| #define SIZEOF_FLOAT 4
| #define SIZEOF_DOUBLE 8
| #define SIZEOF_LONG_DOUBLE 8
| #define SIZEOF_VOID_P 4
| #define RETSIGTYPE void
| #define TIME_WITH_SYS_TIME 1
| #define _FILE_OFFSET_BITS 64
| #define HAVE_BOOL
| #define HAVE_LIBM 1
| #define HAVE_STRDUP 1
| #define HAVE_SIGACTION 1
| #define HAVE_SIGNAL 1
| #define HAVE_MMAP 1
| #define HAVE_MPROTECT 1
| #define HAVE_MUNMAP 1
| #define HAVE_STRCHR 1
| #define HAVE_MEMCPY 1
| #define HAVE_BCOPY 1
| #define HAVE_USLEEP 1
| #define HAVE_GETTIMEOFDAY 1
| #define HAVE_CADDR_T 1
| #define DIRSEPARATOR "/"
| #define ENABLE_TUNTAP 1
| #define HAVE_MMAP_VM 1
| #define HAVE_MMAP_ANON 1
| #define HAVE_MMAP_ANONYMOUS 1
| #define HAVE_MMAP_VM 1
| #define HAVE_GNU_SOURCE 1
| #define HAVE_SIGHANDLER_T 1
| #define HAVE_GETOPT_H 1
| #define ARAM_PAGE_CHECK 1
| #define SUPPORT_CDROM 1
| #define DSP_EMULATION 1
| #define PROTECT2K 1
| #define ENABLE_REALSTOP 1
| #define ETHERNET_SUPPORT 1
| #define HOSTFS_SUPPORT 1
| #define SDL_GUI 1
| #define HOST_FLOAT_FORMAT IEEE_FLOAT_FORMAT
| #define HAVE_IEEE754_H 1
| /* end confdefs.h. */
| #include <stdio.h>
| #ifdef HAVE_SYS_TYPES_H
| # include <sys/types.h>
| #endif
| #ifdef HAVE_SYS_STAT_H
| # include <sys/stat.h>
| #endif
| #ifdef STDC_HEADERS
| # include <stdlib.h>
| # include <stddef.h>
| #else
| # ifdef HAVE_STDLIB_H
| # include <stdlib.h>
| # endif
| #endif
| #ifdef HAVE_STRING_H
| # if !defined STDC_HEADERS && defined HAVE_MEMORY_H
| # include <memory.h>
| # endif
| # include <string.h>
| #endif
| #ifdef HAVE_STRINGS_H
| # include <strings.h>
| #endif
| #ifdef HAVE_INTTYPES_H
| # include <inttypes.h>
| #endif
| #ifdef HAVE_STDINT_H
| # include <stdint.h>
| #endif
| #ifdef HAVE_UNISTD_H
| # include <unistd.h>
| #endif
| #include <ieeefp.h>
configure:13947: result: no
configure:13951: checking ieeefp.h presence
configure:13966: gcc -E -I$(srcdir)/../gui-sdl conftest.c
conftest.c:86:20: error: ieeefp.h: No such file or directory
configure:13972: $? = 1
configure: failed program was:
| /* confdefs.h. */
| #define PACKAGE_NAME "aranym"
| #define PACKAGE_TARNAME "aranym"
| #define PACKAGE_VERSION "0.9"
| #define PACKAGE_STRING "aranym 0.9"
| #define PACKAGE_BUGREPORT "aranym@bobek.sh.cvut.cz"
| #define OS_TYPE "linux"
| #define CPU_TYPE "powerpc"
| #define STDC_HEADERS 1
| #define HAVE_DIRENT_H 1
| #define HAVE_SYS_TYPES_H 1
| #define HAVE_SYS_STAT_H 1
| #define HAVE_STDLIB_H 1
| #define HAVE_STRING_H 1
| #define HAVE_MEMORY_H 1
| #define HAVE_STRINGS_H 1
| #define HAVE_INTTYPES_H 1
| #define HAVE_STDINT_H 1
| #define HAVE_UNISTD_H 1
| #define HAVE_UNISTD_H 1
| #define HAVE_FCNTL_H 1
| #define HAVE_SYS_MMAN_H 1
| #define HAVE_SYS_IOCTL_H 1
| #define HAVE_GETOPT_H 1
| #define HAVE_TERMIOS_H 1
| #define HAVE_TERMIO_H 1
| #define HAVE_ALLOCA_H 1
| #define HAVE_SYS_STATFS_H 1
| #define HAVE_SYS_STATVFS_H 1
| #define HAVE_SYS_TYPES_H 1
| #define HAVE_SYS_STAT_H 1
| #define HAVE_SYS_VFS_H 1
| #define HAVE_UTIME_H 1
| #define HAVE_SYS_PARAM_H 1
| #define HAVE_SYS_MOUNT_H 1
| #define HAVE_SYS_SOCKET_H 1
| #define HAVE_LINUX_IF_H 1
| #define HAVE_LINUX_IF_TUN_H 1
| #define HAVE_NET_IF_H 1
| #define WORDS_BIGENDIAN 1
| #define SIZEOF_SHORT 2
| #define SIZEOF_INT 4
| #define SIZEOF_LONG 4
| #define SIZEOF_LONG_LONG 8
| #define SIZEOF_FLOAT 4
| #define SIZEOF_DOUBLE 8
| #define SIZEOF_LONG_DOUBLE 8
| #define SIZEOF_VOID_P 4
| #define RETSIGTYPE void
| #define TIME_WITH_SYS_TIME 1
| #define _FILE_OFFSET_BITS 64
| #define HAVE_BOOL
| #define HAVE_LIBM 1
| #define HAVE_STRDUP 1
| #define HAVE_SIGACTION 1
| #define HAVE_SIGNAL 1
| #define HAVE_MMAP 1
| #define HAVE_MPROTECT 1
| #define HAVE_MUNMAP 1
| #define HAVE_STRCHR 1
| #define HAVE_MEMCPY 1
| #define HAVE_BCOPY 1
| #define HAVE_USLEEP 1
| #define HAVE_GETTIMEOFDAY 1
| #define HAVE_CADDR_T 1
| #define DIRSEPARATOR "/"
| #define ENABLE_TUNTAP 1
| #define HAVE_MMAP_VM 1
| #define HAVE_MMAP_ANON 1
| #define HAVE_MMAP_ANONYMOUS 1
| #define HAVE_MMAP_VM 1
| #define HAVE_GNU_SOURCE 1
| #define HAVE_SIGHANDLER_T 1
| #define HAVE_GETOPT_H 1
| #define ARAM_PAGE_CHECK 1
| #define SUPPORT_CDROM 1
| #define DSP_EMULATION 1
| #define PROTECT2K 1
| #define ENABLE_REALSTOP 1
| #define ETHERNET_SUPPORT 1
| #define HOSTFS_SUPPORT 1
| #define SDL_GUI 1
| #define HOST_FLOAT_FORMAT IEEE_FLOAT_FORMAT
| #define HAVE_IEEE754_H 1
| /* end confdefs.h. */
| #include <ieeefp.h>
configure:13986: result: no
configure:14019: checking for ieeefp.h
configure:14027: result: no
configure:13910: checking floatingpoint.h usability
configure:13927: gcc -c -g -O2 -I$(srcdir)/../gui-sdl conftest.c >&5
conftest.c:119:27: error: floatingpoint.h: No such file or directory
configure:13933: $? = 1
configure: failed program was:
| /* confdefs.h. */
| #define PACKAGE_NAME "aranym"
| #define PACKAGE_TARNAME "aranym"
| #define PACKAGE_VERSION "0.9"
| #define PACKAGE_STRING "aranym 0.9"
| #define PACKAGE_BUGREPORT "aranym@bobek.sh.cvut.cz"
| #define OS_TYPE "linux"
| #define CPU_TYPE "powerpc"
| #define STDC_HEADERS 1
| #define HAVE_DIRENT_H 1
| #define HAVE_SYS_TYPES_H 1
| #define HAVE_SYS_STAT_H 1
| #define HAVE_STDLIB_H 1
| #define HAVE_STRING_H 1
| #define HAVE_MEMORY_H 1
| #define HAVE_STRINGS_H 1
| #define HAVE_INTTYPES_H 1
| #define HAVE_STDINT_H 1
| #define HAVE_UNISTD_H 1
| #define HAVE_UNISTD_H 1
| #define HAVE_FCNTL_H 1
| #define HAVE_SYS_MMAN_H 1
| #define HAVE_SYS_IOCTL_H 1
| #define HAVE_GETOPT_H 1
| #define HAVE_TERMIOS_H 1
| #define HAVE_TERMIO_H 1
| #define HAVE_ALLOCA_H 1
| #define HAVE_SYS_STATFS_H 1
| #define HAVE_SYS_STATVFS_H 1
| #define HAVE_SYS_TYPES_H 1
| #define HAVE_SYS_STAT_H 1
| #define HAVE_SYS_VFS_H 1
| #define HAVE_UTIME_H 1
| #define HAVE_SYS_PARAM_H 1
| #define HAVE_SYS_MOUNT_H 1
| #define HAVE_SYS_SOCKET_H 1
| #define HAVE_LINUX_IF_H 1
| #define HAVE_LINUX_IF_TUN_H 1
| #define HAVE_NET_IF_H 1
| #define WORDS_BIGENDIAN 1
| #define SIZEOF_SHORT 2
| #define SIZEOF_INT 4
| #define SIZEOF_LONG 4
| #define SIZEOF_LONG_LONG 8
| #define SIZEOF_FLOAT 4
| #define SIZEOF_DOUBLE 8
| #define SIZEOF_LONG_DOUBLE 8
| #define SIZEOF_VOID_P 4
| #define RETSIGTYPE void
| #define TIME_WITH_SYS_TIME 1
| #define _FILE_OFFSET_BITS 64
| #define HAVE_BOOL
| #define HAVE_LIBM 1
| #define HAVE_STRDUP 1
| #define HAVE_SIGACTION 1
| #define HAVE_SIGNAL 1
| #define HAVE_MMAP 1
| #define HAVE_MPROTECT 1
| #define HAVE_MUNMAP 1
| #define HAVE_STRCHR 1
| #define HAVE_MEMCPY 1
| #define HAVE_BCOPY 1
| #define HAVE_USLEEP 1
| #define HAVE_GETTIMEOFDAY 1
| #define HAVE_CADDR_T 1
| #define DIRSEPARATOR "/"
| #define ENABLE_TUNTAP 1
| #define HAVE_MMAP_VM 1
| #define HAVE_MMAP_ANON 1
| #define HAVE_MMAP_ANONYMOUS 1
| #define HAVE_MMAP_VM 1
| #define HAVE_GNU_SOURCE 1
| #define HAVE_SIGHANDLER_T 1
| #define HAVE_GETOPT_H 1
| #define ARAM_PAGE_CHECK 1
| #define SUPPORT_CDROM 1
| #define DSP_EMULATION 1
| #define PROTECT2K 1
| #define ENABLE_REALSTOP 1
| #define ETHERNET_SUPPORT 1
| #define HOSTFS_SUPPORT 1
| #define SDL_GUI 1
| #define HOST_FLOAT_FORMAT IEEE_FLOAT_FORMAT
| #define HAVE_IEEE754_H 1
| /* end confdefs.h. */
| #include <stdio.h>
| #ifdef HAVE_SYS_TYPES_H
| # include <sys/types.h>
| #endif
| #ifdef HAVE_SYS_STAT_H
| # include <sys/stat.h>
| #endif
| #ifdef STDC_HEADERS
| # include <stdlib.h>
| # include <stddef.h>
| #else
| # ifdef HAVE_STDLIB_H
| # include <stdlib.h>
| # endif
| #endif
| #ifdef HAVE_STRING_H
| # if !defined STDC_HEADERS && defined HAVE_MEMORY_H
| # include <memory.h>
| # endif
| # include <string.h>
| #endif
| #ifdef HAVE_STRINGS_H
| # include <strings.h>
| #endif
| #ifdef HAVE_INTTYPES_H
| # include <inttypes.h>
| #endif
| #ifdef HAVE_STDINT_H
| # include <stdint.h>
| #endif
| #ifdef HAVE_UNISTD_H
| # include <unistd.h>
| #endif
| #include <floatingpoint.h>
configure:13947: result: no
configure:13951: checking floatingpoint.h presence
configure:13966: gcc -E -I$(srcdir)/../gui-sdl conftest.c
conftest.c:86:27: error: floatingpoint.h: No such file or directory
configure:13972: $? = 1
configure: failed program was:
| /* confdefs.h. */
| #define PACKAGE_NAME "aranym"
| #define PACKAGE_TARNAME "aranym"
| #define PACKAGE_VERSION "0.9"
| #define PACKAGE_STRING "aranym 0.9"
| #define PACKAGE_BUGREPORT "aranym@bobek.sh.cvut.cz"
| #define OS_TYPE "linux"
| #define CPU_TYPE "powerpc"
| #define STDC_HEADERS 1
| #define HAVE_DIRENT_H 1
| #define HAVE_SYS_TYPES_H 1
| #define HAVE_SYS_STAT_H 1
| #define HAVE_STDLIB_H 1
| #define HAVE_STRING_H 1
| #define HAVE_MEMORY_H 1
| #define HAVE_STRINGS_H 1
| #define HAVE_INTTYPES_H 1
| #define HAVE_STDINT_H 1
| #define HAVE_UNISTD_H 1
| #define HAVE_UNISTD_H 1
| #define HAVE_FCNTL_H 1
| #define HAVE_SYS_MMAN_H 1
| #define HAVE_SYS_IOCTL_H 1
| #define HAVE_GETOPT_H 1
| #define HAVE_TERMIOS_H 1
| #define HAVE_TERMIO_H 1
| #define HAVE_ALLOCA_H 1
| #define HAVE_SYS_STATFS_H 1
| #define HAVE_SYS_STATVFS_H 1
| #define HAVE_SYS_TYPES_H 1
| #define HAVE_SYS_STAT_H 1
| #define HAVE_SYS_VFS_H 1
| #define HAVE_UTIME_H 1
| #define HAVE_SYS_PARAM_H 1
| #define HAVE_SYS_MOUNT_H 1
| #define HAVE_SYS_SOCKET_H 1
| #define HAVE_LINUX_IF_H 1
| #define HAVE_LINUX_IF_TUN_H 1
| #define HAVE_NET_IF_H 1
| #define WORDS_BIGENDIAN 1
| #define SIZEOF_SHORT 2
| #define SIZEOF_INT 4
| #define SIZEOF_LONG 4
| #define SIZEOF_LONG_LONG 8
| #define SIZEOF_FLOAT 4
| #define SIZEOF_DOUBLE 8
| #define SIZEOF_LONG_DOUBLE 8
| #define SIZEOF_VOID_P 4
| #define RETSIGTYPE void
| #define TIME_WITH_SYS_TIME 1
| #define _FILE_OFFSET_BITS 64
| #define HAVE_BOOL
| #define HAVE_LIBM 1
| #define HAVE_STRDUP 1
| #define HAVE_SIGACTION 1
| #define HAVE_SIGNAL 1
| #define HAVE_MMAP 1
| #define HAVE_MPROTECT 1
| #define HAVE_MUNMAP 1
| #define HAVE_STRCHR 1
| #define HAVE_MEMCPY 1
| #define HAVE_BCOPY 1
| #define HAVE_USLEEP 1
| #define HAVE_GETTIMEOFDAY 1
| #define HAVE_CADDR_T 1
| #define DIRSEPARATOR "/"
| #define ENABLE_TUNTAP 1
| #define HAVE_MMAP_VM 1
| #define HAVE_MMAP_ANON 1
| #define HAVE_MMAP_ANONYMOUS 1
| #define HAVE_MMAP_VM 1
| #define HAVE_GNU_SOURCE 1
| #define HAVE_SIGHANDLER_T 1
| #define HAVE_GETOPT_H 1
| #define ARAM_PAGE_CHECK 1
| #define SUPPORT_CDROM 1
| #define DSP_EMULATION 1
| #define PROTECT2K 1
| #define ENABLE_REALSTOP 1
| #define ETHERNET_SUPPORT 1
| #define HOSTFS_SUPPORT 1
| #define SDL_GUI 1
| #define HOST_FLOAT_FORMAT IEEE_FLOAT_FORMAT
| #define HAVE_IEEE754_H 1
| /* end confdefs.h. */
| #include <floatingpoint.h>
configure:13986: result: no
configure:14019: checking for floatingpoint.h
configure:14027: result: no
configure:13910: checking nan.h usability
configure:13927: gcc -c -g -O2 -I$(srcdir)/../gui-sdl conftest.c >&5
conftest.c:119:17: error: nan.h: No such file or directory
configure:13933: $? = 1
configure: failed program was:
| /* confdefs.h. */
| #define PACKAGE_NAME "aranym"
| #define PACKAGE_TARNAME "aranym"
| #define PACKAGE_VERSION "0.9"
| #define PACKAGE_STRING "aranym 0.9"
| #define PACKAGE_BUGREPORT "aranym@bobek.sh.cvut.cz"
| #define OS_TYPE "linux"
| #define CPU_TYPE "powerpc"
| #define STDC_HEADERS 1
| #define HAVE_DIRENT_H 1
| #define HAVE_SYS_TYPES_H 1
| #define HAVE_SYS_STAT_H 1
| #define HAVE_STDLIB_H 1
| #define HAVE_STRING_H 1
| #define HAVE_MEMORY_H 1
| #define HAVE_STRINGS_H 1
| #define HAVE_INTTYPES_H 1
| #define HAVE_STDINT_H 1
| #define HAVE_UNISTD_H 1
| #define HAVE_UNISTD_H 1
| #define HAVE_FCNTL_H 1
| #define HAVE_SYS_MMAN_H 1
| #define HAVE_SYS_IOCTL_H 1
| #define HAVE_GETOPT_H 1
| #define HAVE_TERMIOS_H 1
| #define HAVE_TERMIO_H 1
| #define HAVE_ALLOCA_H 1
| #define HAVE_SYS_STATFS_H 1
| #define HAVE_SYS_STATVFS_H 1
| #define HAVE_SYS_TYPES_H 1
| #define HAVE_SYS_STAT_H 1
| #define HAVE_SYS_VFS_H 1
| #define HAVE_UTIME_H 1
| #define HAVE_SYS_PARAM_H 1
| #define HAVE_SYS_MOUNT_H 1
| #define HAVE_SYS_SOCKET_H 1
| #define HAVE_LINUX_IF_H 1
| #define HAVE_LINUX_IF_TUN_H 1
| #define HAVE_NET_IF_H 1
| #define WORDS_BIGENDIAN 1
| #define SIZEOF_SHORT 2
| #define SIZEOF_INT 4
| #define SIZEOF_LONG 4
| #define SIZEOF_LONG_LONG 8
| #define SIZEOF_FLOAT 4
| #define SIZEOF_DOUBLE 8
| #define SIZEOF_LONG_DOUBLE 8
| #define SIZEOF_VOID_P 4
| #define RETSIGTYPE void
| #define TIME_WITH_SYS_TIME 1
| #define _FILE_OFFSET_BITS 64
| #define HAVE_BOOL
| #define HAVE_LIBM 1
| #define HAVE_STRDUP 1
| #define HAVE_SIGACTION 1
| #define HAVE_SIGNAL 1
| #define HAVE_MMAP 1
| #define HAVE_MPROTECT 1
| #define HAVE_MUNMAP 1
| #define HAVE_STRCHR 1
| #define HAVE_MEMCPY 1
| #define HAVE_BCOPY 1
| #define HAVE_USLEEP 1
| #define HAVE_GETTIMEOFDAY 1
| #define HAVE_CADDR_T 1
| #define DIRSEPARATOR "/"
| #define ENABLE_TUNTAP 1
| #define HAVE_MMAP_VM 1
| #define HAVE_MMAP_ANON 1
| #define HAVE_MMAP_ANONYMOUS 1
| #define HAVE_MMAP_VM 1
| #define HAVE_GNU_SOURCE 1
| #define HAVE_SIGHANDLER_T 1
| #define HAVE_GETOPT_H 1
| #define ARAM_PAGE_CHECK 1
| #define SUPPORT_CDROM 1
| #define DSP_EMULATION 1
| #define PROTECT2K 1
| #define ENABLE_REALSTOP 1
| #define ETHERNET_SUPPORT 1
| #define HOSTFS_SUPPORT 1
| #define SDL_GUI 1
| #define HOST_FLOAT_FORMAT IEEE_FLOAT_FORMAT
| #define HAVE_IEEE754_H 1
| /* end confdefs.h. */
| #include <stdio.h>
| #ifdef HAVE_SYS_TYPES_H
| # include <sys/types.h>
| #endif
| #ifdef HAVE_SYS_STAT_H
| # include <sys/stat.h>
| #endif
| #ifdef STDC_HEADERS
| # include <stdlib.h>
| # include <stddef.h>
| #else
| # ifdef HAVE_STDLIB_H
| # include <stdlib.h>
| # endif
| #endif
| #ifdef HAVE_STRING_H
| # if !defined STDC_HEADERS && defined HAVE_MEMORY_H
| # include <memory.h>
| # endif
| # include <string.h>
| #endif
| #ifdef HAVE_STRINGS_H
| # include <strings.h>
| #endif
| #ifdef HAVE_INTTYPES_H
| # include <inttypes.h>
| #endif
| #ifdef HAVE_STDINT_H
| # include <stdint.h>
| #endif
| #ifdef HAVE_UNISTD_H
| # include <unistd.h>
| #endif
| #include <nan.h>
configure:13947: result: no
configure:13951: checking nan.h presence
configure:13966: gcc -E -I$(srcdir)/../gui-sdl conftest.c
conftest.c:86:17: error: nan.h: No such file or directory
configure:13972: $? = 1
configure: failed program was:
| /* confdefs.h. */
| #define PACKAGE_NAME "aranym"
| #define PACKAGE_TARNAME "aranym"
| #define PACKAGE_VERSION "0.9"
| #define PACKAGE_STRING "aranym 0.9"
| #define PACKAGE_BUGREPORT "aranym@bobek.sh.cvut.cz"
| #define OS_TYPE "linux"
| #define CPU_TYPE "powerpc"
| #define STDC_HEADERS 1
| #define HAVE_DIRENT_H 1
| #define HAVE_SYS_TYPES_H 1
| #define HAVE_SYS_STAT_H 1
| #define HAVE_STDLIB_H 1
| #define HAVE_STRING_H 1
| #define HAVE_MEMORY_H 1
| #define HAVE_STRINGS_H 1
| #define HAVE_INTTYPES_H 1
| #define HAVE_STDINT_H 1
| #define HAVE_UNISTD_H 1
| #define HAVE_UNISTD_H 1
| #define HAVE_FCNTL_H 1
| #define HAVE_SYS_MMAN_H 1
| #define HAVE_SYS_IOCTL_H 1
| #define HAVE_GETOPT_H 1
| #define HAVE_TERMIOS_H 1
| #define HAVE_TERMIO_H 1
| #define HAVE_ALLOCA_H 1
| #define HAVE_SYS_STATFS_H 1
| #define HAVE_SYS_STATVFS_H 1
| #define HAVE_SYS_TYPES_H 1
| #define HAVE_SYS_STAT_H 1
| #define HAVE_SYS_VFS_H 1
| #define HAVE_UTIME_H 1
| #define HAVE_SYS_PARAM_H 1
| #define HAVE_SYS_MOUNT_H 1
| #define HAVE_SYS_SOCKET_H 1
| #define HAVE_LINUX_IF_H 1
| #define HAVE_LINUX_IF_TUN_H 1
| #define HAVE_NET_IF_H 1
| #define WORDS_BIGENDIAN 1
| #define SIZEOF_SHORT 2
| #define SIZEOF_INT 4
| #define SIZEOF_LONG 4
| #define SIZEOF_LONG_LONG 8
| #define SIZEOF_FLOAT 4
| #define SIZEOF_DOUBLE 8
| #define SIZEOF_LONG_DOUBLE 8
| #define SIZEOF_VOID_P 4
| #define RETSIGTYPE void
| #define TIME_WITH_SYS_TIME 1
| #define _FILE_OFFSET_BITS 64
| #define HAVE_BOOL
| #define HAVE_LIBM 1
| #define HAVE_STRDUP 1
| #define HAVE_SIGACTION 1
| #define HAVE_SIGNAL 1
| #define HAVE_MMAP 1
| #define HAVE_MPROTECT 1
| #define HAVE_MUNMAP 1
| #define HAVE_STRCHR 1
| #define HAVE_MEMCPY 1
| #define HAVE_BCOPY 1
| #define HAVE_USLEEP 1
| #define HAVE_GETTIMEOFDAY 1
| #define HAVE_CADDR_T 1
| #define DIRSEPARATOR "/"
| #define ENABLE_TUNTAP 1
| #define HAVE_MMAP_VM 1
| #define HAVE_MMAP_ANON 1
| #define HAVE_MMAP_ANONYMOUS 1
| #define HAVE_MMAP_VM 1
| #define HAVE_GNU_SOURCE 1
| #define HAVE_SIGHANDLER_T 1
| #define HAVE_GETOPT_H 1
| #define ARAM_PAGE_CHECK 1
| #define SUPPORT_CDROM 1
| #define DSP_EMULATION 1
| #define PROTECT2K 1
| #define ENABLE_REALSTOP 1
| #define ETHERNET_SUPPORT 1
| #define HOSTFS_SUPPORT 1
| #define SDL_GUI 1
| #define HOST_FLOAT_FORMAT IEEE_FLOAT_FORMAT
| #define HAVE_IEEE754_H 1
| /* end confdefs.h. */
| #include <nan.h>
configure:13986: result: no
configure:14019: checking for nan.h
configure:14027: result: no
configure:13910: checking math.h usability
configure:13927: gcc -c -g -O2 -I$(srcdir)/../gui-sdl conftest.c >&5
configure:13933: $? = 0
configure:13947: result: yes
configure:13951: checking math.h presence
configure:13966: gcc -E -I$(srcdir)/../gui-sdl conftest.c
configure:13972: $? = 0
configure:13986: result: yes
configure:14019: checking for math.h
configure:14027: result: yes
configure:14584: checking for atanh
configure:14640: gcc -o conftest -g -O2 -I$(srcdir)/../gui-sdl conftest.c -lm >&5
conftest.c:110: warning: conflicting types for built-in function 'atanh'
configure:14646: $? = 0
configure:14664: result: yes
configure:14682: checking for isnan
configure:14738: gcc -o conftest -g -O2 -I$(srcdir)/../gui-sdl conftest.c -lm >&5
conftest.c:111: warning: conflicting types for built-in function 'isnan'
configure:14744: $? = 0
configure:14762: result: yes
configure:14682: checking for isinf
configure:14738: gcc -o conftest -g -O2 -I$(srcdir)/../gui-sdl conftest.c -lm >&5
conftest.c:112: warning: conflicting types for built-in function 'isinf'
configure:14744: $? = 0
configure:14762: result: yes
configure:14682: checking for finite
configure:14738: gcc -o conftest -g -O2 -I$(srcdir)/../gui-sdl conftest.c -lm >&5
conftest.c:113: warning: conflicting types for built-in function 'finite'
configure:14744: $? = 0
configure:14762: result: yes
configure:14682: checking for isnormal
configure:14738: gcc -o conftest -g -O2 -I$(srcdir)/../gui-sdl conftest.c -lm >&5
/tmp/cccj4AOJ.o: In function `main':
/mnt/usbdrive/aranym/src/Unix/conftest.c:125: undefined reference to `isnormal'
collect2: ld returned 1 exit status
configure:14744: $? = 1
configure: failed program was:
| /* confdefs.h. */
| #define PACKAGE_NAME "aranym"
| #define PACKAGE_TARNAME "aranym"
| #define PACKAGE_VERSION "0.9"
| #define PACKAGE_STRING "aranym 0.9"
| #define PACKAGE_BUGREPORT "aranym@bobek.sh.cvut.cz"
| #define OS_TYPE "linux"
| #define CPU_TYPE "powerpc"
| #define STDC_HEADERS 1
| #define HAVE_DIRENT_H 1
| #define HAVE_SYS_TYPES_H 1
| #define HAVE_SYS_STAT_H 1
| #define HAVE_STDLIB_H 1
| #define HAVE_STRING_H 1
| #define HAVE_MEMORY_H 1
| #define HAVE_STRINGS_H 1
| #define HAVE_INTTYPES_H 1
| #define HAVE_STDINT_H 1
| #define HAVE_UNISTD_H 1
| #define HAVE_UNISTD_H 1
| #define HAVE_FCNTL_H 1
| #define HAVE_SYS_MMAN_H 1
| #define HAVE_SYS_IOCTL_H 1
| #define HAVE_GETOPT_H 1
| #define HAVE_TERMIOS_H 1
| #define HAVE_TERMIO_H 1
| #define HAVE_ALLOCA_H 1
| #define HAVE_SYS_STATFS_H 1
| #define HAVE_SYS_STATVFS_H 1
| #define HAVE_SYS_TYPES_H 1
| #define HAVE_SYS_STAT_H 1
| #define HAVE_SYS_VFS_H 1
| #define HAVE_UTIME_H 1
| #define HAVE_SYS_PARAM_H 1
| #define HAVE_SYS_MOUNT_H 1
| #define HAVE_SYS_SOCKET_H 1
| #define HAVE_LINUX_IF_H 1
| #define HAVE_LINUX_IF_TUN_H 1
| #define HAVE_NET_IF_H 1
| #define WORDS_BIGENDIAN 1
| #define SIZEOF_SHORT 2
| #define SIZEOF_INT 4
| #define SIZEOF_LONG 4
| #define SIZEOF_LONG_LONG 8
| #define SIZEOF_FLOAT 4
| #define SIZEOF_DOUBLE 8
| #define SIZEOF_LONG_DOUBLE 8
| #define SIZEOF_VOID_P 4
| #define RETSIGTYPE void
| #define TIME_WITH_SYS_TIME 1
| #define _FILE_OFFSET_BITS 64
| #define HAVE_BOOL
| #define HAVE_LIBM 1
| #define HAVE_STRDUP 1
| #define HAVE_SIGACTION 1
| #define HAVE_SIGNAL 1
| #define HAVE_MMAP 1
| #define HAVE_MPROTECT 1
| #define HAVE_MUNMAP 1
| #define HAVE_STRCHR 1
| #define HAVE_MEMCPY 1
| #define HAVE_BCOPY 1
| #define HAVE_USLEEP 1
| #define HAVE_GETTIMEOFDAY 1
| #define HAVE_CADDR_T 1
| #define DIRSEPARATOR "/"
| #define ENABLE_TUNTAP 1
| #define HAVE_MMAP_VM 1
| #define HAVE_MMAP_ANON 1
| #define HAVE_MMAP_ANONYMOUS 1
| #define HAVE_MMAP_VM 1
| #define HAVE_GNU_SOURCE 1
| #define HAVE_SIGHANDLER_T 1
| #define HAVE_GETOPT_H 1
| #define ARAM_PAGE_CHECK 1
| #define SUPPORT_CDROM 1
| #define DSP_EMULATION 1
| #define PROTECT2K 1
| #define ENABLE_REALSTOP 1
| #define ETHERNET_SUPPORT 1
| #define HOSTFS_SUPPORT 1
| #define SDL_GUI 1
| #define HOST_FLOAT_FORMAT IEEE_FLOAT_FORMAT
| #define HAVE_IEEE754_H 1
| #define HAVE_MATH_H 1
| #define HAVE_ATANH 1
| #define HAVE_ISNAN 1
| #define HAVE_ISINF 1
| #define HAVE_FINITE 1
| /* end confdefs.h. */
| /* Define isnormal to an innocuous variant, in case <limits.h> declares isnormal.
| For example, HP-UX 11i <limits.h> declares gettimeofday. */
| #define isnormal innocuous_isnormal
|
| /* System header to define __stub macros and hopefully few prototypes,
| which can conflict with char isnormal (); below.
| Prefer <limits.h> to <assert.h> if __STDC__ is defined, since
| <limits.h> exists even on freestanding compilers. */
|
| #ifdef __STDC__
| # include <limits.h>
| #else
| # include <assert.h>
| #endif
|
| #undef isnormal
|
| /* Override any GCC internal prototype to avoid an error.
| Use char because int might match the return type of a GCC
| builtin and then its argument prototype would still apply. */
| #ifdef __cplusplus
| extern "C"
| #endif
| char isnormal ();
| /* The GNU C library defines this for functions which it implements
| to always fail with ENOSYS. Some functions are actually named
| something starting with __ and the normal name is an alias. */
| #if defined __stub_isnormal || defined __stub___isnormal
| choke me
| #endif
|
| int
| main ()
| {
| return isnormal ();
| ;
| return 0;
| }
configure:14762: result: no
configure:14682: checking for signbit
configure:14738: gcc -o conftest -g -O2 -I$(srcdir)/../gui-sdl conftest.c -lm >&5
conftest.c:114: warning: conflicting types for built-in function 'signbit'
/tmp/ccoAgoDi.o: In function `main':
/mnt/usbdrive/aranym/src/Unix/conftest.c:125: undefined reference to `signbit'
collect2: ld returned 1 exit status
configure:14744: $? = 1
configure: failed program was:
| /* confdefs.h. */
| #define PACKAGE_NAME "aranym"
| #define PACKAGE_TARNAME "aranym"
| #define PACKAGE_VERSION "0.9"
| #define PACKAGE_STRING "aranym 0.9"
| #define PACKAGE_BUGREPORT "aranym@bobek.sh.cvut.cz"
| #define OS_TYPE "linux"
| #define CPU_TYPE "powerpc"
| #define STDC_HEADERS 1
| #define HAVE_DIRENT_H 1
| #define HAVE_SYS_TYPES_H 1
| #define HAVE_SYS_STAT_H 1
| #define HAVE_STDLIB_H 1
| #define HAVE_STRING_H 1
| #define HAVE_MEMORY_H 1
| #define HAVE_STRINGS_H 1
| #define HAVE_INTTYPES_H 1
| #define HAVE_STDINT_H 1
| #define HAVE_UNISTD_H 1
| #define HAVE_UNISTD_H 1
| #define HAVE_FCNTL_H 1
| #define HAVE_SYS_MMAN_H 1
| #define HAVE_SYS_IOCTL_H 1
| #define HAVE_GETOPT_H 1
| #define HAVE_TERMIOS_H 1
| #define HAVE_TERMIO_H 1
| #define HAVE_ALLOCA_H 1
| #define HAVE_SYS_STATFS_H 1
| #define HAVE_SYS_STATVFS_H 1
| #define HAVE_SYS_TYPES_H 1
| #define HAVE_SYS_STAT_H 1
| #define HAVE_SYS_VFS_H 1
| #define HAVE_UTIME_H 1
| #define HAVE_SYS_PARAM_H 1
| #define HAVE_SYS_MOUNT_H 1
| #define HAVE_SYS_SOCKET_H 1
| #define HAVE_LINUX_IF_H 1
| #define HAVE_LINUX_IF_TUN_H 1
| #define HAVE_NET_IF_H 1
| #define WORDS_BIGENDIAN 1
| #define SIZEOF_SHORT 2
| #define SIZEOF_INT 4
| #define SIZEOF_LONG 4
| #define SIZEOF_LONG_LONG 8
| #define SIZEOF_FLOAT 4
| #define SIZEOF_DOUBLE 8
| #define SIZEOF_LONG_DOUBLE 8
| #define SIZEOF_VOID_P 4
| #define RETSIGTYPE void
| #define TIME_WITH_SYS_TIME 1
| #define _FILE_OFFSET_BITS 64
| #define HAVE_BOOL
| #define HAVE_LIBM 1
| #define HAVE_STRDUP 1
| #define HAVE_SIGACTION 1
| #define HAVE_SIGNAL 1
| #define HAVE_MMAP 1
| #define HAVE_MPROTECT 1
| #define HAVE_MUNMAP 1
| #define HAVE_STRCHR 1
| #define HAVE_MEMCPY 1
| #define HAVE_BCOPY 1
| #define HAVE_USLEEP 1
| #define HAVE_GETTIMEOFDAY 1
| #define HAVE_CADDR_T 1
| #define DIRSEPARATOR "/"
| #define ENABLE_TUNTAP 1
| #define HAVE_MMAP_VM 1
| #define HAVE_MMAP_ANON 1
| #define HAVE_MMAP_ANONYMOUS 1
| #define HAVE_MMAP_VM 1
| #define HAVE_GNU_SOURCE 1
| #define HAVE_SIGHANDLER_T 1
| #define HAVE_GETOPT_H 1
| #define ARAM_PAGE_CHECK 1
| #define SUPPORT_CDROM 1
| #define DSP_EMULATION 1
| #define PROTECT2K 1
| #define ENABLE_REALSTOP 1
| #define ETHERNET_SUPPORT 1
| #define HOSTFS_SUPPORT 1
| #define SDL_GUI 1
| #define HOST_FLOAT_FORMAT IEEE_FLOAT_FORMAT
| #define HAVE_IEEE754_H 1
| #define HAVE_MATH_H 1
| #define HAVE_ATANH 1
| #define HAVE_ISNAN 1
| #define HAVE_ISINF 1
| #define HAVE_FINITE 1
| /* end confdefs.h. */
| /* Define signbit to an innocuous variant, in case <limits.h> declares signbit.
| For example, HP-UX 11i <limits.h> declares gettimeofday. */
| #define signbit innocuous_signbit
|
| /* System header to define __stub macros and hopefully few prototypes,
| which can conflict with char signbit (); below.
| Prefer <limits.h> to <assert.h> if __STDC__ is defined, since
| <limits.h> exists even on freestanding compilers. */
|
| #ifdef __STDC__
| # include <limits.h>
| #else
| # include <assert.h>
| #endif
|
| #undef signbit
|
| /* Override any GCC internal prototype to avoid an error.
| Use char because int might match the return type of a GCC
| builtin and then its argument prototype would still apply. */
| #ifdef __cplusplus
| extern "C"
| #endif
| char signbit ();
| /* The GNU C library defines this for functions which it implements
| to always fail with ENOSYS. Some functions are actually named
| something starting with __ and the normal name is an alias. */
| #if defined __stub_signbit || defined __stub___signbit
| choke me
| #endif
|
| int
| main ()
| {
| return signbit ();
| ;
| return 0;
| }
configure:14762: result: no
configure:15001: checking for sdl-config
configure:15019: found /usr/bin/sdl-config
configure:15032: result: /usr/bin/sdl-config
configure:15041: checking for SDL - version >= 1.2.10
configure:15138: gcc -o conftest -O3 -I/usr/include/SDL -D_GNU_SOURCE=1 -D_REENTRANT -I$(srcdir)/../gui-sdl conftest.c -lm -lSDL -lpthread >&5
configure:15141: $? = 0
configure:15147: ./conftest
configure:15150: $? = 0
configure:15171: result: yes
configure:15270: checking for OpenGL support
configure:15312: gcc -c -O3 -I/usr/include/SDL -D_GNU_SOURCE=1 -D_REENTRANT -I$(srcdir)/../gui-sdl conftest.c >&5
configure:15318: $? = 0
configure:15332: result: yes
configure:15803: checking whether compiler supports framework SDL_image
configure:15832: gcc -o conftest -O3 -I$(srcdir)/../gui-sdl conftest.c -lm -framework SDL_image >&5
gcc: SDL_image: No such file or directory
cc1: error: unrecognized command line option "-framework"
configure:15838: $? = 1
configure: failed program was:
| /* confdefs.h. */
| #define PACKAGE_NAME "aranym"
| #define PACKAGE_TARNAME "aranym"
| #define PACKAGE_VERSION "0.9"
| #define PACKAGE_STRING "aranym 0.9"
| #define PACKAGE_BUGREPORT "aranym@bobek.sh.cvut.cz"
| #define OS_TYPE "linux"
| #define CPU_TYPE "powerpc"
| #define STDC_HEADERS 1
| #define HAVE_DIRENT_H 1
| #define HAVE_SYS_TYPES_H 1
| #define HAVE_SYS_STAT_H 1
| #define HAVE_STDLIB_H 1
| #define HAVE_STRING_H 1
| #define HAVE_MEMORY_H 1
| #define HAVE_STRINGS_H 1
| #define HAVE_INTTYPES_H 1
| #define HAVE_STDINT_H 1
| #define HAVE_UNISTD_H 1
| #define HAVE_UNISTD_H 1
| #define HAVE_FCNTL_H 1
| #define HAVE_SYS_MMAN_H 1
| #define HAVE_SYS_IOCTL_H 1
| #define HAVE_GETOPT_H 1
| #define HAVE_TERMIOS_H 1
| #define HAVE_TERMIO_H 1
| #define HAVE_ALLOCA_H 1
| #define HAVE_SYS_STATFS_H 1
| #define HAVE_SYS_STATVFS_H 1
| #define HAVE_SYS_TYPES_H 1
| #define HAVE_SYS_STAT_H 1
| #define HAVE_SYS_VFS_H 1
| #define HAVE_UTIME_H 1
| #define HAVE_SYS_PARAM_H 1
| #define HAVE_SYS_MOUNT_H 1
| #define HAVE_SYS_SOCKET_H 1
| #define HAVE_LINUX_IF_H 1
| #define HAVE_LINUX_IF_TUN_H 1
| #define HAVE_NET_IF_H 1
| #define WORDS_BIGENDIAN 1
| #define SIZEOF_SHORT 2
| #define SIZEOF_INT 4
| #define SIZEOF_LONG 4
| #define SIZEOF_LONG_LONG 8
| #define SIZEOF_FLOAT 4
| #define SIZEOF_DOUBLE 8
| #define SIZEOF_LONG_DOUBLE 8
| #define SIZEOF_VOID_P 4
| #define RETSIGTYPE void
| #define TIME_WITH_SYS_TIME 1
| #define _FILE_OFFSET_BITS 64
| #define HAVE_BOOL
| #define HAVE_LIBM 1
| #define HAVE_STRDUP 1
| #define HAVE_SIGACTION 1
| #define HAVE_SIGNAL 1
| #define HAVE_MMAP 1
| #define HAVE_MPROTECT 1
| #define HAVE_MUNMAP 1
| #define HAVE_STRCHR 1
| #define HAVE_MEMCPY 1
| #define HAVE_BCOPY 1
| #define HAVE_USLEEP 1
| #define HAVE_GETTIMEOFDAY 1
| #define HAVE_CADDR_T 1
| #define DIRSEPARATOR "/"
| #define ENABLE_TUNTAP 1
| #define HAVE_MMAP_VM 1
| #define HAVE_MMAP_ANON 1
| #define HAVE_MMAP_ANONYMOUS 1
| #define HAVE_MMAP_VM 1
| #define HAVE_GNU_SOURCE 1
| #define HAVE_SIGHANDLER_T 1
| #define HAVE_GETOPT_H 1
| #define ARAM_PAGE_CHECK 1
| #define SUPPORT_CDROM 1
| #define DSP_EMULATION 1
| #define PROTECT2K 1
| #define ENABLE_REALSTOP 1
| #define ETHERNET_SUPPORT 1
| #define HOSTFS_SUPPORT 1
| #define SDL_GUI 1
| #define HOST_FLOAT_FORMAT IEEE_FLOAT_FORMAT
| #define HAVE_IEEE754_H 1
| #define HAVE_MATH_H 1
| #define HAVE_ATANH 1
| #define HAVE_ISNAN 1
| #define HAVE_ISINF 1
| #define HAVE_FINITE 1
| #define DEBUGGER 1
| #define NEWDEBUG 1
| #define ENABLE_OPENGL 1
| #define NFCDROM_SUPPORT 1
| #define NFCDROM_LINUX_SUPPORT 1
| /* end confdefs.h. */
|
| int
| main ()
| {
|
| ;
| return 0;
| }
configure:15857: result: no
configure:15900: checking for IMG_isJPG in -lSDL_image
configure:15935: gcc -o conftest -O3 -I$(srcdir)/../gui-sdl conftest.c -lSDL_image -lm >&5
/mnt/livecd/usr/powerpc-unknown-linux-gnu/gcc-bin/4.1.1/../../../lib/gcc/powerpc-unknown-linux-gnu/4.1.1/../../../../powerpc-unknown-linux-gnu/bin/ld: cannot find -lSDL_image
collect2: ld returned 1 exit status
configure:15941: $? = 1
configure: failed program was:
| /* confdefs.h. */
| #define PACKAGE_NAME "aranym"
| #define PACKAGE_TARNAME "aranym"
| #define PACKAGE_VERSION "0.9"
| #define PACKAGE_STRING "aranym 0.9"
| #define PACKAGE_BUGREPORT "aranym@bobek.sh.cvut.cz"
| #define OS_TYPE "linux"
| #define CPU_TYPE "powerpc"
| #define STDC_HEADERS 1
| #define HAVE_DIRENT_H 1
| #define HAVE_SYS_TYPES_H 1
| #define HAVE_SYS_STAT_H 1
| #define HAVE_STDLIB_H 1
| #define HAVE_STRING_H 1
| #define HAVE_MEMORY_H 1
| #define HAVE_STRINGS_H 1
| #define HAVE_INTTYPES_H 1
| #define HAVE_STDINT_H 1
| #define HAVE_UNISTD_H 1
| #define HAVE_UNISTD_H 1
| #define HAVE_FCNTL_H 1
| #define HAVE_SYS_MMAN_H 1
| #define HAVE_SYS_IOCTL_H 1
| #define HAVE_GETOPT_H 1
| #define HAVE_TERMIOS_H 1
| #define HAVE_TERMIO_H 1
| #define HAVE_ALLOCA_H 1
| #define HAVE_SYS_STATFS_H 1
| #define HAVE_SYS_STATVFS_H 1
| #define HAVE_SYS_TYPES_H 1
| #define HAVE_SYS_STAT_H 1
| #define HAVE_SYS_VFS_H 1
| #define HAVE_UTIME_H 1
| #define HAVE_SYS_PARAM_H 1
| #define HAVE_SYS_MOUNT_H 1
| #define HAVE_SYS_SOCKET_H 1
| #define HAVE_LINUX_IF_H 1
| #define HAVE_LINUX_IF_TUN_H 1
| #define HAVE_NET_IF_H 1
| #define WORDS_BIGENDIAN 1
| #define SIZEOF_SHORT 2
| #define SIZEOF_INT 4
| #define SIZEOF_LONG 4
| #define SIZEOF_LONG_LONG 8
| #define SIZEOF_FLOAT 4
| #define SIZEOF_DOUBLE 8
| #define SIZEOF_LONG_DOUBLE 8
| #define SIZEOF_VOID_P 4
| #define RETSIGTYPE void
| #define TIME_WITH_SYS_TIME 1
| #define _FILE_OFFSET_BITS 64
| #define HAVE_BOOL
| #define HAVE_LIBM 1
| #define HAVE_STRDUP 1
| #define HAVE_SIGACTION 1
| #define HAVE_SIGNAL 1
| #define HAVE_MMAP 1
| #define HAVE_MPROTECT 1
| #define HAVE_MUNMAP 1
| #define HAVE_STRCHR 1
| #define HAVE_MEMCPY 1
| #define HAVE_BCOPY 1
| #define HAVE_USLEEP 1
| #define HAVE_GETTIMEOFDAY 1
| #define HAVE_CADDR_T 1
| #define DIRSEPARATOR "/"
| #define ENABLE_TUNTAP 1
| #define HAVE_MMAP_VM 1
| #define HAVE_MMAP_ANON 1
| #define HAVE_MMAP_ANONYMOUS 1
| #define HAVE_MMAP_VM 1
| #define HAVE_GNU_SOURCE 1
| #define HAVE_SIGHANDLER_T 1
| #define HAVE_GETOPT_H 1
| #define ARAM_PAGE_CHECK 1
| #define SUPPORT_CDROM 1
| #define DSP_EMULATION 1
| #define PROTECT2K 1
| #define ENABLE_REALSTOP 1
| #define ETHERNET_SUPPORT 1
| #define HOSTFS_SUPPORT 1
| #define SDL_GUI 1
| #define HOST_FLOAT_FORMAT IEEE_FLOAT_FORMAT
| #define HAVE_IEEE754_H 1
| #define HAVE_MATH_H 1
| #define HAVE_ATANH 1
| #define HAVE_ISNAN 1
| #define HAVE_ISINF 1
| #define HAVE_FINITE 1
| #define DEBUGGER 1
| #define NEWDEBUG 1
| #define ENABLE_OPENGL 1
| #define NFCDROM_SUPPORT 1
| #define NFCDROM_LINUX_SUPPORT 1
| /* end confdefs.h. */
|
| /* Override any GCC internal prototype to avoid an error.
| Use char because int might match the return type of a GCC
| builtin and then its argument prototype would still apply. */
| #ifdef __cplusplus
| extern "C"
| #endif
| char IMG_isJPG ();
| int
| main ()
| {
| return IMG_isJPG ();
| ;
| return 0;
| }
configure:15959: result: no
configure:16223: creating ./config.status
## ---------------------- ##
## Running config.status. ##
## ---------------------- ##
This file was extended by aranym config.status 0.9, which was
generated by GNU Autoconf 2.61. Invocation command line was
CONFIG_FILES =
CONFIG_HEADERS =
CONFIG_LINKS =
CONFIG_COMMANDS =
$ ./config.status
on livecd
config.status:636: creating Makefile
config.status:771: WARNING: Makefile.in seems to ignore the --datarootdir setting
config.status:636: creating config.h
## ---------------- ##
## Cache variables. ##
## ---------------- ##
ac_cv_build=powerpc64-unknown-linux-gnu
ac_cv_c_bigendian=yes
ac_cv_c_compiler_gnu=yes
ac_cv_c_const=yes
ac_cv_c_float_format='IEEE (big-endian)'
ac_cv_c_inline=inline
ac_cv_c_volatile=yes
ac_cv_can_map_lm=yes
ac_cv_cxx_bool=yes
ac_cv_cxx_compiler_gnu=yes
ac_cv_env_CCC_set=
ac_cv_env_CCC_value=
ac_cv_env_CC_set=
ac_cv_env_CC_value=
ac_cv_env_CFLAGS_set=
ac_cv_env_CFLAGS_value=
ac_cv_env_CPPFLAGS_set=
ac_cv_env_CPPFLAGS_value=
ac_cv_env_CPP_set=
ac_cv_env_CPP_value=
ac_cv_env_CXXCPP_set=
ac_cv_env_CXXCPP_value=
ac_cv_env_CXXFLAGS_set=
ac_cv_env_CXXFLAGS_value=
ac_cv_env_CXX_set=
ac_cv_env_CXX_value=
ac_cv_env_LDFLAGS_set=
ac_cv_env_LDFLAGS_value=
ac_cv_env_LIBS_set=
ac_cv_env_LIBS_value=
ac_cv_env_build_alias_set=
ac_cv_env_build_alias_value=
ac_cv_env_host_alias_set=
ac_cv_env_host_alias_value=
ac_cv_env_target_alias_set=
ac_cv_env_target_alias_value=
ac_cv_func_atanh=yes
ac_cv_func_bcopy=yes
ac_cv_func_finite=yes
ac_cv_func_gettimeofday=yes
ac_cv_func_isinf=yes
ac_cv_func_isnan=yes
ac_cv_func_isnormal=no
ac_cv_func_mach_task_self=no
ac_cv_func_memcpy=yes
ac_cv_func_mmap=yes
ac_cv_func_mprotect=yes
ac_cv_func_munmap=yes
ac_cv_func_sigaction=yes
ac_cv_func_signal=yes
ac_cv_func_signbit=no
ac_cv_func_strchr=yes
ac_cv_func_strdup=yes
ac_cv_func_task_self=no
ac_cv_func_usleep=yes
ac_cv_func_vm_allocate=no
ac_cv_func_vm_deallocate=no
ac_cv_func_vm_protect=no
ac_cv_gcc_store_motion=yes
ac_cv_have_33bit_addressing=no
ac_cv_have_getopt_long=yes
ac_cv_have_posix_shm=no
ac_cv_have_sighandler_t=yes
ac_cv_have_vasprintf=yes
ac_cv_header_alloca_h=yes
ac_cv_header_dirent_dirent_h=yes
ac_cv_header_fcntl_h=yes
ac_cv_header_floatingpoint_h=no
ac_cv_header_getopt_h=yes
ac_cv_header_ieee754_h=yes
ac_cv_header_ieeefp_h=no
ac_cv_header_inttypes_h=yes
ac_cv_header_linux_if_h=yes
ac_cv_header_linux_if_tun_h=yes
ac_cv_header_mach_mach_h=no
ac_cv_header_math_h=yes
ac_cv_header_memory_h=yes
ac_cv_header_nan_h=no
ac_cv_header_net_if_h=yes
ac_cv_header_net_if_tun_h=no
ac_cv_header_stat_h=no
ac_cv_header_stdc=yes
ac_cv_header_stdint_h=yes
ac_cv_header_stdlib_h=yes
ac_cv_header_string_h=yes
ac_cv_header_strings_h=yes
ac_cv_header_sys_ioctl_h=yes
ac_cv_header_sys_mman_h=yes
ac_cv_header_sys_mount_h=yes
ac_cv_header_sys_param_h=yes
ac_cv_header_sys_socket_h=yes
ac_cv_header_sys_stat_h=yes
ac_cv_header_sys_statfs_h=yes
ac_cv_header_sys_statvfs_h=yes
ac_cv_header_sys_types_h=yes
ac_cv_header_sys_vfs_h=yes
ac_cv_header_termio_h=yes
ac_cv_header_termios_h=yes
ac_cv_header_time=yes
ac_cv_header_types_h=no
ac_cv_header_unistd_h=yes
ac_cv_header_utime_h=yes
ac_cv_host=powerpc64-unknown-linux-gnu
ac_cv_lib_SDL_image_IMG_isJPG=no
ac_cv_lib_m_sin=yes
ac_cv_mmap_anon=yes
ac_cv_mmap_anonymous=yes
ac_cv_mprotect_works=yes
ac_cv_objext=o
ac_cv_path_EGREP='/bin/grep -E'
ac_cv_path_GREP=/bin/grep
ac_cv_path_SDL_CONFIG=/usr/bin/sdl-config
ac_cv_path_install='/bin/install -c'
ac_cv_prog_CPP='gcc -E'
ac_cv_prog_CXXCPP='g++ -E'
ac_cv_prog_ac_ct_CC=gcc
ac_cv_prog_ac_ct_CXX=g++
ac_cv_prog_cc_c89=
ac_cv_prog_cc_g=yes
ac_cv_prog_cc_gcc_c_o=yes
ac_cv_prog_cxx_g=yes
ac_cv_prog_make_make_set=yes
ac_cv_search_opendir='none required'
ac_cv_sigaction_need_reinstall=no
ac_cv_signal_need_reinstall=no
ac_cv_sizeof_double=8
ac_cv_sizeof_float=4
ac_cv_sizeof_int=4
ac_cv_sizeof_long=4
ac_cv_sizeof_long_double=8
ac_cv_sizeof_long_long=8
ac_cv_sizeof_short=2
ac_cv_sizeof_void_p=4
ac_cv_struct_tm=time.h
ac_cv_sys_file_offset_bits=64
ac_cv_sys_largefile_CC=no
ac_cv_target=powerpc64-unknown-linux-gnu
ac_cv_tun_tap_support=yes
ac_cv_type_caddr_t=yes
ac_cv_type_double=yes
ac_cv_type_float=yes
ac_cv_type_int=yes
ac_cv_type_loff_t=yes
ac_cv_type_long=yes
ac_cv_type_long_double=yes
ac_cv_type_long_long=yes
ac_cv_type_off_t=yes
ac_cv_type_short=yes
ac_cv_type_signal=void
ac_cv_type_size_t=yes
ac_cv_type_ssize_t=yes
ac_cv_type_void_p=yes
ac_cv_wchar_t=no
## ----------------- ##
## Output variables. ##
## ----------------- ##
BUNDLE_FRAMEWORKS=''
CC='gcc'
CFLAGS='-O3 -DARANYM_DATADIR="\"${datadir}/${APP}\""'
CPP='gcc -E'
CPPFLAGS=' -I$(srcdir)/../gui-sdl'
CPUINCLUDES='-I$(srcdir)/../uae_cpu'
CPUSRCS='../uae_cpu/aranym_glue.cpp ../uae_cpu/memory.cpp ../uae_cpu/newcpu.cpp ../uae_cpu/readcpu.cpp ../uae_cpu/fpu/fpu_uae.cpp cpudefs.cpp cpustbl.cpp cpuemu1.cpp cpuemu2.cpp cpuemu3.cpp cpuemu4.cpp cpuemu5.cpp cpuemu6.cpp cpuemu7.cpp cpuemu8.cpp ../uae_cpu/debug.cpp ../uae_cpu/cpummu.cpp'
CXX='g++'
CXXCPP='g++ -E'
CXXFLAGS='-O3 -fno-gcse-sm -DARANYM_DATADIR="\"${datadir}/${APP}\""'
DBGSP='-ggdb3'
DEFINES=' -DOS_linux -DCPU_powerpc -D_GNU_SOURCE -DREAL_ADDRESSING -DFPU_UAE -DENABLE_EXCLUSIVE_SPCFLAGS'
DEFS='-DHAVE_CONFIG_H'
DSPSRCS='../dsp_cpu.cpp'
DYNGLSRCS='../dyngl.c'
ECHO_C=''
ECHO_N='-n'
ECHO_T=''
EGREP='/bin/grep -E'
EXEEXT=''
GREP='/bin/grep'
GUISDLSRCS='../gui-sdl/sdlgui.cpp ../gui-sdl/dlgFileSelect.cpp ../gui-sdl/file.cpp ../gui-sdl/dlgMain.cpp ../gui-sdl/dlgDisk.cpp ../gui-sdl/dlgKeyboard.cpp ../gui-sdl/dlgHotkeys.cpp ../gui-sdl/dlgAlert.cpp'
INSTALL_DATA='${INSTALL} -m 644'
INSTALL_PROGRAM='${INSTALL}'
INSTALL_SCRIPT='${INSTALL}'
LDFLAGS=''
LIBOBJS=''
LIBS='-lm '
LTLIBOBJS=''
MIDISEQSRCS='../midi_sequencer.cpp'
NFCDROMSRCS='../natfeat/nfcdrom.cpp ../natfeat/nfcdrom_linux.cpp'
NFCLIPBOARDSRCS=''
NFJPEGSRCS=''
NFOSMESASRCS=''
NFPCISRCS=''
NFVDISRCS='../natfeat/nfvdi.cpp ../natfeat/nfvdi_soft.cpp ../natfeat/nfvdi_opengl.cpp'
OBJEXT='o'
PACKAGE_BUGREPORT='aranym@bobek.sh.cvut.cz'
PACKAGE_NAME='aranym'
PACKAGE_STRING='aranym 0.9'
PACKAGE_TARNAME='aranym'
PACKAGE_VERSION='0.9'
PARALLELPARPORTSRCS='../parallel_parport.cpp'
PARALLELX86SRCS=''
PATH_SEPARATOR=':'
SDL_CFLAGS='-I/usr/include/SDL -D_GNU_SOURCE=1 -D_REENTRANT'
SDL_CONFIG='/usr/bin/sdl-config'
SDL_LIBS='-lSDL -lpthread'
SET_MAKE=''
SHELL='/bin/sh'
SYSSRCS=' linux/parameters_linux.cpp linux/ethernet_linux.cpp host_filesys_unix.cpp ../natfeat/ethernet.cpp ../natfeat/hostfs.cpp'
TAPIF='aratapif'
TARGET='$(APP)'
WFLAGS='-Wall -W'
ac_ct_CC='gcc'
ac_ct_CXX='g++'
bindir='${exec_prefix}/bin'
build='powerpc64-unknown-linux-gnu'
build_alias=''
build_cpu='powerpc64'
build_os='linux-gnu'
build_vendor='unknown'
datadir='${datarootdir}'
datarootdir='${prefix}/share'
docdir='${datarootdir}/doc/${PACKAGE_TARNAME}'
dvidir='${docdir}'
exec_prefix='${prefix}'
host='powerpc64-unknown-linux-gnu'
host_alias=''
host_cpu='powerpc64'
host_os='linux-gnu'
host_vendor='unknown'
htmldir='${docdir}'
includedir='${prefix}/include'
infodir='${datarootdir}/info'
libdir='${exec_prefix}/lib'
libexecdir='${exec_prefix}/libexec'
localedir='${datarootdir}/locale'
localstatedir='${prefix}/var'
mandir='${datarootdir}/man'
oldincludedir='/usr/include'
pdfdir='${docdir}'
prefix='/usr/local'
program_transform_name='s,x,x,'
psdir='${docdir}'
sbindir='${exec_prefix}/sbin'
sharedstatedir='${prefix}/com'
sysconfdir='${prefix}/etc'
target='powerpc64-unknown-linux-gnu'
target_alias=''
target_cpu='powerpc64'
target_os='linux-gnu'
target_vendor='unknown'
## ----------- ##
## confdefs.h. ##
## ----------- ##
#define PACKAGE_NAME "aranym"
#define PACKAGE_TARNAME "aranym"
#define PACKAGE_VERSION "0.9"
#define PACKAGE_STRING "aranym 0.9"
#define PACKAGE_BUGREPORT "aranym@bobek.sh.cvut.cz"
#define OS_TYPE "linux"
#define CPU_TYPE "powerpc"
#define STDC_HEADERS 1
#define HAVE_DIRENT_H 1
#define HAVE_SYS_TYPES_H 1
#define HAVE_SYS_STAT_H 1
#define HAVE_STDLIB_H 1
#define HAVE_STRING_H 1
#define HAVE_MEMORY_H 1
#define HAVE_STRINGS_H 1
#define HAVE_INTTYPES_H 1
#define HAVE_STDINT_H 1
#define HAVE_UNISTD_H 1
#define HAVE_UNISTD_H 1
#define HAVE_FCNTL_H 1
#define HAVE_SYS_MMAN_H 1
#define HAVE_SYS_IOCTL_H 1
#define HAVE_GETOPT_H 1
#define HAVE_TERMIOS_H 1
#define HAVE_TERMIO_H 1
#define HAVE_ALLOCA_H 1
#define HAVE_SYS_STATFS_H 1
#define HAVE_SYS_STATVFS_H 1
#define HAVE_SYS_TYPES_H 1
#define HAVE_SYS_STAT_H 1
#define HAVE_SYS_VFS_H 1
#define HAVE_UTIME_H 1
#define HAVE_SYS_PARAM_H 1
#define HAVE_SYS_MOUNT_H 1
#define HAVE_SYS_SOCKET_H 1
#define HAVE_LINUX_IF_H 1
#define HAVE_LINUX_IF_TUN_H 1
#define HAVE_NET_IF_H 1
#define WORDS_BIGENDIAN 1
#define SIZEOF_SHORT 2
#define SIZEOF_INT 4
#define SIZEOF_LONG 4
#define SIZEOF_LONG_LONG 8
#define SIZEOF_FLOAT 4
#define SIZEOF_DOUBLE 8
#define SIZEOF_LONG_DOUBLE 8
#define SIZEOF_VOID_P 4
#define RETSIGTYPE void
#define TIME_WITH_SYS_TIME 1
#define _FILE_OFFSET_BITS 64
#define HAVE_BOOL
#define HAVE_LIBM 1
#define HAVE_STRDUP 1
#define HAVE_SIGACTION 1
#define HAVE_SIGNAL 1
#define HAVE_MMAP 1
#define HAVE_MPROTECT 1
#define HAVE_MUNMAP 1
#define HAVE_STRCHR 1
#define HAVE_MEMCPY 1
#define HAVE_BCOPY 1
#define HAVE_USLEEP 1
#define HAVE_GETTIMEOFDAY 1
#define HAVE_CADDR_T 1
#define DIRSEPARATOR "/"
#define ENABLE_TUNTAP 1
#define HAVE_MMAP_VM 1
#define HAVE_MMAP_ANON 1
#define HAVE_MMAP_ANONYMOUS 1
#define HAVE_MMAP_VM 1
#define HAVE_GNU_SOURCE 1
#define HAVE_SIGHANDLER_T 1
#define HAVE_GETOPT_H 1
#define ARAM_PAGE_CHECK 1
#define SUPPORT_CDROM 1
#define DSP_EMULATION 1
#define PROTECT2K 1
#define ENABLE_REALSTOP 1
#define ETHERNET_SUPPORT 1
#define HOSTFS_SUPPORT 1
#define SDL_GUI 1
#define HOST_FLOAT_FORMAT IEEE_FLOAT_FORMAT
#define HAVE_IEEE754_H 1
#define HAVE_MATH_H 1
#define HAVE_ATANH 1
#define HAVE_ISNAN 1
#define HAVE_ISINF 1
#define HAVE_FINITE 1
#define DEBUGGER 1
#define NEWDEBUG 1
#define ENABLE_OPENGL 1
#define NFCDROM_SUPPORT 1
#define NFCDROM_LINUX_SUPPORT 1
#define NFVDI_SUPPORT 1
#define ENABLE_PARALLELPARPORT 1
#define ENABLE_MIDI_SEQUENCER 1
configure: exit 0