rendered paste bodyThis file contains any messages produced by compilers while
running configure, to aid debugging if configure makes a mistake.
It was created by BZFlag configure 2.1.14, which was
generated by GNU Autoconf 2.59. Invocation command line was
$ ./configure
## --------- ##
## Platform. ##
## --------- ##
hostname = phil-matous-computer.local
uname -m = i386
uname -r = 8.11.1
uname -s = Darwin
uname -v = Darwin Kernel Version 8.11.1: Wed Oct 10 18:23:28 PDT 2007; root:xnu-792.25.20~1/RELEASE_I386
/usr/bin/uname -p = i386
/bin/uname -X = unknown
/bin/arch = unknown
/usr/bin/arch -k = unknown
/usr/convex/getsysinfo = unknown
hostinfo = Mach kernel version:
Darwin Kernel Version 8.11.1: Wed Oct 10 18:23:28 PDT 2007; root:xnu-792.25.20~1/RELEASE_I386
Kernel configured for up to 2 processors.
2 processors are physically available.
2 processors are logically available.
Processor type: i486 (Intel 80486)
Processors active: 0 1
Primary memory available: 1.00 gigabytes
Default processor set: 96 tasks, 332 threads, 2 processors
Load average: 0.60, Mach factor: 1.54
/bin/machine = unknown
/usr/bin/oslevel = unknown
/bin/universe = unknown
PATH: /bin
PATH: /sbin
PATH: /usr/bin
PATH: /usr/sbin
PATH: /usr/local/bin
## ----------- ##
## Core tests. ##
## ----------- ##
configure:1616: result: **************************************************
configure:1618: result: *** Configuring BZFlag 2.99.00, Build 20071127 ***
configure:1620: result: **************************************************
configure:1638: checking build system type
configure:1656: result: i386-apple-darwin8.11.1
configure:1664: checking host system type
configure:1678: result: i386-apple-darwin8.11.1
configure:1686: checking target system type
configure:1700: result: i386-apple-darwin8.11.1
configure:1729: checking for a BSD-compatible install
configure:1784: result: /usr/bin/install -c
configure:1795: checking whether build environment is sane
configure:1838: result: yes
configure:1871: checking for gawk
configure:1900: result: no
configure:1871: checking for mawk
configure:1900: result: no
configure:1871: checking for nawk
configure:1900: result: no
configure:1871: checking for awk
configure:1887: found /usr/bin/awk
configure:1897: result: awk
configure:1907: checking whether make sets $(MAKE)
configure:1927: result: yes
configure:2094: checking for whoami
configure:2110: found /usr/bin/whoami
configure:2121: result: yes
configure:2144: checking whether a configure cache exists
configure:2182: result: not found
configure:2187: *** Automatically caching to config.cache.darwin8.11.1.phil-matous-computer.local ***
configure:2221: checking ... a r g u m e n t s
configure:2223: result: (1 of 9)
configure:2258: checking for style of include used by make
configure:2286: result: GNU
configure:2357: checking for gcc
configure:2373: found /usr/bin/gcc
configure:2383: result: gcc
configure:2627: checking for C compiler version
configure:2630: gcc --version </dev/null >&5
i686-apple-darwin8-gcc-4.0.1 (GCC) 4.0.1 (Apple Computer, Inc. build 5250)
Copyright (C) 2005 Free Software Foundation, Inc.
This is free software; see the source for copying conditions. There is NO
warranty; not even for MERCHANTABILITY or FITNESS FOR A PARTICULAR PURPOSE.
configure:2633: $? = 0
configure:2635: gcc -v </dev/null >&5
Using built-in specs.
Target: i686-apple-darwin8
Configured with: /private/var/tmp/gcc/gcc-5250.obj~12/src/configure --disable-checking -enable-werror --prefix=/usr --mandir=/share/man --enable-languages=c,objc,c++,obj-c++ --program-transform-name=/^[cg][^.-]*$/s/$/-4.0/ --with-gxx-include-dir=/include/c++/4.0.0 --build=powerpc-apple-darwin8 --with-arch=pentium-m --with-tune=prescott --program-prefix= --host=i686-apple-darwin8 --target=i686-apple-darwin8
Thread model: posix
gcc version 4.0.1 (Apple Computer, Inc. build 5250)
configure:2638: $? = 0
configure:2640: gcc -V </dev/null >&5
gcc: argument to `-V' is missing
configure:2643: $? = 1
configure:2666: checking for C compiler default output file name
configure:2669: gcc conftest.c >&5
configure:2672: $? = 0
configure:2718: result: a.out
configure:2723: checking whether the C compiler works
configure:2729: ./a.out
configure:2732: $? = 0
configure:2749: result: yes
configure:2756: checking whether we are cross compiling
configure:2758: result: no
configure:2761: checking for suffix of executables
configure:2763: gcc -o conftest conftest.c >&5
configure:2766: $? = 0
configure:2791: result:
configure:2797: checking for suffix of object files
configure:2818: gcc -c conftest.c >&5
configure:2821: $? = 0
configure:2843: result: o
configure:2847: checking whether we are using the GNU C compiler
configure:2871: gcc -c conftest.c >&5
configure:2877: $? = 0
configure:2881: test -z
|| test ! -s conftest.err
configure:2884: $? = 0
configure:2887: test -s conftest.o
configure:2890: $? = 0
configure:2903: result: yes
configure:2909: checking whether gcc accepts -g
configure:2930: gcc -c -g conftest.c >&5
configure:2936: $? = 0
configure:2940: test -z
|| test ! -s conftest.err
configure:2943: $? = 0
configure:2946: test -s conftest.o
configure:2949: $? = 0
configure:2960: result: yes
configure:2977: checking for gcc option to accept ANSI C
configure:3047: gcc -c -g -O2 conftest.c >&5
configure:3053: $? = 0
configure:3057: test -z
|| test ! -s conftest.err
configure:3060: $? = 0
configure:3063: test -s conftest.o
configure:3066: $? = 0
configure:3084: result: none needed
configure:3102: gcc -c -g -O2 conftest.c >&5
conftest.c:2: error: parse error before 'me'
configure:3108: $? = 1
configure: failed program was:
| #ifndef __cplusplus
| choke me
| #endif
configure:3243: checking dependency style of gcc
configure:3305: result: gcc3
configure:3327: checking for working ncurses
configure:3352: gcc -o conftest -g -O2 conftest.c -lncurses >&5
configure:3358: $? = 0
configure:3362: test -z
|| test ! -s conftest.err
configure:3365: $? = 0
configure:3368: test -s conftest
configure:3371: $? = 0
configure:3383: result: yes
configure:3826: checking ... p r o g r a m s
configure:3828: result: (2 of 9)
configure:3849: checking whether make sets $(MAKE)
configure:3869: result: yes
configure:3966: checking for g++
configure:3982: found /usr/bin/g++
configure:3992: result: g++
configure:4008: checking for C++ compiler version
configure:4011: g++ --version </dev/null >&5
i686-apple-darwin8-g++-4.0.1 (GCC) 4.0.1 (Apple Computer, Inc. build 5250)
Copyright (C) 2005 Free Software Foundation, Inc.
This is free software; see the source for copying conditions. There is NO
warranty; not even for MERCHANTABILITY or FITNESS FOR A PARTICULAR PURPOSE.
configure:4014: $? = 0
configure:4016: g++ -v </dev/null >&5
Using built-in specs.
Target: i686-apple-darwin8
Configured with: /private/var/tmp/gcc/gcc-5250.obj~12/src/configure --disable-checking -enable-werror --prefix=/usr --mandir=/share/man --enable-languages=c,objc,c++,obj-c++ --program-transform-name=/^[cg][^.-]*$/s/$/-4.0/ --with-gxx-include-dir=/include/c++/4.0.0 --build=powerpc-apple-darwin8 --with-arch=pentium-m --with-tune=prescott --program-prefix= --host=i686-apple-darwin8 --target=i686-apple-darwin8
Thread model: posix
gcc version 4.0.1 (Apple Computer, Inc. build 5250)
configure:4019: $? = 0
configure:4021: g++ -V </dev/null >&5
g++: argument to `-V' is missing
configure:4024: $? = 1
configure:4027: checking whether we are using the GNU C++ compiler
configure:4051: g++ -c conftest.cc >&5
configure:4057: $? = 0
configure:4061: test -z
|| test ! -s conftest.err
configure:4064: $? = 0
configure:4067: test -s conftest.o
configure:4070: $? = 0
configure:4083: result: yes
configure:4089: checking whether g++ accepts -g
configure:4110: g++ -c -g conftest.cc >&5
configure:4116: $? = 0
configure:4120: test -z
|| test ! -s conftest.err
configure:4123: $? = 0
configure:4126: test -s conftest.o
configure:4129: $? = 0
configure:4140: result: yes
configure:4182: g++ -c -g -O2 conftest.cc >&5
configure:4188: $? = 0
configure:4192: test -z
|| test ! -s conftest.err
configure:4195: $? = 0
configure:4198: test -s conftest.o
configure:4201: $? = 0
configure:4227: g++ -c -g -O2 conftest.cc >&5
conftest.cc: In function 'int main()':
conftest.cc:20: error: 'exit' was not declared in this scope
configure:4233: $? = 1
configure: failed program was:
| /* confdefs.h. */
|
| #define PACKAGE_NAME "BZFlag"
| #define PACKAGE_TARNAME "bzflag"
| #define PACKAGE_VERSION "2.1.14"
| #define PACKAGE_STRING "BZFlag 2.1.14"
| #define PACKAGE_BUGREPORT "http://BZFlag.org"
| #define PACKAGE "bzflag"
| #define VERSION "2.1.14"
| #define BZ_BUILD_OS "darwin8.11.1"
| #define BZ_BUILD_USER "delusional"
| #define HAVE_NCURSES_H
| #define BZ_PLUGINS 1
| #define ROBOT 1
| /* end confdefs.h. */
|
| int
| main ()
| {
| exit (42);
| ;
| return 0;
| }
configure:4182: g++ -c -g -O2 conftest.cc >&5
/usr/include/stdlib.h:158: error: declaration of 'void std::exit(int)' throws different exceptions
conftest.cc:16: error: than previous declaration 'void std::exit(int) throw ()'
configure:4188: $? = 1
configure: failed program was:
| /* confdefs.h. */
|
| #define PACKAGE_NAME "BZFlag"
| #define PACKAGE_TARNAME "bzflag"
| #define PACKAGE_VERSION "2.1.14"
| #define PACKAGE_STRING "BZFlag 2.1.14"
| #define PACKAGE_BUGREPORT "http://BZFlag.org"
| #define PACKAGE "bzflag"
| #define VERSION "2.1.14"
| #define BZ_BUILD_OS "darwin8.11.1"
| #define BZ_BUILD_USER "delusional"
| #define HAVE_NCURSES_H
| #define BZ_PLUGINS 1
| #define ROBOT 1
| /* end confdefs.h. */
| extern "C" void std::exit (int) throw (); using std::exit;
| #include <stdlib.h>
| int
| main ()
| {
| exit (42);
| ;
| return 0;
| }
configure:4182: g++ -c -g -O2 conftest.cc >&5
configure:4188: $? = 0
configure:4192: test -z
|| test ! -s conftest.err
configure:4195: $? = 0
configure:4198: test -s conftest.o
configure:4201: $? = 0
configure:4227: g++ -c -g -O2 conftest.cc >&5
configure:4233: $? = 0
configure:4237: test -z
|| test ! -s conftest.err
configure:4240: $? = 0
configure:4243: test -s conftest.o
configure:4246: $? = 0
configure:4271: checking dependency style of g++
configure:4333: result: gcc3
configure:4384: checking for gcc
configure:4410: result: gcc
configure:4654: checking for C compiler version
configure:4657: gcc --version </dev/null >&5
i686-apple-darwin8-gcc-4.0.1 (GCC) 4.0.1 (Apple Computer, Inc. build 5250)
Copyright (C) 2005 Free Software Foundation, Inc.
This is free software; see the source for copying conditions. There is NO
warranty; not even for MERCHANTABILITY or FITNESS FOR A PARTICULAR PURPOSE.
configure:4660: $? = 0
configure:4662: gcc -v </dev/null >&5
Using built-in specs.
Target: i686-apple-darwin8
Configured with: /private/var/tmp/gcc/gcc-5250.obj~12/src/configure --disable-checking -enable-werror --prefix=/usr --mandir=/share/man --enable-languages=c,objc,c++,obj-c++ --program-transform-name=/^[cg][^.-]*$/s/$/-4.0/ --with-gxx-include-dir=/include/c++/4.0.0 --build=powerpc-apple-darwin8 --with-arch=pentium-m --with-tune=prescott --program-prefix= --host=i686-apple-darwin8 --target=i686-apple-darwin8
Thread model: posix
gcc version 4.0.1 (Apple Computer, Inc. build 5250)
configure:4665: $? = 0
configure:4667: gcc -V </dev/null >&5
gcc: argument to `-V' is missing
configure:4670: $? = 1
configure:4673: checking whether we are using the GNU C compiler
configure:4729: result: yes
configure:4735: checking whether gcc accepts -g
configure:4786: result: yes
configure:4803: checking for gcc option to accept ANSI C
configure:4910: result: none needed
configure:4928: gcc -c -g -O2 conftest.c >&5
conftest.c:2: error: parse error before 'me'
configure:4934: $? = 1
configure: failed program was:
| #ifndef __cplusplus
| choke me
| #endif
configure:5069: checking dependency style of gcc
configure:5131: result: gcc3
configure:5136: checking whether ln -s works
configure:5140: result: yes
configure:5149: checking for ar
configure:5165: found /usr/bin/ar
configure:5175: result: ar
configure:5187: checking for ccache
configure:5220: result: no
configure:5270: checking for windres
configure:5297: result: :
configure:5388: checking for a sed that does not truncate output
configure:5442: result: /usr/bin/sed
configure:5445: checking for egrep
configure:5455: result: grep -E
configure:5471: checking for ld used by gcc
configure:5538: result: /usr/bin/ld
configure:5547: checking if the linker (/usr/bin/ld) is GNU ld
configure:5562: result: no
configure:5567: checking for /usr/bin/ld option to reload object files
configure:5574: result: -r
configure:5583: checking for BSD-compatible nm
configure:5625: result: /usr/bin/nm -p
configure:5629: checking how to recognise dependent libraries
configure:5829: result: pass_all
configure:6042: checking how to run the C preprocessor
configure:6077: gcc -E conftest.c
configure:6083: $? = 0
configure:6115: gcc -E conftest.c
conftest.c:19:28: error: ac_nonexistent.h: No such file or directory
configure:6121: $? = 1
configure: failed program was:
| /* confdefs.h. */
|
| #define PACKAGE_NAME "BZFlag"
| #define PACKAGE_TARNAME "bzflag"
| #define PACKAGE_VERSION "2.1.14"
| #define PACKAGE_STRING "BZFlag 2.1.14"
| #define PACKAGE_BUGREPORT "http://BZFlag.org"
| #define PACKAGE "bzflag"
| #define VERSION "2.1.14"
| #define BZ_BUILD_OS "darwin8.11.1"
| #define BZ_BUILD_USER "delusional"
| #define HAVE_NCURSES_H
| #define BZ_PLUGINS 1
| #define ROBOT 1
| #ifdef __cplusplus
| extern "C" void std::exit (int); using std::exit;
| #endif
| /* end confdefs.h. */
| #include <ac_nonexistent.h>
configure:6160: result: gcc -E
configure:6184: gcc -E conftest.c
configure:6190: $? = 0
configure:6222: gcc -E conftest.c
conftest.c:19:28: error: ac_nonexistent.h: No such file or directory
configure:6228: $? = 1
configure: failed program was:
| /* confdefs.h. */
|
| #define PACKAGE_NAME "BZFlag"
| #define PACKAGE_TARNAME "bzflag"
| #define PACKAGE_VERSION "2.1.14"
| #define PACKAGE_STRING "BZFlag 2.1.14"
| #define PACKAGE_BUGREPORT "http://BZFlag.org"
| #define PACKAGE "bzflag"
| #define VERSION "2.1.14"
| #define BZ_BUILD_OS "darwin8.11.1"
| #define BZ_BUILD_USER "delusional"
| #define HAVE_NCURSES_H
| #define BZ_PLUGINS 1
| #define ROBOT 1
| #ifdef __cplusplus
| extern "C" void std::exit (int); using std::exit;
| #endif
| /* end confdefs.h. */
| #include <ac_nonexistent.h>
configure:6272: checking for ANSI C header files
configure:6297: gcc -c -g -O2 conftest.c >&5
configure:6303: $? = 0
configure:6307: test -z
|| test ! -s conftest.err
configure:6310: $? = 0
configure:6313: test -s conftest.o
configure:6316: $? = 0
configure:6402: gcc -o conftest -g -O2 conftest.c >&5
conftest.c: In function 'main':
conftest.c:36: warning: incompatible implicit declaration of built-in function 'exit'
configure:6405: $? = 0
configure:6407: ./conftest
configure:6410: $? = 0
configure:6425: result: yes
configure:6449: checking for sys/types.h
configure:6465: gcc -c -g -O2 conftest.c >&5
configure:6471: $? = 0
configure:6475: test -z
|| test ! -s conftest.err
configure:6478: $? = 0
configure:6481: test -s conftest.o
configure:6484: $? = 0
configure:6495: result: yes
configure:6449: checking for sys/stat.h
configure:6465: gcc -c -g -O2 conftest.c >&5
configure:6471: $? = 0
configure:6475: test -z
|| test ! -s conftest.err
configure:6478: $? = 0
configure:6481: test -s conftest.o
configure:6484: $? = 0
configure:6495: result: yes
configure:6449: checking for stdlib.h
configure:6465: gcc -c -g -O2 conftest.c >&5
configure:6471: $? = 0
configure:6475: test -z
|| test ! -s conftest.err
configure:6478: $? = 0
configure:6481: test -s conftest.o
configure:6484: $? = 0
configure:6495: result: yes
configure:6449: checking for string.h
configure:6465: gcc -c -g -O2 conftest.c >&5
configure:6471: $? = 0
configure:6475: test -z
|| test ! -s conftest.err
configure:6478: $? = 0
configure:6481: test -s conftest.o
configure:6484: $? = 0
configure:6495: result: yes
configure:6449: checking for memory.h
configure:6465: gcc -c -g -O2 conftest.c >&5
configure:6471: $? = 0
configure:6475: test -z
|| test ! -s conftest.err
configure:6478: $? = 0
configure:6481: test -s conftest.o
configure:6484: $? = 0
configure:6495: result: yes
configure:6449: checking for strings.h
configure:6465: gcc -c -g -O2 conftest.c >&5
configure:6471: $? = 0
configure:6475: test -z
|| test ! -s conftest.err
configure:6478: $? = 0
configure:6481: test -s conftest.o
configure:6484: $? = 0
configure:6495: result: yes
configure:6449: checking for inttypes.h
configure:6465: gcc -c -g -O2 conftest.c >&5
configure:6471: $? = 0
configure:6475: test -z
|| test ! -s conftest.err
configure:6478: $? = 0
configure:6481: test -s conftest.o
configure:6484: $? = 0
configure:6495: result: yes
configure:6449: checking for stdint.h
configure:6465: gcc -c -g -O2 conftest.c >&5
configure:6471: $? = 0
configure:6475: test -z
|| test ! -s conftest.err
configure:6478: $? = 0
configure:6481: test -s conftest.o
configure:6484: $? = 0
configure:6495: result: yes
configure:6449: checking for unistd.h
configure:6465: gcc -c -g -O2 conftest.c >&5
configure:6471: $? = 0
configure:6475: test -z
|| test ! -s conftest.err
configure:6478: $? = 0
configure:6481: test -s conftest.o
configure:6484: $? = 0
configure:6495: result: yes
configure:6521: checking dlfcn.h usability
configure:6533: gcc -c -g -O2 conftest.c >&5
configure:6539: $? = 0
configure:6543: test -z
|| test ! -s conftest.err
configure:6546: $? = 0
configure:6549: test -s conftest.o
configure:6552: $? = 0
configure:6562: result: yes
configure:6566: checking dlfcn.h presence
configure:6576: gcc -E conftest.c
configure:6582: $? = 0
configure:6602: result: yes
configure:6637: checking for dlfcn.h
configure:6644: result: yes
configure:6662: checking how to run the C++ preprocessor
configure:6693: g++ -E conftest.cc
configure:6699: $? = 0
configure:6731: g++ -E conftest.cc
conftest.cc:30:28: error: ac_nonexistent.h: No such file or directory
configure:6737: $? = 1
configure: failed program was:
| /* confdefs.h. */
|
| #define PACKAGE_NAME "BZFlag"
| #define PACKAGE_TARNAME "bzflag"
| #define PACKAGE_VERSION "2.1.14"
| #define PACKAGE_STRING "BZFlag 2.1.14"
| #define PACKAGE_BUGREPORT "http://BZFlag.org"
| #define PACKAGE "bzflag"
| #define VERSION "2.1.14"
| #define BZ_BUILD_OS "darwin8.11.1"
| #define BZ_BUILD_USER "delusional"
| #define HAVE_NCURSES_H
| #define BZ_PLUGINS 1
| #define ROBOT 1
| #ifdef __cplusplus
| extern "C" void std::exit (int); using std::exit;
| #endif
| #define STDC_HEADERS 1
| #define HAVE_SYS_TYPES_H 1
| #define HAVE_SYS_STAT_H 1
| #define HAVE_STDLIB_H 1
| #define HAVE_STRING_H 1
| #define HAVE_MEMORY_H 1
| #define HAVE_STRINGS_H 1
| #define HAVE_INTTYPES_H 1
| #define HAVE_STDINT_H 1
| #define HAVE_UNISTD_H 1
| #define HAVE_DLFCN_H 1
| /* end confdefs.h. */
| #include <ac_nonexistent.h>
configure:6776: result: g++ -E
configure:6800: g++ -E conftest.cc
configure:6806: $? = 0
configure:6838: g++ -E conftest.cc
conftest.cc:30:28: error: ac_nonexistent.h: No such file or directory
configure:6844: $? = 1
configure: failed program was:
| /* confdefs.h. */
|
| #define PACKAGE_NAME "BZFlag"
| #define PACKAGE_TARNAME "bzflag"
| #define PACKAGE_VERSION "2.1.14"
| #define PACKAGE_STRING "BZFlag 2.1.14"
| #define PACKAGE_BUGREPORT "http://BZFlag.org"
| #define PACKAGE "bzflag"
| #define VERSION "2.1.14"
| #define BZ_BUILD_OS "darwin8.11.1"
| #define BZ_BUILD_USER "delusional"
| #define HAVE_NCURSES_H
| #define BZ_PLUGINS 1
| #define ROBOT 1
| #ifdef __cplusplus
| extern "C" void std::exit (int); using std::exit;
| #endif
| #define STDC_HEADERS 1
| #define HAVE_SYS_TYPES_H 1
| #define HAVE_SYS_STAT_H 1
| #define HAVE_STDLIB_H 1
| #define HAVE_STRING_H 1
| #define HAVE_MEMORY_H 1
| #define HAVE_STRINGS_H 1
| #define HAVE_INTTYPES_H 1
| #define HAVE_STDINT_H 1
| #define HAVE_UNISTD_H 1
| #define HAVE_DLFCN_H 1
| /* end confdefs.h. */
| #include <ac_nonexistent.h>
configure:6939: checking for g77
configure:6968: result: no
configure:6939: checking for f77
configure:6968: result: no
configure:6939: checking for xlf
configure:6968: result: no
configure:6939: checking for frt
configure:6968: result: no
configure:6939: checking for pgf77
configure:6968: result: no
configure:6939: checking for fort77
configure:6968: result: no
configure:6939: checking for fl32
configure:6968: result: no
configure:6939: checking for af77
configure:6968: result: no
configure:6939: checking for f90
configure:6968: result: no
configure:6939: checking for xlf90
configure:6968: result: no
configure:6939: checking for pgf90
configure:6968: result: no
configure:6939: checking for epcf90
configure:6968: result: no
configure:6939: checking for f95
configure:6968: result: no
configure:6939: checking for fort
configure:6968: result: no
configure:6939: checking for xlf95
configure:6968: result: no
configure:6939: checking for ifc
configure:6968: result: no
configure:6939: checking for efc
configure:6968: result: no
configure:6939: checking for pgf95
configure:6968: result: no
configure:6939: checking for lf95
configure:6968: result: no
configure:6939: checking for gfortran
configure:6968: result: no
configure:6983: checking for Fortran 77 compiler version
configure:6983: --version </dev/null >&5
./configure: line 1: --version: command not found
configure:6986: $? = 127
configure:6988: -v </dev/null >&5
./configure: line 1: -v: command not found
configure:6991: $? = 127
configure:6993: -V </dev/null >&5
./configure: line 1: -V: command not found
configure:6996: $? = 127
configure:7004: checking whether we are using the GNU Fortran 77 compiler
configure:7018: -c conftest.F >&5
./configure: line 1: -c: command not found
configure:7024: $? = 127
configure: failed program was:
| program main
| #ifndef __GNUC__
| choke me
| #endif
|
| end
configure:7050: result: no
configure:7056: checking whether accepts -g
configure:7068: -c -g conftest.f >&5
./configure: line 1: -c: command not found
configure:7074: $? = 127
configure: failed program was:
| program main
|
| end
configure:7099: result: no
configure:7129: checking the maximum length of command line arguments
configure:7188: result: 65536
configure:7199: checking command to parse /usr/bin/nm -p output from gcc object
configure:7288: gcc -c -g -O2 conftest.c >&5
configure:7291: $? = 0
configure:7295: /usr/bin/nm -p conftest.o \| sed -n -e 's/^.*[ ]\([BCDEGRST][BCDEGRST]*\)[ ][ ]*\(\)\([_A-Za-z][_A-Za-z0-9]*\)$/\1 \2\3 \3/p' \> conftest.nm
configure:7298: $? = 0
cannot find nm_test_var in conftest.nm
configure:7288: gcc -c -g -O2 conftest.c >&5
configure:7291: $? = 0
configure:7295: /usr/bin/nm -p conftest.o \| sed -n -e 's/^.*[ ]\([BCDEGRST][BCDEGRST]*\)[ ][ ]*\(_\)\([_A-Za-z][_A-Za-z0-9]*\)$/\1 \2\3 \3/p' \> conftest.nm
configure:7298: $? = 0
configure:7350: gcc -o conftest -g -O2 conftest.c conftstm.o >&5
configure:7353: $? = 0
configure:7391: result: ok
configure:7395: checking for objdir
configure:7410: result: .libs
configure:7583: checking for ranlib
configure:7599: found /usr/bin/ranlib
configure:7610: result: ranlib
configure:7663: checking for strip
configure:7679: found /usr/bin/strip
configure:7690: result: strip
configure:7952: checking if gcc static flag works
configure:7975: result: yes
configure:7992: checking if gcc supports -fno-rtti -fno-exceptions
configure:8013: gcc -c -g -O2 -fno-rtti -fno-exceptions conftest.c >&5
cc1: warning: command line option "-fno-rtti" is valid for C++/ObjC++ but not for C
configure:8017: $? = 0
configure:8025: result: no
configure:8040: checking for gcc option to produce PIC
configure:8217: result: -fno-common
configure:8224: checking if gcc PIC flag -fno-common works
configure:8245: gcc -c -g -O2 -fno-common -DPIC conftest.c >&5
configure:8249: $? = 0
configure:8257: result: yes
configure:8281: checking if gcc supports -c -o file.o
configure:8312: gcc -c -g -O2 -o out/conftest2.o conftest.c >&5
configure:8316: $? = 0
configure:8330: result: yes
configure:8356: checking whether the gcc linker (/usr/bin/ld) supports shared libraries
configure:9184: result: yes
configure:9255: checking how to hardcode library paths into programs
configure:9280: result: immediate
configure:9294: checking whether stripping libraries is possible
configure:9315: result: no
configure:9321: checking dynamic linker characteristics
configure:9832: result: darwin8.11.1 dyld
configure:9863: checking for dlopen in -ldl
configure:9893: gcc -o conftest -g -O2 conftest.c -ldl >&5
configure:9899: $? = 0
configure:9903: test -z
|| test ! -s conftest.err
configure:9906: $? = 0
configure:9909: test -s conftest
configure:9912: $? = 0
configure:9925: result: yes
configure:10430: checking whether a program can dlopen itself
configure:10502: gcc -o conftest -g -O2 -DHAVE_DLFCN_H conftest.c -ldl >&5
configure: In function 'main':
configure:10501: warning: incompatible implicit declaration of built-in function 'exit'
configure:10505: $? = 0
configure:10523: result: yes
configure:10528: checking whether a statically linked program can dlopen itself
configure:10600: gcc -o conftest -g -O2 -DHAVE_DLFCN_H conftest.c -ldl >&5
configure: In function 'main':
configure:10599: warning: incompatible implicit declaration of built-in function 'exit'
configure:10603: $? = 0
configure:10621: result: yes
configure:10644: checking if libtool supports shared libraries
configure:10646: result: yes
configure:10649: checking whether to build shared libraries
configure:10712: result: yes
configure:10715: checking whether to build static libraries
configure:10719: result: yes
configure:10810: creating libtool
configure:11357: checking for ld used by g++
configure:11424: result: /usr/bin/ld
configure:11433: checking if the linker (/usr/bin/ld) is GNU ld
configure:11448: result: no
configure:11499: checking whether the g++ linker (/usr/bin/ld) supports shared libraries
configure:12328: result: yes
configure:12346: g++ -c -g -O2 conftest.cc >&5
configure:12349: $? = 0
configure:12445: checking for g++ option to produce PIC
configure:12697: result: -fno-common
configure:12704: checking if g++ PIC flag -fno-common works
configure:12725: g++ -c -g -O2 -fno-common -DPIC conftest.cc >&5
configure:12729: $? = 0
configure:12737: result: yes
configure:12761: checking if g++ supports -c -o file.o
configure:12792: g++ -c -g -O2 -o out/conftest2.o conftest.cc >&5
configure:12796: $? = 0
configure:12810: result: yes
configure:12836: checking whether the g++ linker (/usr/bin/ld) supports shared libraries
configure:12861: result: yes
configure:12932: checking how to hardcode library paths into programs
configure:12957: result: immediate
configure:12971: checking whether stripping libraries is possible
configure:12992: result: no
configure:12998: checking dynamic linker characteristics
configure:13509: result: darwin8.11.1 dyld
configure:13540: checking for dlopen in -ldl
configure:13602: result: yes
configure:14107: checking whether a program can dlopen itself
configure:14200: result: yes
configure:14205: checking whether a statically linked program can dlopen itself
configure:14298: result: yes
configure:20639: checking for pod2man
configure:20655: found /usr/bin/pod2man
configure:20666: result: yes
configure:20689: checking for artificial intelligence for bz's robots
configure:20691: result: not found
configure:20712: checking ... l i b r a r i e s
configure:20714: result: (3 of 9)
configure:20731: checking for compress in -lz
configure:20761: gcc -o conftest -g -O2 conftest.c -lz >&5
configure:20767: $? = 0
configure:20771: test -z
|| test ! -s conftest.err
configure:20774: $? = 0
configure:20777: test -s conftest
configure:20780: $? = 0
configure:20793: result: yes
configure:20804: checking for ares_init in -lcares
configure:20834: gcc -o conftest -g -O2 conftest.c -lcares >&5
/usr/bin/ld: can't locate file for: -lcares
collect2: ld returned 1 exit status
configure:20840: $? = 1
configure: failed program was:
| /* confdefs.h. */
|
| #define PACKAGE_NAME "BZFlag"
| #define PACKAGE_TARNAME "bzflag"
| #define PACKAGE_VERSION "2.1.14"
| #define PACKAGE_STRING "BZFlag 2.1.14"
| #define PACKAGE_BUGREPORT "http://BZFlag.org"
| #define PACKAGE "bzflag"
| #define VERSION "2.1.14"
| #define BZ_BUILD_OS "darwin8.11.1"
| #define BZ_BUILD_USER "delusional"
| #define HAVE_NCURSES_H
| #define BZ_PLUGINS 1
| #define ROBOT 1
| #ifdef __cplusplus
| extern "C" void std::exit (int); using std::exit;
| #endif
| #define STDC_HEADERS 1
| #define HAVE_SYS_TYPES_H 1
| #define HAVE_SYS_STAT_H 1
| #define HAVE_STDLIB_H 1
| #define HAVE_STRING_H 1
| #define HAVE_MEMORY_H 1
| #define HAVE_STRINGS_H 1
| #define HAVE_INTTYPES_H 1
| #define HAVE_STDINT_H 1
| #define HAVE_UNISTD_H 1
| #define HAVE_DLFCN_H 1
| /* end confdefs.h. */
|
| /* Override any gcc2 internal prototype to avoid an error. */
| #ifdef __cplusplus
| extern "C"
| #endif
| /* We use char because int might match the return type of a gcc2
| builtin and then its argument prototype would still apply. */
| char ares_init ();
| int
| main ()
| {
| ares_init ();
| ;
| return 0;
| }
configure:20866: result: no
configure:20877: checking for regcomp in -lc
configure:20907: gcc -o conftest -g -O2 conftest.c -lc >&5
configure:20913: $? = 0
configure:20917: test -z
|| test ! -s conftest.err
configure:20920: $? = 0
configure:20923: test -s conftest
configure:20926: $? = 0
configure:20939: result: yes
configure:21091: checking for sqrtf in -lm
configure:21121: gcc -o conftest -g -O2 conftest.c -lm >&5
conftest.c:37: warning: conflicting types for built-in function 'sqrtf'
configure:21127: $? = 0
configure:21131: test -z
|| test ! -s conftest.err
configure:21134: $? = 0
configure:21137: test -s conftest
configure:21140: $? = 0
configure:21153: result: yes
configure:21167: checking for socket in -lsocket
configure:21197: gcc -o conftest -g -O2 conftest.c -lsocket -lm >&5
/usr/bin/ld: can't locate file for: -lsocket
collect2: ld returned 1 exit status
configure:21203: $? = 1
configure: failed program was:
| /* confdefs.h. */
|
| #define PACKAGE_NAME "BZFlag"
| #define PACKAGE_TARNAME "bzflag"
| #define PACKAGE_VERSION "2.1.14"
| #define PACKAGE_STRING "BZFlag 2.1.14"
| #define PACKAGE_BUGREPORT "http://BZFlag.org"
| #define PACKAGE "bzflag"
| #define VERSION "2.1.14"
| #define BZ_BUILD_OS "darwin8.11.1"
| #define BZ_BUILD_USER "delusional"
| #define HAVE_NCURSES_H
| #define BZ_PLUGINS 1
| #define ROBOT 1
| #ifdef __cplusplus
| extern "C" void std::exit (int); using std::exit;
| #endif
| #define STDC_HEADERS 1
| #define HAVE_SYS_TYPES_H 1
| #define HAVE_SYS_STAT_H 1
| #define HAVE_STDLIB_H 1
| #define HAVE_STRING_H 1
| #define HAVE_MEMORY_H 1
| #define HAVE_STRINGS_H 1
| #define HAVE_INTTYPES_H 1
| #define HAVE_STDINT_H 1
| #define HAVE_UNISTD_H 1
| #define HAVE_DLFCN_H 1
| #define HAVE_LIBM 1
| /* end confdefs.h. */
|
| /* Override any gcc2 internal prototype to avoid an error. */
| #ifdef __cplusplus
| extern "C"
| #endif
| /* We use char because int might match the return type of a gcc2
| builtin and then its argument prototype would still apply. */
| char socket ();
| int
| main ()
| {
| socket ();
| ;
| return 0;
| }
configure:21229: result: no
configure:21241: checking for gethostent in -lsocket
configure:21271: gcc -o conftest -g -O2 conftest.c -lsocket -lm >&5
/usr/bin/ld: can't locate file for: -lsocket
collect2: ld returned 1 exit status
configure:21277: $? = 1
configure: failed program was:
| /* confdefs.h. */
|
| #define PACKAGE_NAME "BZFlag"
| #define PACKAGE_TARNAME "bzflag"
| #define PACKAGE_VERSION "2.1.14"
| #define PACKAGE_STRING "BZFlag 2.1.14"
| #define PACKAGE_BUGREPORT "http://BZFlag.org"
| #define PACKAGE "bzflag"
| #define VERSION "2.1.14"
| #define BZ_BUILD_OS "darwin8.11.1"
| #define BZ_BUILD_USER "delusional"
| #define HAVE_NCURSES_H
| #define BZ_PLUGINS 1
| #define ROBOT 1
| #ifdef __cplusplus
| extern "C" void std::exit (int); using std::exit;
| #endif
| #define STDC_HEADERS 1
| #define HAVE_SYS_TYPES_H 1
| #define HAVE_SYS_STAT_H 1
| #define HAVE_STDLIB_H 1
| #define HAVE_STRING_H 1
| #define HAVE_MEMORY_H 1
| #define HAVE_STRINGS_H 1
| #define HAVE_INTTYPES_H 1
| #define HAVE_STDINT_H 1
| #define HAVE_UNISTD_H 1
| #define HAVE_DLFCN_H 1
| #define HAVE_LIBM 1
| /* end confdefs.h. */
|
| /* Override any gcc2 internal prototype to avoid an error. */
| #ifdef __cplusplus
| extern "C"
| #endif
| /* We use char because int might match the return type of a gcc2
| builtin and then its argument prototype would still apply. */
| char gethostent ();
| int
| main ()
| {
| gethostent ();
| ;
| return 0;
| }
configure:21303: result: no
configure:21314: checking for gethostent in -lbind
configure:21344: gcc -o conftest -g -O2 conftest.c -lbind -lm >&5
/usr/bin/ld: can't locate file for: -lbind
collect2: ld returned 1 exit status
configure:21350: $? = 1
configure: failed program was:
| /* confdefs.h. */
|
| #define PACKAGE_NAME "BZFlag"
| #define PACKAGE_TARNAME "bzflag"
| #define PACKAGE_VERSION "2.1.14"
| #define PACKAGE_STRING "BZFlag 2.1.14"
| #define PACKAGE_BUGREPORT "http://BZFlag.org"
| #define PACKAGE "bzflag"
| #define VERSION "2.1.14"
| #define BZ_BUILD_OS "darwin8.11.1"
| #define BZ_BUILD_USER "delusional"
| #define HAVE_NCURSES_H
| #define BZ_PLUGINS 1
| #define ROBOT 1
| #ifdef __cplusplus
| extern "C" void std::exit (int); using std::exit;
| #endif
| #define STDC_HEADERS 1
| #define HAVE_SYS_TYPES_H 1
| #define HAVE_SYS_STAT_H 1
| #define HAVE_STDLIB_H 1
| #define HAVE_STRING_H 1
| #define HAVE_MEMORY_H 1
| #define HAVE_STRINGS_H 1
| #define HAVE_INTTYPES_H 1
| #define HAVE_STDINT_H 1
| #define HAVE_UNISTD_H 1
| #define HAVE_DLFCN_H 1
| #define HAVE_LIBM 1
| /* end confdefs.h. */
|
| /* Override any gcc2 internal prototype to avoid an error. */
| #ifdef __cplusplus
| extern "C"
| #endif
| /* We use char because int might match the return type of a gcc2
| builtin and then its argument prototype would still apply. */
| char gethostent ();
| int
| main ()
| {
| gethostent ();
| ;
| return 0;
| }
configure:21376: result: no
configure:21391: checking for acosf in -lm
configure:21421: gcc -o conftest -g -O2 conftest.c -lm -lm >&5
conftest.c:38: warning: conflicting types for built-in function 'acosf'
configure:21427: $? = 0
configure:21431: test -z
|| test ! -s conftest.err
configure:21434: $? = 0
configure:21437: test -s conftest
configure:21440: $? = 0
configure:21453: result: yes
configure:21463: checking for asinf in -lm
configure:21493: gcc -o conftest -g -O2 conftest.c -lm -lm >&5
conftest.c:39: warning: conflicting types for built-in function 'asinf'
configure:21499: $? = 0
configure:21503: test -z
|| test ! -s conftest.err
configure:21506: $? = 0
configure:21509: test -s conftest
configure:21512: $? = 0
configure:21525: result: yes
configure:21535: checking for atan2f in -lm
configure:21565: gcc -o conftest -g -O2 conftest.c -lm -lm >&5
conftest.c:40: warning: conflicting types for built-in function 'atan2f'
configure:21571: $? = 0
configure:21575: test -z
|| test ! -s conftest.err
configure:21578: $? = 0
configure:21581: test -s conftest
configure:21584: $? = 0
configure:21597: result: yes
configure:21607: checking for atanf in -lm
configure:21637: gcc -o conftest -g -O2 conftest.c -lm -lm >&5
conftest.c:41: warning: conflicting types for built-in function 'atanf'
configure:21643: $? = 0
configure:21647: test -z
|| test ! -s conftest.err
configure:21650: $? = 0
configure:21653: test -s conftest
configure:21656: $? = 0
configure:21669: result: yes
configure:21679: checking for cosf in -lm
configure:21709: gcc -o conftest -g -O2 conftest.c -lm -lm >&5
conftest.c:42: warning: conflicting types for built-in function 'cosf'
configure:21715: $? = 0
configure:21719: test -z
|| test ! -s conftest.err
configure:21722: $? = 0
configure:21725: test -s conftest
configure:21728: $? = 0
configure:21741: result: yes
configure:21751: checking for expf in -lm
configure:21781: gcc -o conftest -g -O2 conftest.c -lm -lm >&5
conftest.c:43: warning: conflicting types for built-in function 'expf'
configure:21787: $? = 0
configure:21791: test -z
|| test ! -s conftest.err
configure:21794: $? = 0
configure:21797: test -s conftest
configure:21800: $? = 0
configure:21813: result: yes
configure:21823: checking for fabsf in -lm
configure:21853: gcc -o conftest -g -O2 conftest.c -lm -lm >&5
conftest.c:44: warning: conflicting types for built-in function 'fabsf'
configure:21859: $? = 0
configure:21863: test -z
|| test ! -s conftest.err
configure:21866: $? = 0
configure:21869: test -s conftest
configure:21872: $? = 0
configure:21885: result: yes
configure:21895: checking for floorf in -lm
configure:21925: gcc -o conftest -g -O2 conftest.c -lm -lm >&5
conftest.c:45: warning: conflicting types for built-in function 'floorf'
configure:21931: $? = 0
configure:21935: test -z
|| test ! -s conftest.err
configure:21938: $? = 0
configure:21941: test -s conftest
configure:21944: $? = 0
configure:21957: result: yes
configure:21967: checking for fmodf in -lm
configure:21997: gcc -o conftest -g -O2 conftest.c -lm -lm >&5
conftest.c:46: warning: conflicting types for built-in function 'fmodf'
configure:22003: $? = 0
configure:22007: test -z
|| test ! -s conftest.err
configure:22010: $? = 0
configure:22013: test -s conftest
configure:22016: $? = 0
configure:22029: result: yes
configure:22039: checking for hypotf in -lm
configure:22069: gcc -o conftest -g -O2 conftest.c -lm -lm >&5
conftest.c:47: warning: conflicting types for built-in function 'hypotf'
configure:22075: $? = 0
configure:22079: test -z
|| test ! -s conftest.err
configure:22082: $? = 0
configure:22085: test -s conftest
configure:22088: $? = 0
configure:22101: result: yes
configure:22111: checking for logf in -lm
configure:22141: gcc -o conftest -g -O2 conftest.c -lm -lm >&5
conftest.c:48: warning: conflicting types for built-in function 'logf'
configure:22147: $? = 0
configure:22151: test -z
|| test ! -s conftest.err
configure:22154: $? = 0
configure:22157: test -s conftest
configure:22160: $? = 0
configure:22173: result: yes
configure:22183: checking for log10f in -lm
configure:22213: gcc -o conftest -g -O2 conftest.c -lm -lm >&5
conftest.c:49: warning: conflicting types for built-in function 'log10f'
configure:22219: $? = 0
configure:22223: test -z
|| test ! -s conftest.err
configure:22226: $? = 0
configure:22229: test -s conftest
configure:22232: $? = 0
configure:22245: result: yes
configure:22255: checking for powf in -lm
configure:22285: gcc -o conftest -g -O2 conftest.c -lm -lm >&5
conftest.c:50: warning: conflicting types for built-in function 'powf'
configure:22291: $? = 0
configure:22295: test -z
|| test ! -s conftest.err
configure:22298: $? = 0
configure:22301: test -s conftest
configure:22304: $? = 0
configure:22317: result: yes
configure:22327: checking for sinf in -lm
configure:22357: gcc -o conftest -g -O2 conftest.c -lm -lm >&5
conftest.c:51: warning: conflicting types for built-in function 'sinf'
configure:22363: $? = 0
configure:22367: test -z
|| test ! -s conftest.err
configure:22370: $? = 0
configure:22373: test -s conftest
configure:22376: $? = 0
configure:22389: result: yes
configure:22399: checking for sqrtf in -lm
configure:22461: result: yes
configure:22471: checking for tanf in -lm
configure:22501: gcc -o conftest -g -O2 conftest.c -lm -lm >&5
conftest.c:53: warning: conflicting types for built-in function 'tanf'
configure:22507: $? = 0
configure:22511: test -z
|| test ! -s conftest.err
configure:22514: $? = 0
configure:22517: test -s conftest
configure:22520: $? = 0
configure:22533: result: yes
configure:22562: checking ... h e a d e r s
configure:22564: result: (4 of 9)
configure:22578: checking for ANSI C header files
configure:22731: result: yes
configure:22770: checking cmath usability
configure:22782: g++ -c -g -O2 conftest.cc >&5
configure:22788: $? = 0
configure:22792: test -z
|| test ! -s conftest.err
configure:22795: $? = 0
configure:22798: test -s conftest.o
configure:22801: $? = 0
configure:22811: result: yes
configure:22815: checking cmath presence
configure:22825: g++ -E conftest.cc
configure:22831: $? = 0
configure:22851: result: yes
configure:22886: checking for cmath
configure:22893: result: yes
configure:22770: checking cstdlib usability
configure:22782: g++ -c -g -O2 conftest.cc >&5
configure:22788: $? = 0
configure:22792: test -z
|| test ! -s conftest.err
configure:22795: $? = 0
configure:22798: test -s conftest.o
configure:22801: $? = 0
configure:22811: result: yes
configure:22815: checking cstdlib presence
configure:22825: g++ -E conftest.cc
configure:22831: $? = 0
configure:22851: result: yes
configure:22886: checking for cstdlib
configure:22893: result: yes
configure:22770: checking cstdio usability
configure:22782: g++ -c -g -O2 conftest.cc >&5
configure:22788: $? = 0
configure:22792: test -z
|| test ! -s conftest.err
configure:22795: $? = 0
configure:22798: test -s conftest.o
configure:22801: $? = 0
configure:22811: result: yes
configure:22815: checking cstdio presence
configure:22825: g++ -E conftest.cc
configure:22831: $? = 0
configure:22851: result: yes
configure:22886: checking for cstdio
configure:22893: result: yes
configure:22770: checking cstring usability
configure:22782: g++ -c -g -O2 conftest.cc >&5
configure:22788: $? = 0
configure:22792: test -z
|| test ! -s conftest.err
configure:22795: $? = 0
configure:22798: test -s conftest.o
configure:22801: $? = 0
configure:22811: result: yes
configure:22815: checking cstring presence
configure:22825: g++ -E conftest.cc
configure:22831: $? = 0
configure:22851: result: yes
configure:22886: checking for cstring
configure:22893: result: yes
configure:22956: checking GL/glx.h usability
configure:22968: gcc -c -g -O2 conftest.c >&5
conftest.c:86:20: error: GL/glx.h: No such file or directory
configure:22974: $? = 1
configure: failed program was:
| /* confdefs.h. */
|
| #define PACKAGE_NAME "BZFlag"
| #define PACKAGE_TARNAME "bzflag"
| #define PACKAGE_VERSION "2.1.14"
| #define PACKAGE_STRING "BZFlag 2.1.14"
| #define PACKAGE_BUGREPORT "http://BZFlag.org"
| #define PACKAGE "bzflag"
| #define VERSION "2.1.14"
| #define BZ_BUILD_OS "darwin8.11.1"
| #define BZ_BUILD_USER "delusional"
| #define HAVE_NCURSES_H
| #define BZ_PLUGINS 1
| #define ROBOT 1
| #ifdef __cplusplus
| extern "C" void std::exit (int); using std::exit;
| #endif
| #define STDC_HEADERS 1
| #define HAVE_SYS_TYPES_H 1
| #define HAVE_SYS_STAT_H 1
| #define HAVE_STDLIB_H 1
| #define HAVE_STRING_H 1
| #define HAVE_MEMORY_H 1
| #define HAVE_STRINGS_H 1
| #define HAVE_INTTYPES_H 1
| #define HAVE_STDINT_H 1
| #define HAVE_UNISTD_H 1
| #define HAVE_DLFCN_H 1
| #define HAVE_LIBM 1
| #define HAVE_ACOSF 1
| #define HAVE_ASINF 1
| #define HAVE_ATAN2F 1
| #define HAVE_ATANF 1
| #define HAVE_COSF 1
| #define HAVE_EXPF 1
| #define HAVE_FABSF 1
| #define HAVE_FLOORF 1
| #define HAVE_FMODF 1
| #define HAVE_HYPOTF 1
| #define HAVE_LOGF 1
| #define HAVE_LOG10F 1
| #define HAVE_POWF 1
| #define HAVE_SINF 1
| #define HAVE_SQRTF 1
| #define HAVE_TANF 1
| #define STDC_HEADERS 1
| #define HAVE_CMATH 1
| #define HAVE_CSTDLIB 1
| #define HAVE_CSTDIO 1
| #define HAVE_CSTRING 1
| /* end confdefs.h. */
| #include <stdio.h>
| #if HAVE_SYS_TYPES_H
| # include <sys/types.h>
| #endif
| #if HAVE_SYS_STAT_H
| # include <sys/stat.h>
| #endif
| #if STDC_HEADERS
| # include <stdlib.h>
| # include <stddef.h>
| #else
| # if HAVE_STDLIB_H
| # include <stdlib.h>
| # endif
| #endif
| #if HAVE_STRING_H
| # if !STDC_HEADERS && HAVE_MEMORY_H
| # include <memory.h>
| # endif
| # include <string.h>
| #endif
| #if HAVE_STRINGS_H
| # include <strings.h>
| #endif
| #if HAVE_INTTYPES_H
| # include <inttypes.h>
| #else
| # if HAVE_STDINT_H
| # include <stdint.h>
| # endif
| #endif
| #if HAVE_UNISTD_H
| # include <unistd.h>
| #endif
| #include <GL/glx.h>
configure:22997: result: no
configure:23001: checking GL/glx.h presence
configure:23011: gcc -E conftest.c
conftest.c:52:20: error: GL/glx.h: No such file or directory
configure:23017: $? = 1
configure: failed program was:
| /* confdefs.h. */
|
| #define PACKAGE_NAME "BZFlag"
| #define PACKAGE_TARNAME "bzflag"
| #define PACKAGE_VERSION "2.1.14"
| #define PACKAGE_STRING "BZFlag 2.1.14"
| #define PACKAGE_BUGREPORT "http://BZFlag.org"
| #define PACKAGE "bzflag"
| #define VERSION "2.1.14"
| #define BZ_BUILD_OS "darwin8.11.1"
| #define BZ_BUILD_USER "delusional"
| #define HAVE_NCURSES_H
| #define BZ_PLUGINS 1
| #define ROBOT 1
| #ifdef __cplusplus
| extern "C" void std::exit (int); using std::exit;
| #endif
| #define STDC_HEADERS 1
| #define HAVE_SYS_TYPES_H 1
| #define HAVE_SYS_STAT_H 1
| #define HAVE_STDLIB_H 1
| #define HAVE_STRING_H 1
| #define HAVE_MEMORY_H 1
| #define HAVE_STRINGS_H 1
| #define HAVE_INTTYPES_H 1
| #define HAVE_STDINT_H 1
| #define HAVE_UNISTD_H 1
| #define HAVE_DLFCN_H 1
| #define HAVE_LIBM 1
| #define HAVE_ACOSF 1
| #define HAVE_ASINF 1
| #define HAVE_ATAN2F 1
| #define HAVE_ATANF 1
| #define HAVE_COSF 1
| #define HAVE_EXPF 1
| #define HAVE_FABSF 1
| #define HAVE_FLOORF 1
| #define HAVE_FMODF 1
| #define HAVE_HYPOTF 1
| #define HAVE_LOGF 1
| #define HAVE_LOG10F 1
| #define HAVE_POWF 1
| #define HAVE_SINF 1
| #define HAVE_SQRTF 1
| #define HAVE_TANF 1
| #define STDC_HEADERS 1
| #define HAVE_CMATH 1
| #define HAVE_CSTDLIB 1
| #define HAVE_CSTDIO 1
| #define HAVE_CSTRING 1
| /* end confdefs.h. */
| #include <GL/glx.h>
configure:23037: result: no
configure:23072: checking for GL/glx.h
configure:23079: result: no
configure:22956: checking SDL/SDL.h usability
configure:22968: gcc -c -g -O2 conftest.c >&5
configure:22974: $? = 0
configure:22978: test -z
|| test ! -s conftest.err
configure:22981: $? = 0
configure:22984: test -s conftest.o
configure:22987: $? = 0
configure:22997: result: yes
configure:23001: checking SDL/SDL.h presence
configure:23011: gcc -E conftest.c
configure:23017: $? = 0
configure:23037: result: yes
configure:23072: checking for SDL/SDL.h
configure:23079: result: yes
configure:22956: checking X11/Xlib.h usability
configure:22968: gcc -c -g -O2 conftest.c >&5
configure:22974: $? = 0
configure:22978: test -z
|| test ! -s conftest.err
configure:22981: $? = 0
configure:22984: test -s conftest.o
configure:22987: $? = 0
configure:22997: result: yes
configure:23001: checking X11/Xlib.h presence
configure:23011: gcc -E conftest.c
configure:23017: $? = 0
configure:23037: result: yes
configure:23072: checking for X11/Xlib.h
configure:23079: result: yes
configure:22956: checking arpa/nameser_compat.h usability
configure:22968: gcc -c -g -O2 conftest.c >&5
configure:22974: $? = 0
configure:22978: test -z
|| test ! -s conftest.err
configure:22981: $? = 0
configure:22984: test -s conftest.o
configure:22987: $? = 0
configure:22997: result: yes
configure:23001: checking arpa/nameser_compat.h presence
configure:23011: gcc -E conftest.c
configure:23017: $? = 0
configure:23037: result: yes
configure:23072: checking for arpa/nameser_compat.h
configure:23079: result: yes
configure:22956: checking bstring.h usability
configure:22968: gcc -c -g -O2 conftest.c >&5
conftest.c:89:21: error: bstring.h: No such file or directory
configure:22974: $? = 1
configure: failed program was:
| /* confdefs.h. */
|
| #define PACKAGE_NAME "BZFlag"
| #define PACKAGE_TARNAME "bzflag"
| #define PACKAGE_VERSION "2.1.14"
| #define PACKAGE_STRING "BZFlag 2.1.14"
| #define PACKAGE_BUGREPORT "http://BZFlag.org"
| #define PACKAGE "bzflag"
| #define VERSION "2.1.14"
| #define BZ_BUILD_OS "darwin8.11.1"
| #define BZ_BUILD_USER "delusional"
| #define HAVE_NCURSES_H
| #define BZ_PLUGINS 1
| #define ROBOT 1
| #ifdef __cplusplus
| extern "C" void std::exit (int); using std::exit;
| #endif
| #define STDC_HEADERS 1
| #define HAVE_SYS_TYPES_H 1
| #define HAVE_SYS_STAT_H 1
| #define HAVE_STDLIB_H 1
| #define HAVE_STRING_H 1
| #define HAVE_MEMORY_H 1
| #define HAVE_STRINGS_H 1
| #define HAVE_INTTYPES_H 1
| #define HAVE_STDINT_H 1
| #define HAVE_UNISTD_H 1
| #define HAVE_DLFCN_H 1
| #define HAVE_LIBM 1
| #define HAVE_ACOSF 1
| #define HAVE_ASINF 1
| #define HAVE_ATAN2F 1
| #define HAVE_ATANF 1
| #define HAVE_COSF 1
| #define HAVE_EXPF 1
| #define HAVE_FABSF 1
| #define HAVE_FLOORF 1
| #define HAVE_FMODF 1
| #define HAVE_HYPOTF 1
| #define HAVE_LOGF 1
| #define HAVE_LOG10F 1
| #define HAVE_POWF 1
| #define HAVE_SINF 1
| #define HAVE_SQRTF 1
| #define HAVE_TANF 1
| #define STDC_HEADERS 1
| #define HAVE_CMATH 1
| #define HAVE_CSTDLIB 1
| #define HAVE_CSTDIO 1
| #define HAVE_CSTRING 1
| #define HAVE_SDL_SDL_H 1
| #define HAVE_X11_XLIB_H 1
| #define HAVE_ARPA_NAMESER_COMPAT_H 1
| /* end confdefs.h. */
| #include <stdio.h>
| #if HAVE_SYS_TYPES_H
| # include <sys/types.h>
| #endif
| #if HAVE_SYS_STAT_H
| # include <sys/stat.h>
| #endif
| #if STDC_HEADERS
| # include <stdlib.h>
| # include <stddef.h>
| #else
| # if HAVE_STDLIB_H
| # include <stdlib.h>
| # endif
| #endif
| #if HAVE_STRING_H
| # if !STDC_HEADERS && HAVE_MEMORY_H
| # include <memory.h>
| # endif
| # include <string.h>
| #endif
| #if HAVE_STRINGS_H
| # include <strings.h>
| #endif
| #if HAVE_INTTYPES_H
| # include <inttypes.h>
| #else
| # if HAVE_STDINT_H
| # include <stdint.h>
| # endif
| #endif
| #if HAVE_UNISTD_H
| # include <unistd.h>
| #endif
| #include <bstring.h>
configure:22997: result: no
configure:23001: checking bstring.h presence
configure:23011: gcc -E conftest.c
conftest.c:55:21: error: bstring.h: No such file or directory
configure:23017: $? = 1
configure: failed program was:
| /* confdefs.h. */
|
| #define PACKAGE_NAME "BZFlag"
| #define PACKAGE_TARNAME "bzflag"
| #define PACKAGE_VERSION "2.1.14"
| #define PACKAGE_STRING "BZFlag 2.1.14"
| #define PACKAGE_BUGREPORT "http://BZFlag.org"
| #define PACKAGE "bzflag"
| #define VERSION "2.1.14"
| #define BZ_BUILD_OS "darwin8.11.1"
| #define BZ_BUILD_USER "delusional"
| #define HAVE_NCURSES_H
| #define BZ_PLUGINS 1
| #define ROBOT 1
| #ifdef __cplusplus
| extern "C" void std::exit (int); using std::exit;
| #endif
| #define STDC_HEADERS 1
| #define HAVE_SYS_TYPES_H 1
| #define HAVE_SYS_STAT_H 1
| #define HAVE_STDLIB_H 1
| #define HAVE_STRING_H 1
| #define HAVE_MEMORY_H 1
| #define HAVE_STRINGS_H 1
| #define HAVE_INTTYPES_H 1
| #define HAVE_STDINT_H 1
| #define HAVE_UNISTD_H 1
| #define HAVE_DLFCN_H 1
| #define HAVE_LIBM 1
| #define HAVE_ACOSF 1
| #define HAVE_ASINF 1
| #define HAVE_ATAN2F 1
| #define HAVE_ATANF 1
| #define HAVE_COSF 1
| #define HAVE_EXPF 1
| #define HAVE_FABSF 1
| #define HAVE_FLOORF 1
| #define HAVE_FMODF 1
| #define HAVE_HYPOTF 1
| #define HAVE_LOGF 1
| #define HAVE_LOG10F 1
| #define HAVE_POWF 1
| #define HAVE_SINF 1
| #define HAVE_SQRTF 1
| #define HAVE_TANF 1
| #define STDC_HEADERS 1
| #define HAVE_CMATH 1
| #define HAVE_CSTDLIB 1
| #define HAVE_CSTDIO 1
| #define HAVE_CSTRING 1
| #define HAVE_SDL_SDL_H 1
| #define HAVE_X11_XLIB_H 1
| #define HAVE_ARPA_NAMESER_COMPAT_H 1
| /* end confdefs.h. */
| #include <bstring.h>
configure:23037: result: no
configure:23072: checking for bstring.h
configure:23079: result: no
configure:22956: checking dsound.h usability
configure:22968: gcc -c -g -O2 conftest.c >&5
conftest.c:89:20: error: dsound.h: No such file or directory
configure:22974: $? = 1
configure: failed program was:
| /* confdefs.h. */
|
| #define PACKAGE_NAME "BZFlag"
| #define PACKAGE_TARNAME "bzflag"
| #define PACKAGE_VERSION "2.1.14"
| #define PACKAGE_STRING "BZFlag 2.1.14"
| #define PACKAGE_BUGREPORT "http://BZFlag.org"
| #define PACKAGE "bzflag"
| #define VERSION "2.1.14"
| #define BZ_BUILD_OS "darwin8.11.1"
| #define BZ_BUILD_USER "delusional"
| #define HAVE_NCURSES_H
| #define BZ_PLUGINS 1
| #define ROBOT 1
| #ifdef __cplusplus
| extern "C" void std::exit (int); using std::exit;
| #endif
| #define STDC_HEADERS 1
| #define HAVE_SYS_TYPES_H 1
| #define HAVE_SYS_STAT_H 1
| #define HAVE_STDLIB_H 1
| #define HAVE_STRING_H 1
| #define HAVE_MEMORY_H 1
| #define HAVE_STRINGS_H 1
| #define HAVE_INTTYPES_H 1
| #define HAVE_STDINT_H 1
| #define HAVE_UNISTD_H 1
| #define HAVE_DLFCN_H 1
| #define HAVE_LIBM 1
| #define HAVE_ACOSF 1
| #define HAVE_ASINF 1
| #define HAVE_ATAN2F 1
| #define HAVE_ATANF 1
| #define HAVE_COSF 1
| #define HAVE_EXPF 1
| #define HAVE_FABSF 1
| #define HAVE_FLOORF 1
| #define HAVE_FMODF 1
| #define HAVE_HYPOTF 1
| #define HAVE_LOGF 1
| #define HAVE_LOG10F 1
| #define HAVE_POWF 1
| #define HAVE_SINF 1
| #define HAVE_SQRTF 1
| #define HAVE_TANF 1
| #define STDC_HEADERS 1
| #define HAVE_CMATH 1
| #define HAVE_CSTDLIB 1
| #define HAVE_CSTDIO 1
| #define HAVE_CSTRING 1
| #define HAVE_SDL_SDL_H 1
| #define HAVE_X11_XLIB_H 1
| #define HAVE_ARPA_NAMESER_COMPAT_H 1
| /* end confdefs.h. */
| #include <stdio.h>
| #if HAVE_SYS_TYPES_H
| # include <sys/types.h>
| #endif
| #if HAVE_SYS_STAT_H
| # include <sys/stat.h>
| #endif
| #if STDC_HEADERS
| # include <stdlib.h>
| # include <stddef.h>
| #else
| # if HAVE_STDLIB_H
| # include <stdlib.h>
| # endif
| #endif
| #if HAVE_STRING_H
| # if !STDC_HEADERS && HAVE_MEMORY_H
| # include <memory.h>
| # endif
| # include <string.h>
| #endif
| #if HAVE_STRINGS_H
| # include <strings.h>
| #endif
| #if HAVE_INTTYPES_H
| # include <inttypes.h>
| #else
| # if HAVE_STDINT_H
| # include <stdint.h>
| # endif
| #endif
| #if HAVE_UNISTD_H
| # include <unistd.h>
| #endif
| #include <dsound.h>
configure:22997: result: no
configure:23001: checking dsound.h presence
configure:23011: gcc -E conftest.c
conftest.c:55:20: error: dsound.h: No such file or directory
configure:23017: $? = 1
configure: failed program was:
| /* confdefs.h. */
|
| #define PACKAGE_NAME "BZFlag"
| #define PACKAGE_TARNAME "bzflag"
| #define PACKAGE_VERSION "2.1.14"
| #define PACKAGE_STRING "BZFlag 2.1.14"
| #define PACKAGE_BUGREPORT "http://BZFlag.org"
| #define PACKAGE "bzflag"
| #define VERSION "2.1.14"
| #define BZ_BUILD_OS "darwin8.11.1"
| #define BZ_BUILD_USER "delusional"
| #define HAVE_NCURSES_H
| #define BZ_PLUGINS 1
| #define ROBOT 1
| #ifdef __cplusplus
| extern "C" void std::exit (int); using std::exit;
| #endif
| #define STDC_HEADERS 1
| #define HAVE_SYS_TYPES_H 1
| #define HAVE_SYS_STAT_H 1
| #define HAVE_STDLIB_H 1
| #define HAVE_STRING_H 1
| #define HAVE_MEMORY_H 1
| #define HAVE_STRINGS_H 1
| #define HAVE_INTTYPES_H 1
| #define HAVE_STDINT_H 1
| #define HAVE_UNISTD_H 1
| #define HAVE_DLFCN_H 1
| #define HAVE_LIBM 1
| #define HAVE_ACOSF 1
| #define HAVE_ASINF 1
| #define HAVE_ATAN2F 1
| #define HAVE_ATANF 1
| #define HAVE_COSF 1
| #define HAVE_EXPF 1
| #define HAVE_FABSF 1
| #define HAVE_FLOORF 1
| #define HAVE_FMODF 1
| #define HAVE_HYPOTF 1
| #define HAVE_LOGF 1
| #define HAVE_LOG10F 1
| #define HAVE_POWF 1
| #define HAVE_SINF 1
| #define HAVE_SQRTF 1
| #define HAVE_TANF 1
| #define STDC_HEADERS 1
| #define HAVE_CMATH 1
| #define HAVE_CSTDLIB 1
| #define HAVE_CSTDIO 1
| #define HAVE_CSTRING 1
| #define HAVE_SDL_SDL_H 1
| #define HAVE_X11_XLIB_H 1
| #define HAVE_ARPA_NAMESER_COMPAT_H 1
| /* end confdefs.h. */
| #include <dsound.h>
configure:23037: result: no
configure:23072: checking for dsound.h
configure:23079: result: no
configure:22947: checking for inttypes.h
configure:22952: result: yes
configure:22956: checking linux/input.h usability
configure:22968: gcc -c -g -O2 conftest.c >&5
conftest.c:90:25: error: linux/input.h: No such file or directory
configure:22974: $? = 1
configure: failed program was:
| /* confdefs.h. */
|
| #define PACKAGE_NAME "BZFlag"
| #define PACKAGE_TARNAME "bzflag"
| #define PACKAGE_VERSION "2.1.14"
| #define PACKAGE_STRING "BZFlag 2.1.14"
| #define PACKAGE_BUGREPORT "http://BZFlag.org"
| #define PACKAGE "bzflag"
| #define VERSION "2.1.14"
| #define BZ_BUILD_OS "darwin8.11.1"
| #define BZ_BUILD_USER "delusional"
| #define HAVE_NCURSES_H
| #define BZ_PLUGINS 1
| #define ROBOT 1
| #ifdef __cplusplus
| extern "C" void std::exit (int); using std::exit;
| #endif
| #define STDC_HEADERS 1
| #define HAVE_SYS_TYPES_H 1
| #define HAVE_SYS_STAT_H 1
| #define HAVE_STDLIB_H 1
| #define HAVE_STRING_H 1
| #define HAVE_MEMORY_H 1
| #define HAVE_STRINGS_H 1
| #define HAVE_INTTYPES_H 1
| #define HAVE_STDINT_H 1
| #define HAVE_UNISTD_H 1
| #define HAVE_DLFCN_H 1
| #define HAVE_LIBM 1
| #define HAVE_ACOSF 1
| #define HAVE_ASINF 1
| #define HAVE_ATAN2F 1
| #define HAVE_ATANF 1
| #define HAVE_COSF 1
| #define HAVE_EXPF 1
| #define HAVE_FABSF 1
| #define HAVE_FLOORF 1
| #define HAVE_FMODF 1
| #define HAVE_HYPOTF 1
| #define HAVE_LOGF 1
| #define HAVE_LOG10F 1
| #define HAVE_POWF 1
| #define HAVE_SINF 1
| #define HAVE_SQRTF 1
| #define HAVE_TANF 1
| #define STDC_HEADERS 1
| #define HAVE_CMATH 1
| #define HAVE_CSTDLIB 1
| #define HAVE_CSTDIO 1
| #define HAVE_CSTRING 1
| #define HAVE_SDL_SDL_H 1
| #define HAVE_X11_XLIB_H 1
| #define HAVE_ARPA_NAMESER_COMPAT_H 1
| #define HAVE_INTTYPES_H 1
| /* end confdefs.h. */
| #include <stdio.h>
| #if HAVE_SYS_TYPES_H
| # include <sys/types.h>
| #endif
| #if HAVE_SYS_STAT_H
| # include <sys/stat.h>
| #endif
| #if STDC_HEADERS
| # include <stdlib.h>
| # include <stddef.h>
| #else
| # if HAVE_STDLIB_H
| # include <stdlib.h>
| # endif
| #endif
| #if HAVE_STRING_H
| # if !STDC_HEADERS && HAVE_MEMORY_H
| # include <memory.h>
| # endif
| # include <string.h>
| #endif
| #if HAVE_STRINGS_H
| # include <strings.h>
| #endif
| #if HAVE_INTTYPES_H
| # include <inttypes.h>
| #else
| # if HAVE_STDINT_H
| # include <stdint.h>
| # endif
| #endif
| #if HAVE_UNISTD_H
| # include <unistd.h>
| #endif
| #include <linux/input.h>
configure:22997: result: no
configure:23001: checking linux/input.h presence
configure:23011: gcc -E conftest.c
conftest.c:56:25: error: linux/input.h: No such file or directory
configure:23017: $? = 1
configure: failed program was:
| /* confdefs.h. */
|
| #define PACKAGE_NAME "BZFlag"
| #define PACKAGE_TARNAME "bzflag"
| #define PACKAGE_VERSION "2.1.14"
| #define PACKAGE_STRING "BZFlag 2.1.14"
| #define PACKAGE_BUGREPORT "http://BZFlag.org"
| #define PACKAGE "bzflag"
| #define VERSION "2.1.14"
| #define BZ_BUILD_OS "darwin8.11.1"
| #define BZ_BUILD_USER "delusional"
| #define HAVE_NCURSES_H
| #define BZ_PLUGINS 1
| #define ROBOT 1
| #ifdef __cplusplus
| extern "C" void std::exit (int); using std::exit;
| #endif
| #define STDC_HEADERS 1
| #define HAVE_SYS_TYPES_H 1
| #define HAVE_SYS_STAT_H 1
| #define HAVE_STDLIB_H 1
| #define HAVE_STRING_H 1
| #define HAVE_MEMORY_H 1
| #define HAVE_STRINGS_H 1
| #define HAVE_INTTYPES_H 1
| #define HAVE_STDINT_H 1
| #define HAVE_UNISTD_H 1
| #define HAVE_DLFCN_H 1
| #define HAVE_LIBM 1
| #define HAVE_ACOSF 1
| #define HAVE_ASINF 1
| #define HAVE_ATAN2F 1
| #define HAVE_ATANF 1
| #define HAVE_COSF 1
| #define HAVE_EXPF 1
| #define HAVE_FABSF 1
| #define HAVE_FLOORF 1
| #define HAVE_FMODF 1
| #define HAVE_HYPOTF 1
| #define HAVE_LOGF 1
| #define HAVE_LOG10F 1
| #define HAVE_POWF 1
| #define HAVE_SINF 1
| #define HAVE_SQRTF 1
| #define HAVE_TANF 1
| #define STDC_HEADERS 1
| #define HAVE_CMATH 1
| #define HAVE_CSTDLIB 1
| #define HAVE_CSTDIO 1
| #define HAVE_CSTRING 1
| #define HAVE_SDL_SDL_H 1
| #define HAVE_X11_XLIB_H 1
| #define HAVE_ARPA_NAMESER_COMPAT_H 1
| #define HAVE_INTTYPES_H 1
| /* end confdefs.h. */
| #include <linux/input.h>
configure:23037: result: no
configure:23072: checking for linux/input.h
configure:23079: result: no
configure:22956: checking process.h usability
configure:22968: gcc -c -g -O2 conftest.c >&5
conftest.c:90:21: error: process.h: No such file or directory
configure:22974: $? = 1
configure: failed program was:
| /* confdefs.h. */
|
| #define PACKAGE_NAME "BZFlag"
| #define PACKAGE_TARNAME "bzflag"
| #define PACKAGE_VERSION "2.1.14"
| #define PACKAGE_STRING "BZFlag 2.1.14"
| #define PACKAGE_BUGREPORT "http://BZFlag.org"
| #define PACKAGE "bzflag"
| #define VERSION "2.1.14"
| #define BZ_BUILD_OS "darwin8.11.1"
| #define BZ_BUILD_USER "delusional"
| #define HAVE_NCURSES_H
| #define BZ_PLUGINS 1
| #define ROBOT 1
| #ifdef __cplusplus
| extern "C" void std::exit (int); using std::exit;
| #endif
| #define STDC_HEADERS 1
| #define HAVE_SYS_TYPES_H 1
| #define HAVE_SYS_STAT_H 1
| #define HAVE_STDLIB_H 1
| #define HAVE_STRING_H 1
| #define HAVE_MEMORY_H 1
| #define HAVE_STRINGS_H 1
| #define HAVE_INTTYPES_H 1
| #define HAVE_STDINT_H 1
| #define HAVE_UNISTD_H 1
| #define HAVE_DLFCN_H 1
| #define HAVE_LIBM 1
| #define HAVE_ACOSF 1
| #define HAVE_ASINF 1
| #define HAVE_ATAN2F 1
| #define HAVE_ATANF 1
| #define HAVE_COSF 1
| #define HAVE_EXPF 1
| #define HAVE_FABSF 1
| #define HAVE_FLOORF 1
| #define HAVE_FMODF 1
| #define HAVE_HYPOTF 1
| #define HAVE_LOGF 1
| #define HAVE_LOG10F 1
| #define HAVE_POWF 1
| #define HAVE_SINF 1
| #define HAVE_SQRTF 1
| #define HAVE_TANF 1
| #define STDC_HEADERS 1
| #define HAVE_CMATH 1
| #define HAVE_CSTDLIB 1
| #define HAVE_CSTDIO 1
| #define HAVE_CSTRING 1
| #define HAVE_SDL_SDL_H 1
| #define HAVE_X11_XLIB_H 1
| #define HAVE_ARPA_NAMESER_COMPAT_H 1
| #define HAVE_INTTYPES_H 1
| /* end confdefs.h. */
| #include <stdio.h>
| #if HAVE_SYS_TYPES_H
| # include <sys/types.h>
| #endif
| #if HAVE_SYS_STAT_H
| # include <sys/stat.h>
| #endif
| #if STDC_HEADERS
| # include <stdlib.h>
| # include <stddef.h>
| #else
| # if HAVE_STDLIB_H
| # include <stdlib.h>
| # endif
| #endif
| #if HAVE_STRING_H
| # if !STDC_HEADERS && HAVE_MEMORY_H
| # include <memory.h>
| # endif
| # include <string.h>
| #endif
| #if HAVE_STRINGS_H
| # include <strings.h>
| #endif
| #if HAVE_INTTYPES_H
| # include <inttypes.h>
| #else
| # if HAVE_STDINT_H
| # include <stdint.h>
| # endif
| #endif
| #if HAVE_UNISTD_H
| # include <unistd.h>
| #endif
| #include <process.h>
configure:22997: result: no
configure:23001: checking process.h presence
configure:23011: gcc -E conftest.c
conftest.c:56:21: error: process.h: No such file or directory
configure:23017: $? = 1
configure: failed program was:
| /* confdefs.h. */
|
| #define PACKAGE_NAME "BZFlag"
| #define PACKAGE_TARNAME "bzflag"
| #define PACKAGE_VERSION "2.1.14"
| #define PACKAGE_STRING "BZFlag 2.1.14"
| #define PACKAGE_BUGREPORT "http://BZFlag.org"
| #define PACKAGE "bzflag"
| #define VERSION "2.1.14"
| #define BZ_BUILD_OS "darwin8.11.1"
| #define BZ_BUILD_USER "delusional"
| #define HAVE_NCURSES_H
| #define BZ_PLUGINS 1
| #define ROBOT 1
| #ifdef __cplusplus
| extern "C" void std::exit (int); using std::exit;
| #endif
| #define STDC_HEADERS 1
| #define HAVE_SYS_TYPES_H 1
| #define HAVE_SYS_STAT_H 1
| #define HAVE_STDLIB_H 1
| #define HAVE_STRING_H 1
| #define HAVE_MEMORY_H 1
| #define HAVE_STRINGS_H 1
| #define HAVE_INTTYPES_H 1
| #define HAVE_STDINT_H 1
| #define HAVE_UNISTD_H 1
| #define HAVE_DLFCN_H 1
| #define HAVE_LIBM 1
| #define HAVE_ACOSF 1
| #define HAVE_ASINF 1
| #define HAVE_ATAN2F 1
| #define HAVE_ATANF 1
| #define HAVE_COSF 1
| #define HAVE_EXPF 1
| #define HAVE_FABSF 1
| #define HAVE_FLOORF 1
| #define HAVE_FMODF 1
| #define HAVE_HYPOTF 1
| #define HAVE_LOGF 1
| #define HAVE_LOG10F 1
| #define HAVE_POWF 1
| #define HAVE_SINF 1
| #define HAVE_SQRTF 1
| #define HAVE_TANF 1
| #define STDC_HEADERS 1
| #define HAVE_CMATH 1
| #define HAVE_CSTDLIB 1
| #define HAVE_CSTDIO 1
| #define HAVE_CSTRING 1
| #define HAVE_SDL_SDL_H 1
| #define HAVE_X11_XLIB_H 1
| #define HAVE_ARPA_NAMESER_COMPAT_H 1
| #define HAVE_INTTYPES_H 1
| /* end confdefs.h. */
| #include <process.h>
configure:23037: result: no
configure:23072: checking for process.h
configure:23079: result: no
configure:22956: checking sched.h usability
configure:22968: gcc -c -g -O2 conftest.c >&5
configure:22974: $? = 0
configure:22978: test -z
|| test ! -s conftest.err
configure:22981: $? = 0
configure:22984: test -s conftest.o
configure:22987: $? = 0
configure:22997: result: yes
configure:23001: checking sched.h presence
configure:23011: gcc -E conftest.c
configure:23017: $? = 0
configure:23037: result: yes
configure:23072: checking for sched.h
configure:23079: result: yes
configure:22947: checking for stdint.h
configure:22952: result: yes
configure:22956: checking sys/param.h usability
configure:22968: gcc -c -g -O2 conftest.c >&5
configure:22974: $? = 0
configure:22978: test -z
|| test ! -s conftest.err
configure:22981: $? = 0
configure:22984: test -s conftest.o
configure:22987: $? = 0
configure:22997: result: yes
configure:23001: checking sys/param.h presence
configure:23011: gcc -E conftest.c
configure:23017: $? = 0
configure:23037: result: yes
configure:23072: checking for sys/param.h
configure:23079: result: yes
configure:22947: checking for sys/types.h
configure:22952: result: yes
configure:22947: checking for unistd.h
configure:22952: result: yes
configure:22956: checking values.h usability
configure:22968: gcc -c -g -O2 conftest.c >&5
conftest.c:95:20: error: values.h: No such file or directory
configure:22974: $? = 1
configure: failed program was:
| /* confdefs.h. */
|
| #define PACKAGE_NAME "BZFlag"
| #define PACKAGE_TARNAME "bzflag"
| #define PACKAGE_VERSION "2.1.14"
| #define PACKAGE_STRING "BZFlag 2.1.14"
| #define PACKAGE_BUGREPORT "http://BZFlag.org"
| #define PACKAGE "bzflag"
| #define VERSION "2.1.14"
| #define BZ_BUILD_OS "darwin8.11.1"
| #define BZ_BUILD_USER "delusional"
| #define HAVE_NCURSES_H
| #define BZ_PLUGINS 1
| #define ROBOT 1
| #ifdef __cplusplus
| extern "C" void std::exit (int); using std::exit;
| #endif
| #define STDC_HEADERS 1
| #define HAVE_SYS_TYPES_H 1
| #define HAVE_SYS_STAT_H 1
| #define HAVE_STDLIB_H 1
| #define HAVE_STRING_H 1
| #define HAVE_MEMORY_H 1
| #define HAVE_STRINGS_H 1
| #define HAVE_INTTYPES_H 1
| #define HAVE_STDINT_H 1
| #define HAVE_UNISTD_H 1
| #define HAVE_DLFCN_H 1
| #define HAVE_LIBM 1
| #define HAVE_ACOSF 1
| #define HAVE_ASINF 1
| #define HAVE_ATAN2F 1
| #define HAVE_ATANF 1
| #define HAVE_COSF 1
| #define HAVE_EXPF 1
| #define HAVE_FABSF 1
| #define HAVE_FLOORF 1
| #define HAVE_FMODF 1
| #define HAVE_HYPOTF 1
| #define HAVE_LOGF 1
| #define HAVE_LOG10F 1
| #define HAVE_POWF 1
| #define HAVE_SINF 1
| #define HAVE_SQRTF 1
| #define HAVE_TANF 1
| #define STDC_HEADERS 1
| #define HAVE_CMATH 1
| #define HAVE_CSTDLIB 1
| #define HAVE_CSTDIO 1
| #define HAVE_CSTRING 1
| #define HAVE_SDL_SDL_H 1
| #define HAVE_X11_XLIB_H 1
| #define HAVE_ARPA_NAMESER_COMPAT_H 1
| #define HAVE_INTTYPES_H 1
| #define HAVE_SCHED_H 1
| #define HAVE_STDINT_H 1
| #define HAVE_SYS_PARAM_H 1
| #define HAVE_SYS_TYPES_H 1
| #define HAVE_UNISTD_H 1
| /* end confdefs.h. */
| #include <stdio.h>
| #if HAVE_SYS_TYPES_H
| # include <sys/types.h>
| #endif
| #if HAVE_SYS_STAT_H
| # include <sys/stat.h>
| #endif
| #if STDC_HEADERS
| # include <stdlib.h>
| # include <stddef.h>
| #else
| # if HAVE_STDLIB_H
| # include <stdlib.h>
| # endif
| #endif
| #if HAVE_STRING_H
| # if !STDC_HEADERS && HAVE_MEMORY_H
| # include <memory.h>
| # endif
| # include <string.h>
| #endif
| #if HAVE_STRINGS_H
| # include <strings.h>
| #endif
| #if HAVE_INTTYPES_H
| # include <inttypes.h>
| #else
| # if HAVE_STDINT_H
| # include <stdint.h>
| # endif
| #endif
| #if HAVE_UNISTD_H
| # include <unistd.h>
| #endif
| #include <values.h>
configure:22997: result: no
configure:23001: checking values.h presence
configure:23011: gcc -E conftest.c
conftest.c:61:20: error: values.h: No such file or directory
configure:23017: $? = 1
configure: failed program was:
| /* confdefs.h. */
|
| #define PACKAGE_NAME "BZFlag"
| #define PACKAGE_TARNAME "bzflag"
| #define PACKAGE_VERSION "2.1.14"
| #define PACKAGE_STRING "BZFlag 2.1.14"
| #define PACKAGE_BUGREPORT "http://BZFlag.org"
| #define PACKAGE "bzflag"
| #define VERSION "2.1.14"
| #define BZ_BUILD_OS "darwin8.11.1"
| #define BZ_BUILD_USER "delusional"
| #define HAVE_NCURSES_H
| #define BZ_PLUGINS 1
| #define ROBOT 1
| #ifdef __cplusplus
| extern "C" void std::exit (int); using std::exit;
| #endif
| #define STDC_HEADERS 1
| #define HAVE_SYS_TYPES_H 1
| #define HAVE_SYS_STAT_H 1
| #define HAVE_STDLIB_H 1
| #define HAVE_STRING_H 1
| #define HAVE_MEMORY_H 1
| #define HAVE_STRINGS_H 1
| #define HAVE_INTTYPES_H 1
| #define HAVE_STDINT_H 1
| #define HAVE_UNISTD_H 1
| #define HAVE_DLFCN_H 1
| #define HAVE_LIBM 1
| #define HAVE_ACOSF 1
| #define HAVE_ASINF 1
| #define HAVE_ATAN2F 1
| #define HAVE_ATANF 1
| #define HAVE_COSF 1
| #define HAVE_EXPF 1
| #define HAVE_FABSF 1
| #define HAVE_FLOORF 1
| #define HAVE_FMODF 1
| #define HAVE_HYPOTF 1
| #define HAVE_LOGF 1
| #define HAVE_LOG10F 1
| #define HAVE_POWF 1
| #define HAVE_SINF 1
| #define HAVE_SQRTF 1
| #define HAVE_TANF 1
| #define STDC_HEADERS 1
| #define HAVE_CMATH 1
| #define HAVE_CSTDLIB 1
| #define HAVE_CSTDIO 1
| #define HAVE_CSTRING 1
| #define HAVE_SDL_SDL_H 1
| #define HAVE_X11_XLIB_H 1
| #define HAVE_ARPA_NAMESER_COMPAT_H 1
| #define HAVE_INTTYPES_H 1
| #define HAVE_SCHED_H 1
| #define HAVE_STDINT_H 1
| #define HAVE_SYS_PARAM_H 1
| #define HAVE_SYS_TYPES_H 1
| #define HAVE_UNISTD_H 1
| /* end confdefs.h. */
| #include <values.h>
configure:23037: result: no
configure:23072: checking for values.h
configure:23079: result: no
configure:23105: checking regex.h usability
configure:23117: gcc -c -g -O2 conftest.c >&5
configure:23123: $? = 0
configure:23127: test -z
|| test ! -s conftest.err
configure:23130: $? = 0
configure:23133: test -s conftest.o
configure:23136: $? = 0
configure:23146: result: yes
configure:23150: checking regex.h presence
configure:23160: gcc -E conftest.c
configure:23166: $? = 0
configure:23186: result: yes
configure:23221: checking for regex.h
configure:23228: result: yes
configure:23261: checking ... t y p e s
configure:23263: result: (5 of 9)
configure:23279: checking whether byte ordering is bigendian
configure:23306: gcc -c -g -O2 conftest.c >&5
configure:23312: $? = 0
configure:23316: test -z
|| test ! -s conftest.err
configure:23319: $? = 0
configure:23322: test -s conftest.o
configure:23325: $? = 0
configure:23349: gcc -c -g -O2 conftest.c >&5
conftest.c: In function 'main':
conftest.c:69: error: 'not' undeclared (first use in this function)
conftest.c:69: error: (Each undeclared identifier is reported only once
conftest.c:69: error: for each function it appears in.)
conftest.c:69: error: parse error before 'big'
configure:23355: $? = 1
configure: failed program was:
| /* confdefs.h. */
|
| #define PACKAGE_NAME "BZFlag"
| #define PACKAGE_TARNAME "bzflag"
| #define PACKAGE_VERSION "2.1.14"
| #define PACKAGE_STRING "BZFlag 2.1.14"
| #define PACKAGE_BUGREPORT "http://BZFlag.org"
| #define PACKAGE "bzflag"
| #define VERSION "2.1.14"
| #define BZ_BUILD_OS "darwin8.11.1"
| #define BZ_BUILD_USER "delusional"
| #define HAVE_NCURSES_H
| #define BZ_PLUGINS 1
| #define ROBOT 1
| #ifdef __cplusplus
| extern "C" void std::exit (int); using std::exit;
| #endif
| #define STDC_HEADERS 1
| #define HAVE_SYS_TYPES_H 1
| #define HAVE_SYS_STAT_H 1
| #define HAVE_STDLIB_H 1
| #define HAVE_STRING_H 1
| #define HAVE_MEMORY_H 1
| #define HAVE_STRINGS_H 1
| #define HAVE_INTTYPES_H 1
| #define HAVE_STDINT_H 1
| #define HAVE_UNISTD_H 1
| #define HAVE_DLFCN_H 1
| #define HAVE_LIBM 1
| #define HAVE_ACOSF 1
| #define HAVE_ASINF 1
| #define HAVE_ATAN2F 1
| #define HAVE_ATANF 1
| #define HAVE_COSF 1
| #define HAVE_EXPF 1
| #define HAVE_FABSF 1
| #define HAVE_FLOORF 1
| #define HAVE_FMODF 1
| #define HAVE_HYPOTF 1
| #define HAVE_LOGF 1
| #define HAVE_LOG10F 1
| #define HAVE_POWF 1
| #define HAVE_SINF 1
| #define HAVE_SQRTF 1
| #define HAVE_TANF 1
| #define STDC_HEADERS 1
| #define HAVE_CMATH 1
| #define HAVE_CSTDLIB 1
| #define HAVE_CSTDIO 1
| #define HAVE_CSTRING 1
| #define HAVE_SDL_SDL_H 1
| #define HAVE_X11_XLIB_H 1
| #define HAVE_ARPA_NAMESER_COMPAT_H 1
| #define HAVE_INTTYPES_H 1
| #define HAVE_SCHED_H 1
| #define HAVE_STDINT_H 1
| #define HAVE_SYS_PARAM_H 1
| #define HAVE_SYS_TYPES_H 1
| #define HAVE_UNISTD_H 1
| #define HAVE_REGEX_H 1
| /* end confdefs.h. */
| #include <sys/types.h>
| #include <sys/param.h>
|
| int
| main ()
| {
| #if BYTE_ORDER != BIG_ENDIAN
| not big endian
| #endif
|
| ;
| return 0;
| }
configure:23490: result: no
configure:23509: checking for an ANSI C-conforming const
configure:23576: gcc -c -g -O2 conftest.c >&5
configure:23582: $? = 0
configure:23586: test -z
|| test ! -s conftest.err
configure:23589: $? = 0
configure:23592: test -s conftest.o
configure:23595: $? = 0
configure:23606: result: yes
configure:23617: checking for socklen_t type
configure:23636: gcc -c -g -O2 conftest.c >&5
configure:23642: $? = 0
configure:23646: test -z
|| test ! -s conftest.err
configure:23649: $? = 0
configure:23652: test -s conftest.o
configure:23655: $? = 0
configure:23754: result: yes
configure:23776: checking for OpenGL framework (Darwin-specific)
configure:23797: g++ -o conftest -g -O2 conftest.cc -lm -framework OpenGL >&5
configure:23803: $? = 0
configure:23807: test -z
|| test ! -s conftest.err
configure:23810: $? = 0
configure:23813: test -s conftest
configure:23816: $? = 0
configure:23818: result: yes
configure:25417: g++ -o conftest -g -O2 conftest.cc -lopengl32 -lm >&5
conftest.cc:63:19: error: GL/gl.h: No such file or directory
conftest.cc: In function 'int main()':
conftest.cc:67: error: 'GL_POINTS' was not declared in this scope
conftest.cc:67: error: 'glBegin' was not declared in this scope
configure:25423: $? = 1
configure: failed program was:
| /* confdefs.h. */
|
| #define PACKAGE_NAME "BZFlag"
| #define PACKAGE_TARNAME "bzflag"
| #define PACKAGE_VERSION "2.1.14"
| #define PACKAGE_STRING "BZFlag 2.1.14"
| #define PACKAGE_BUGREPORT "http://BZFlag.org"
| #define PACKAGE "bzflag"
| #define VERSION "2.1.14"
| #define BZ_BUILD_OS "darwin8.11.1"
| #define BZ_BUILD_USER "delusional"
| #define HAVE_NCURSES_H
| #define BZ_PLUGINS 1
| #define ROBOT 1
| #ifdef __cplusplus
| extern "C" void std::exit (int); using std::exit;
| #endif
| #define STDC_HEADERS 1
| #define HAVE_SYS_TYPES_H 1
| #define HAVE_SYS_STAT_H 1
| #define HAVE_STDLIB_H 1
| #define HAVE_STRING_H 1
| #define HAVE_MEMORY_H 1
| #define HAVE_STRINGS_H 1
| #define HAVE_INTTYPES_H 1
| #define HAVE_STDINT_H 1
| #define HAVE_UNISTD_H 1
| #define HAVE_DLFCN_H 1
| #define HAVE_LIBM 1
| #define HAVE_ACOSF 1
| #define HAVE_ASINF 1
| #define HAVE_ATAN2F 1
| #define HAVE_ATANF 1
| #define HAVE_COSF 1
| #define HAVE_EXPF 1
| #define HAVE_FABSF 1
| #define HAVE_FLOORF 1
| #define HAVE_FMODF 1
| #define HAVE_HYPOTF 1
| #define HAVE_LOGF 1
| #define HAVE_LOG10F 1
| #define HAVE_POWF 1
| #define HAVE_SINF 1
| #define HAVE_SQRTF 1
| #define HAVE_TANF 1
| #define STDC_HEADERS 1
| #define HAVE_CMATH 1
| #define HAVE_CSTDLIB 1
| #define HAVE_CSTDIO 1
| #define HAVE_CSTRING 1
| #define HAVE_SDL_SDL_H 1
| #define HAVE_X11_XLIB_H 1
| #define HAVE_ARPA_NAMESER_COMPAT_H 1
| #define HAVE_INTTYPES_H 1
| #define HAVE_SCHED_H 1
| #define HAVE_STDINT_H 1
| #define HAVE_SYS_PARAM_H 1
| #define HAVE_SYS_TYPES_H 1
| #define HAVE_UNISTD_H 1
| #define HAVE_REGEX_H 1
| #define HAVE_SOCKLEN_T 1
| /* end confdefs.h. */
| #include <GL/gl.h>
| int
| main ()
| {
| glBegin(GL_POINTS)
| ;
| return 0;
| }
configure:25417: g++ -o conftest -g -O2 conftest.cc -lGL -lm >&5
conftest.cc:63:19: error: GL/gl.h: No such file or directory
conftest.cc: In function 'int main()':
conftest.cc:67: error: 'GL_POINTS' was not declared in this scope
conftest.cc:67: error: 'glBegin' was not declared in this scope
configure:25423: $? = 1
configure: failed program was:
| /* confdefs.h. */
|
| #define PACKAGE_NAME "BZFlag"
| #define PACKAGE_TARNAME "bzflag"
| #define PACKAGE_VERSION "2.1.14"
| #define PACKAGE_STRING "BZFlag 2.1.14"
| #define PACKAGE_BUGREPORT "http://BZFlag.org"
| #define PACKAGE "bzflag"
| #define VERSION "2.1.14"
| #define BZ_BUILD_OS "darwin8.11.1"
| #define BZ_BUILD_USER "delusional"
| #define HAVE_NCURSES_H
| #define BZ_PLUGINS 1
| #define ROBOT 1
| #ifdef __cplusplus
| extern "C" void std::exit (int); using std::exit;
| #endif
| #define STDC_HEADERS 1
| #define HAVE_SYS_TYPES_H 1
| #define HAVE_SYS_STAT_H 1
| #define HAVE_STDLIB_H 1
| #define HAVE_STRING_H 1
| #define HAVE_MEMORY_H 1
| #define HAVE_STRINGS_H 1
| #define HAVE_INTTYPES_H 1
| #define HAVE_STDINT_H 1
| #define HAVE_UNISTD_H 1
| #define HAVE_DLFCN_H 1
| #define HAVE_LIBM 1
| #define HAVE_ACOSF 1
| #define HAVE_ASINF 1
| #define HAVE_ATAN2F 1
| #define HAVE_ATANF 1
| #define HAVE_COSF 1
| #define HAVE_EXPF 1
| #define HAVE_FABSF 1
| #define HAVE_FLOORF 1
| #define HAVE_FMODF 1
| #define HAVE_HYPOTF 1
| #define HAVE_LOGF 1
| #define HAVE_LOG10F 1
| #define HAVE_POWF 1
| #define HAVE_SINF 1
| #define HAVE_SQRTF 1
| #define HAVE_TANF 1
| #define STDC_HEADERS 1
| #define HAVE_CMATH 1
| #define HAVE_CSTDLIB 1
| #define HAVE_CSTDIO 1
| #define HAVE_CSTRING 1
| #define HAVE_SDL_SDL_H 1
| #define HAVE_X11_XLIB_H 1
| #define HAVE_ARPA_NAMESER_COMPAT_H 1
| #define HAVE_INTTYPES_H 1
| #define HAVE_SCHED_H 1
| #define HAVE_STDINT_H 1
| #define HAVE_SYS_PARAM_H 1
| #define HAVE_SYS_TYPES_H 1
| #define HAVE_UNISTD_H 1
| #define HAVE_REGEX_H 1
| #define HAVE_SOCKLEN_T 1
| /* end confdefs.h. */
| #include <GL/gl.h>
| int
| main ()
| {
| glBegin(GL_POINTS)
| ;
| return 0;
| }
configure:25417: g++ -o conftest -g -O2 conftest.cc -lGL2 -lm >&5
conftest.cc:63:19: error: GL/gl.h: No such file or directory
conftest.cc: In function 'int main()':
conftest.cc:67: error: 'GL_POINTS' was not declared in this scope
conftest.cc:67: error: 'glBegin' was not declared in this scope
configure:25423: $? = 1
configure: failed program was:
| /* confdefs.h. */
|
| #define PACKAGE_NAME "BZFlag"
| #define PACKAGE_TARNAME "bzflag"
| #define PACKAGE_VERSION "2.1.14"
| #define PACKAGE_STRING "BZFlag 2.1.14"
| #define PACKAGE_BUGREPORT "http://BZFlag.org"
| #define PACKAGE "bzflag"
| #define VERSION "2.1.14"
| #define BZ_BUILD_OS "darwin8.11.1"
| #define BZ_BUILD_USER "delusional"
| #define HAVE_NCURSES_H
| #define BZ_PLUGINS 1
| #define ROBOT 1
| #ifdef __cplusplus
| extern "C" void std::exit (int); using std::exit;
| #endif
| #define STDC_HEADERS 1
| #define HAVE_SYS_TYPES_H 1
| #define HAVE_SYS_STAT_H 1
| #define HAVE_STDLIB_H 1
| #define HAVE_STRING_H 1
| #define HAVE_MEMORY_H 1
| #define HAVE_STRINGS_H 1
| #define HAVE_INTTYPES_H 1
| #define HAVE_STDINT_H 1
| #define HAVE_UNISTD_H 1
| #define HAVE_DLFCN_H 1
| #define HAVE_LIBM 1
| #define HAVE_ACOSF 1
| #define HAVE_ASINF 1
| #define HAVE_ATAN2F 1
| #define HAVE_ATANF 1
| #define HAVE_COSF 1
| #define HAVE_EXPF 1
| #define HAVE_FABSF 1
| #define HAVE_FLOORF 1
| #define HAVE_FMODF 1
| #define HAVE_HYPOTF 1
| #define HAVE_LOGF 1
| #define HAVE_LOG10F 1
| #define HAVE_POWF 1
| #define HAVE_SINF 1
| #define HAVE_SQRTF 1
| #define HAVE_TANF 1
| #define STDC_HEADERS 1
| #define HAVE_CMATH 1
| #define HAVE_CSTDLIB 1
| #define HAVE_CSTDIO 1
| #define HAVE_CSTRING 1
| #define HAVE_SDL_SDL_H 1
| #define HAVE_X11_XLIB_H 1
| #define HAVE_ARPA_NAMESER_COMPAT_H 1
| #define HAVE_INTTYPES_H 1
| #define HAVE_SCHED_H 1
| #define HAVE_STDINT_H 1
| #define HAVE_SYS_PARAM_H 1
| #define HAVE_SYS_TYPES_H 1
| #define HAVE_UNISTD_H 1
| #define HAVE_REGEX_H 1
| #define HAVE_SOCKLEN_T 1
| /* end confdefs.h. */
| #include <GL/gl.h>
| int
| main ()
| {
| glBegin(GL_POINTS)
| ;
| return 0;
| }
configure:25475: g++ -o conftest -g -O2 conftest.cc -framework OpenGL -lm >&5
configure:25481: $? = 0
configure:25485: test -z
|| test ! -s conftest.err
configure:25488: $? = 0
configure:25491: test -s conftest
configure:25494: $? = 0
configure:25522: g++ -o conftest -g -O2 conftest.cc -lglu32 -framework OpenGL -lm >&5
conftest.cc:63:20: error: GL/glu.h: No such file or directory
conftest.cc: In function 'int main()':
conftest.cc:67: error: 'GL_RED' was not declared in this scope
conftest.cc:67: error: 'GL_INT' was not declared in this scope
conftest.cc:67: error: 'gluScaleImage' was not declared in this scope
configure:25528: $? = 1
configure: failed program was:
| /* confdefs.h. */
|
| #define PACKAGE_NAME "BZFlag"
| #define PACKAGE_TARNAME "bzflag"
| #define PACKAGE_VERSION "2.1.14"
| #define PACKAGE_STRING "BZFlag 2.1.14"
| #define PACKAGE_BUGREPORT "http://BZFlag.org"
| #define PACKAGE "bzflag"
| #define VERSION "2.1.14"
| #define BZ_BUILD_OS "darwin8.11.1"
| #define BZ_BUILD_USER "delusional"
| #define HAVE_NCURSES_H
| #define BZ_PLUGINS 1
| #define ROBOT 1
| #ifdef __cplusplus
| extern "C" void std::exit (int); using std::exit;
| #endif
| #define STDC_HEADERS 1
| #define HAVE_SYS_TYPES_H 1
| #define HAVE_SYS_STAT_H 1
| #define HAVE_STDLIB_H 1
| #define HAVE_STRING_H 1
| #define HAVE_MEMORY_H 1
| #define HAVE_STRINGS_H 1
| #define HAVE_INTTYPES_H 1
| #define HAVE_STDINT_H 1
| #define HAVE_UNISTD_H 1
| #define HAVE_DLFCN_H 1
| #define HAVE_LIBM 1
| #define HAVE_ACOSF 1
| #define HAVE_ASINF 1
| #define HAVE_ATAN2F 1
| #define HAVE_ATANF 1
| #define HAVE_COSF 1
| #define HAVE_EXPF 1
| #define HAVE_FABSF 1
| #define HAVE_FLOORF 1
| #define HAVE_FMODF 1
| #define HAVE_HYPOTF 1
| #define HAVE_LOGF 1
| #define HAVE_LOG10F 1
| #define HAVE_POWF 1
| #define HAVE_SINF 1
| #define HAVE_SQRTF 1
| #define HAVE_TANF 1
| #define STDC_HEADERS 1
| #define HAVE_CMATH 1
| #define HAVE_CSTDLIB 1
| #define HAVE_CSTDIO 1
| #define HAVE_CSTRING 1
| #define HAVE_SDL_SDL_H 1
| #define HAVE_X11_XLIB_H 1
| #define HAVE_ARPA_NAMESER_COMPAT_H 1
| #define HAVE_INTTYPES_H 1
| #define HAVE_SCHED_H 1
| #define HAVE_STDINT_H 1
| #define HAVE_SYS_PARAM_H 1
| #define HAVE_SYS_TYPES_H 1
| #define HAVE_UNISTD_H 1
| #define HAVE_REGEX_H 1
| #define HAVE_SOCKLEN_T 1
| /* end confdefs.h. */
| #include <GL/glu.h>
| int
| main ()
| {
| gluScaleImage(GL_RED,0,0,GL_INT,0,0,0,GL_INT,0)
| ;
| return 0;
| }
configure:25522: g++ -o conftest -g -O2 conftest.cc -lGL -framework OpenGL -lm >&5
conftest.cc:63:20: error: GL/glu.h: No such file or directory
conftest.cc: In function 'int main()':
conftest.cc:67: error: 'GL_RED' was not declared in this scope
conftest.cc:67: error: 'GL_INT' was not declared in this scope
conftest.cc:67: error: 'gluScaleImage' was not declared in this scope
configure:25528: $? = 1
configure: failed program was:
| /* confdefs.h. */
|
| #define PACKAGE_NAME "BZFlag"
| #define PACKAGE_TARNAME "bzflag"
| #define PACKAGE_VERSION "2.1.14"
| #define PACKAGE_STRING "BZFlag 2.1.14"
| #define PACKAGE_BUGREPORT "http://BZFlag.org"
| #define PACKAGE "bzflag"
| #define VERSION "2.1.14"
| #define BZ_BUILD_OS "darwin8.11.1"
| #define BZ_BUILD_USER "delusional"
| #define HAVE_NCURSES_H
| #define BZ_PLUGINS 1
| #define ROBOT 1
| #ifdef __cplusplus
| extern "C" void std::exit (int); using std::exit;
| #endif
| #define STDC_HEADERS 1
| #define HAVE_SYS_TYPES_H 1
| #define HAVE_SYS_STAT_H 1
| #define HAVE_STDLIB_H 1
| #define HAVE_STRING_H 1
| #define HAVE_MEMORY_H 1
| #define HAVE_STRINGS_H 1
| #define HAVE_INTTYPES_H 1
| #define HAVE_STDINT_H 1
| #define HAVE_UNISTD_H 1
| #define HAVE_DLFCN_H 1
| #define HAVE_LIBM 1
| #define HAVE_ACOSF 1
| #define HAVE_ASINF 1
| #define HAVE_ATAN2F 1
| #define HAVE_ATANF 1
| #define HAVE_COSF 1
| #define HAVE_EXPF 1
| #define HAVE_FABSF 1
| #define HAVE_FLOORF 1
| #define HAVE_FMODF 1
| #define HAVE_HYPOTF 1
| #define HAVE_LOGF 1
| #define HAVE_LOG10F 1
| #define HAVE_POWF 1
| #define HAVE_SINF 1
| #define HAVE_SQRTF 1
| #define HAVE_TANF 1
| #define STDC_HEADERS 1
| #define HAVE_CMATH 1
| #define HAVE_CSTDLIB 1
| #define HAVE_CSTDIO 1
| #define HAVE_CSTRING 1
| #define HAVE_SDL_SDL_H 1
| #define HAVE_X11_XLIB_H 1
| #define HAVE_ARPA_NAMESER_COMPAT_H 1
| #define HAVE_INTTYPES_H 1
| #define HAVE_SCHED_H 1
| #define HAVE_STDINT_H 1
| #define HAVE_SYS_PARAM_H 1
| #define HAVE_SYS_TYPES_H 1
| #define HAVE_UNISTD_H 1
| #define HAVE_REGEX_H 1
| #define HAVE_SOCKLEN_T 1
| /* end confdefs.h. */
| #include <GL/glu.h>
| int
| main ()
| {
| gluScaleImage(GL_RED,0,0,GL_INT,0,0,0,GL_INT,0)
| ;
| return 0;
| }
configure:25522: g++ -o conftest -g -O2 conftest.cc -lGLU -framework OpenGL -lm >&5
conftest.cc:63:20: error: GL/glu.h: No such file or directory
conftest.cc: In function 'int main()':
conftest.cc:67: error: 'GL_RED' was not declared in this scope
conftest.cc:67: error: 'GL_INT' was not declared in this scope
conftest.cc:67: error: 'gluScaleImage' was not declared in this scope
configure:25528: $? = 1
configure: failed program was:
| /* confdefs.h. */
|
| #define PACKAGE_NAME "BZFlag"
| #define PACKAGE_TARNAME "bzflag"
| #define PACKAGE_VERSION "2.1.14"
| #define PACKAGE_STRING "BZFlag 2.1.14"
| #define PACKAGE_BUGREPORT "http://BZFlag.org"
| #define PACKAGE "bzflag"
| #define VERSION "2.1.14"
| #define BZ_BUILD_OS "darwin8.11.1"
| #define BZ_BUILD_USER "delusional"
| #define HAVE_NCURSES_H
| #define BZ_PLUGINS 1
| #define ROBOT 1
| #ifdef __cplusplus
| extern "C" void std::exit (int); using std::exit;
| #endif
| #define STDC_HEADERS 1
| #define HAVE_SYS_TYPES_H 1
| #define HAVE_SYS_STAT_H 1
| #define HAVE_STDLIB_H 1
| #define HAVE_STRING_H 1
| #define HAVE_MEMORY_H 1
| #define HAVE_STRINGS_H 1
| #define HAVE_INTTYPES_H 1
| #define HAVE_STDINT_H 1
| #define HAVE_UNISTD_H 1
| #define HAVE_DLFCN_H 1
| #define HAVE_LIBM 1
| #define HAVE_ACOSF 1
| #define HAVE_ASINF 1
| #define HAVE_ATAN2F 1
| #define HAVE_ATANF 1
| #define HAVE_COSF 1
| #define HAVE_EXPF 1
| #define HAVE_FABSF 1
| #define HAVE_FLOORF 1
| #define HAVE_FMODF 1
| #define HAVE_HYPOTF 1
| #define HAVE_LOGF 1
| #define HAVE_LOG10F 1
| #define HAVE_POWF 1
| #define HAVE_SINF 1
| #define HAVE_SQRTF 1
| #define HAVE_TANF 1
| #define STDC_HEADERS 1
| #define HAVE_CMATH 1
| #define HAVE_CSTDLIB 1
| #define HAVE_CSTDIO 1
| #define HAVE_CSTRING 1
| #define HAVE_SDL_SDL_H 1
| #define HAVE_X11_XLIB_H 1
| #define HAVE_ARPA_NAMESER_COMPAT_H 1
| #define HAVE_INTTYPES_H 1
| #define HAVE_SCHED_H 1
| #define HAVE_STDINT_H 1
| #define HAVE_SYS_PARAM_H 1
| #define HAVE_SYS_TYPES_H 1
| #define HAVE_UNISTD_H 1
| #define HAVE_REGEX_H 1
| #define HAVE_SOCKLEN_T 1
| /* end confdefs.h. */
| #include <GL/glu.h>
| int
| main ()
| {
| gluScaleImage(GL_RED,0,0,GL_INT,0,0,0,GL_INT,0)
| ;
| return 0;
| }
configure:25562: checking for GLEW library
configure:25583: g++ -o conftest -g -O2 conftest.cc -lGLEW >&5
conftest.cc:63:21: error: GL/glew.h: No such file or directory
conftest.cc: In function 'int main()':
conftest.cc:67: error: 'glewInit' was not declared in this scope
configure:25589: $? = 1
configure: failed program was:
| /* confdefs.h. */
|
| #define PACKAGE_NAME "BZFlag"
| #define PACKAGE_TARNAME "bzflag"
| #define PACKAGE_VERSION "2.1.14"
| #define PACKAGE_STRING "BZFlag 2.1.14"
| #define PACKAGE_BUGREPORT "http://BZFlag.org"
| #define PACKAGE "bzflag"
| #define VERSION "2.1.14"
| #define BZ_BUILD_OS "darwin8.11.1"
| #define BZ_BUILD_USER "delusional"
| #define HAVE_NCURSES_H
| #define BZ_PLUGINS 1
| #define ROBOT 1
| #ifdef __cplusplus
| extern "C" void std::exit (int); using std::exit;
| #endif
| #define STDC_HEADERS 1
| #define HAVE_SYS_TYPES_H 1
| #define HAVE_SYS_STAT_H 1
| #define HAVE_STDLIB_H 1
| #define HAVE_STRING_H 1
| #define HAVE_MEMORY_H 1
| #define HAVE_STRINGS_H 1
| #define HAVE_INTTYPES_H 1
| #define HAVE_STDINT_H 1
| #define HAVE_UNISTD_H 1
| #define HAVE_DLFCN_H 1
| #define HAVE_LIBM 1
| #define HAVE_ACOSF 1
| #define HAVE_ASINF 1
| #define HAVE_ATAN2F 1
| #define HAVE_ATANF 1
| #define HAVE_COSF 1
| #define HAVE_EXPF 1
| #define HAVE_FABSF 1
| #define HAVE_FLOORF 1
| #define HAVE_FMODF 1
| #define HAVE_HYPOTF 1
| #define HAVE_LOGF 1
| #define HAVE_LOG10F 1
| #define HAVE_POWF 1
| #define HAVE_SINF 1
| #define HAVE_SQRTF 1
| #define HAVE_TANF 1
| #define STDC_HEADERS 1
| #define HAVE_CMATH 1
| #define HAVE_CSTDLIB 1
| #define HAVE_CSTDIO 1
| #define HAVE_CSTRING 1
| #define HAVE_SDL_SDL_H 1
| #define HAVE_X11_XLIB_H 1
| #define HAVE_ARPA_NAMESER_COMPAT_H 1
| #define HAVE_INTTYPES_H 1
| #define HAVE_SCHED_H 1
| #define HAVE_STDINT_H 1
| #define HAVE_SYS_PARAM_H 1
| #define HAVE_SYS_TYPES_H 1
| #define HAVE_UNISTD_H 1
| #define HAVE_REGEX_H 1
| #define HAVE_SOCKLEN_T 1
| /* end confdefs.h. */
| #include <GL/glew.h>
| int
| main ()
| {
| glewInit()
| ;
| return 0;
| }
configure:25622: result: no
configure:25867: checking for SDL framework
configure:25888: gcc -o conftest -g -O2 -framework SDL conftest.c -framework OpenGL -framework OpenGL -lm >&5
/usr/bin/ld: can't locate framework for: -framework SDL
collect2: ld returned 1 exit status
configure:25894: $? = 1
configure: failed program was:
| /* confdefs.h. */
|
| #define PACKAGE_NAME "BZFlag"
| #define PACKAGE_TARNAME "bzflag"
| #define PACKAGE_VERSION "2.1.14"
| #define PACKAGE_STRING "BZFlag 2.1.14"
| #define PACKAGE_BUGREPORT "http://BZFlag.org"
| #define PACKAGE "bzflag"
| #define VERSION "2.1.14"
| #define BZ_BUILD_OS "darwin8.11.1"
| #define BZ_BUILD_USER "delusional"
| #define HAVE_NCURSES_H
| #define BZ_PLUGINS 1
| #define ROBOT 1
| #ifdef __cplusplus
| extern "C" void std::exit (int); using std::exit;
| #endif
| #define STDC_HEADERS 1
| #define HAVE_SYS_TYPES_H 1
| #define HAVE_SYS_STAT_H 1
| #define HAVE_STDLIB_H 1
| #define HAVE_STRING_H 1
| #define HAVE_MEMORY_H 1
| #define HAVE_STRINGS_H 1
| #define HAVE_INTTYPES_H 1
| #define HAVE_STDINT_H 1
| #define HAVE_UNISTD_H 1
| #define HAVE_DLFCN_H 1
| #define HAVE_LIBM 1
| #define HAVE_ACOSF 1
| #define HAVE_ASINF 1
| #define HAVE_ATAN2F 1
| #define HAVE_ATANF 1
| #define HAVE_COSF 1
| #define HAVE_EXPF 1
| #define HAVE_FABSF 1
| #define HAVE_FLOORF 1
| #define HAVE_FMODF 1
| #define HAVE_HYPOTF 1
| #define HAVE_LOGF 1
| #define HAVE_LOG10F 1
| #define HAVE_POWF 1
| #define HAVE_SINF 1
| #define HAVE_SQRTF 1
| #define HAVE_TANF 1
| #define STDC_HEADERS 1
| #define HAVE_CMATH 1
| #define HAVE_CSTDLIB 1
| #define HAVE_CSTDIO 1
| #define HAVE_CSTRING 1
| #define HAVE_SDL_SDL_H 1
| #define HAVE_X11_XLIB_H 1
| #define HAVE_ARPA_NAMESER_COMPAT_H 1
| #define HAVE_INTTYPES_H 1
| #define HAVE_SCHED_H 1
| #define HAVE_STDINT_H 1
| #define HAVE_SYS_PARAM_H 1
| #define HAVE_SYS_TYPES_H 1
| #define HAVE_UNISTD_H 1
| #define HAVE_REGEX_H 1
| #define HAVE_SOCKLEN_T 1
| #define BZFLAG_DATA "/usr/local/share/bzflag"
| /* end confdefs.h. */
| #include <SDL/SDL_version.h>
| int
| main ()
| {
|
| ;
| return 0;
| }
configure:25918: result: no
configure:25967: checking for sdl-config
configure:25985: found /usr/local/bin/sdl-config
configure:25998: result: /usr/local/bin/sdl-config
configure:26006: checking for SDL - version >= 1.2.5
configure:26098: gcc -o conftest -g -O2 -I/usr/local/include/SDL -D_GNU_SOURCE=1 -D_THREAD_SAFE conftest.c -framework OpenGL -framework OpenGL -lm -L/usr/local/lib -lSDLmain -lSDL -Wl,-framework,Cocoa >&5
configure:26101: $? = 0
configure:26103: ./conftest
configure:26106: $? = 0
configure:26125: result: yes
configure:26256: checking for SDL_image library
configure:26277: g++ -o conftest -g -O2 conftest.cc -lSDL_image >&5
conftest.cc:65:27: error: SDL/SDL_image.h: No such file or directory
conftest.cc: In function 'int main()':
conftest.cc:69: error: 'NULL' was not declared in this scope
conftest.cc:69: error: 'IMG_Load' was not declared in this scope
configure:26283: $? = 1
configure: failed program was:
| /* confdefs.h. */
|
| #define PACKAGE_NAME "BZFlag"
| #define PACKAGE_TARNAME "bzflag"
| #define PACKAGE_VERSION "2.1.14"
| #define PACKAGE_STRING "BZFlag 2.1.14"
| #define PACKAGE_BUGREPORT "http://BZFlag.org"
| #define PACKAGE "bzflag"
| #define VERSION "2.1.14"
| #define BZ_BUILD_OS "darwin8.11.1"
| #define BZ_BUILD_USER "delusional"
| #define HAVE_NCURSES_H
| #define BZ_PLUGINS 1
| #define ROBOT 1
| #ifdef __cplusplus
| extern "C" void std::exit (int); using std::exit;
| #endif
| #define STDC_HEADERS 1
| #define HAVE_SYS_TYPES_H 1
| #define HAVE_SYS_STAT_H 1
| #define HAVE_STDLIB_H 1
| #define HAVE_STRING_H 1
| #define HAVE_MEMORY_H 1
| #define HAVE_STRINGS_H 1
| #define HAVE_INTTYPES_H 1
| #define HAVE_STDINT_H 1
| #define HAVE_UNISTD_H 1
| #define HAVE_DLFCN_H 1
| #define HAVE_LIBM 1
| #define HAVE_ACOSF 1
| #define HAVE_ASINF 1
| #define HAVE_ATAN2F 1
| #define HAVE_ATANF 1
| #define HAVE_COSF 1
| #define HAVE_EXPF 1
| #define HAVE_FABSF 1
| #define HAVE_FLOORF 1
| #define HAVE_FMODF 1
| #define HAVE_HYPOTF 1
| #define HAVE_LOGF 1
| #define HAVE_LOG10F 1
| #define HAVE_POWF 1
| #define HAVE_SINF 1
| #define HAVE_SQRTF 1
| #define HAVE_TANF 1
| #define STDC_HEADERS 1
| #define HAVE_CMATH 1
| #define HAVE_CSTDLIB 1
| #define HAVE_CSTDIO 1
| #define HAVE_CSTRING 1
| #define HAVE_SDL_SDL_H 1
| #define HAVE_X11_XLIB_H 1
| #define HAVE_ARPA_NAMESER_COMPAT_H 1
| #define HAVE_INTTYPES_H 1
| #define HAVE_SCHED_H 1
| #define HAVE_STDINT_H 1
| #define HAVE_SYS_PARAM_H 1
| #define HAVE_SYS_TYPES_H 1
| #define HAVE_UNISTD_H 1
| #define HAVE_REGEX_H 1
| #define HAVE_SOCKLEN_T 1
| #define BZFLAG_DATA "/usr/local/share/bzflag"
| #define HAVE_SDL 1
| /* end confdefs.h. */
| #include <SDL/SDL_image.h>
| int
| main ()
| {
| IMG_Load(NULL)
| ;
| return 0;
| }
configure:26316: result: no
configure:26357: checking ... c o m p i l e r
configure:26359: result: (6 of 9)
configure:26618: checking if the compiler understands -Wl,-search_paths_first -mdynamic-no-pic
configure:26639: g++ -o conftest -g -O2 -Wl,-search_paths_first -mdynamic-no-pic conftest.cc -lm -framework Carbon -framework Cocoa -framework OpenGL >&5
configure:26645: $? = 0
configure:26649: test -z
|| test ! -s conftest.err
configure:26652: $? = 0
configure:26655: test -s conftest
configure:26658: $? = 0
configure:26669: result: yes
configure:26692: checking ... f u n c t i o n s
configure:26694: result: (7 of 9)
configure:26742: checking for CGLGetCurrentContext
configure:26799: g++ -o conftest -g -O2 -Wl,-search_paths_first -mdynamic-no-pic conftest.cc -lm -framework Carbon -framework Cocoa -framework OpenGL >&5
configure:26805: $? = 0
configure:26809: test -z
|| test ! -s conftest.err
configure:26812: $? = 0
configure:26815: test -s conftest
configure:26818: $? = 0
configure:26830: result: yes
configure:26742: checking for Sleep
configure:26799: g++ -o conftest -g -O2 -Wl,-search_paths_first -mdynamic-no-pic conftest.cc -lm -framework Carbon -framework Cocoa -framework OpenGL >&5
configure:26805: $? = 0
configure:26809: test -z
|| test ! -s conftest.err
configure:26812: $? = 0
configure:26815: test -s conftest
configure:26818: $? = 0
configure:26830: result: yes
configure:26742: checking for WaitForSingleObject
configure:26799: g++ -o conftest -g -O2 -Wl,-search_paths_first -mdynamic-no-pic conftest.cc -lm -framework Carbon -framework Cocoa -framework OpenGL >&5
/usr/bin/ld: Undefined symbols:
_WaitForSingleObject
collect2: ld returned 1 exit status
configure:26805: $? = 1
configure: failed program was:
| /* confdefs.h. */
|
| #define PACKAGE_NAME "BZFlag"
| #define PACKAGE_TARNAME "bzflag"
| #define PACKAGE_VERSION "2.1.14"
| #define PACKAGE_STRING "BZFlag 2.1.14"
| #define PACKAGE_BUGREPORT "http://BZFlag.org"
| #define PACKAGE "bzflag"
| #define VERSION "2.1.14"
| #define BZ_BUILD_OS "darwin8.11.1"
| #define BZ_BUILD_USER "delusional"
| #define HAVE_NCURSES_H
| #define BZ_PLUGINS 1
| #define ROBOT 1
| #ifdef __cplusplus
| extern "C" void std::exit (int); using std::exit;
| #endif
| #define STDC_HEADERS 1
| #define HAVE_SYS_TYPES_H 1
| #define HAVE_SYS_STAT_H 1
| #define HAVE_STDLIB_H 1
| #define HAVE_STRING_H 1
| #define HAVE_MEMORY_H 1
| #define HAVE_STRINGS_H 1
| #define HAVE_INTTYPES_H 1
| #define HAVE_STDINT_H 1
| #define HAVE_UNISTD_H 1
| #define HAVE_DLFCN_H 1
| #define HAVE_LIBM 1
| #define HAVE_ACOSF 1
| #define HAVE_ASINF 1
| #define HAVE_ATAN2F 1
| #define HAVE_ATANF 1
| #define HAVE_COSF 1
| #define HAVE_EXPF 1
| #define HAVE_FABSF 1
| #define HAVE_FLOORF 1
| #define HAVE_FMODF 1
| #define HAVE_HYPOTF 1
| #define HAVE_LOGF 1
| #define HAVE_LOG10F 1
| #define HAVE_POWF 1
| #define HAVE_SINF 1
| #define HAVE_SQRTF 1
| #define HAVE_TANF 1
| #define STDC_HEADERS 1
| #define HAVE_CMATH 1
| #define HAVE_CSTDLIB 1
| #define HAVE_CSTDIO 1
| #define HAVE_CSTRING 1
| #define HAVE_SDL_SDL_H 1
| #define HAVE_X11_XLIB_H 1
| #define HAVE_ARPA_NAMESER_COMPAT_H 1
| #define HAVE_INTTYPES_H 1
| #define HAVE_SCHED_H 1
| #define HAVE_STDINT_H 1
| #define HAVE_SYS_PARAM_H 1
| #define HAVE_SYS_TYPES_H 1
| #define HAVE_UNISTD_H 1
| #define HAVE_REGEX_H 1
| #define HAVE_SOCKLEN_T 1
| #define BZFLAG_DATA "/usr/local/share/bzflag"
| #define HAVE_SDL 1
| #define NDEBUG 1
| #define HAVE_CGLGETCURRENTCONTEXT 1
| #define HAVE_SLEEP 1
| /* end confdefs.h. */
| /* Define WaitForSingleObject to an innocuous variant, in case <limits.h> declares WaitForSingleObject.
| For example, HP-UX 11i <limits.h> declares gettimeofday. */
| #define WaitForSingleObject innocuous_WaitForSingleObject
|
| /* System header to define __stub macros and hopefully few prototypes,
| which can conflict with char WaitForSingleObject (); below.
| Prefer <limits.h> to <assert.h> if __STDC__ is defined, since
| <limits.h> exists even on freestanding compilers. */
|
| #ifdef __STDC__
| # include <limits.h>
| #else
| # include <assert.h>
| #endif
|
| #undef WaitForSingleObject
|
| /* Override any gcc2 internal prototype to avoid an error. */
| #ifdef __cplusplus
| extern "C"
| {
| #endif
| /* We use char because int might match the return type of a gcc2
| builtin and then its argument prototype would still apply. */
| char WaitForSingleObject ();
| /* The GNU C library defines this for functions which it implements
| to always fail with ENOSYS. Some functions are actually named
| something starting with __ and the normal name is an alias. */
| #if defined (__stub_WaitForSingleObject) || defined (__stub___WaitForSingleObject)
| choke me
| #else
| char (*f) () = WaitForSingleObject;
| #endif
| #ifdef __cplusplus
| }
| #endif
|
| int
| main ()
| {
| return f != WaitForSingleObject;
| ;
| return 0;
| }
configure:26830: result: no
configure:26742: checking for _stricmp
configure:26799: g++ -o conftest -g -O2 -Wl,-search_paths_first -mdynamic-no-pic conftest.cc -lm -framework Carbon -framework Cocoa -framework OpenGL >&5
/usr/bin/ld: Undefined symbols:
__stricmp
collect2: ld returned 1 exit status
configure:26805: $? = 1
configure: failed program was:
| /* confdefs.h. */
|
| #define PACKAGE_NAME "BZFlag"
| #define PACKAGE_TARNAME "bzflag"
| #define PACKAGE_VERSION "2.1.14"
| #define PACKAGE_STRING "BZFlag 2.1.14"
| #define PACKAGE_BUGREPORT "http://BZFlag.org"
| #define PACKAGE "bzflag"
| #define VERSION "2.1.14"
| #define BZ_BUILD_OS "darwin8.11.1"
| #define BZ_BUILD_USER "delusional"
| #define HAVE_NCURSES_H
| #define BZ_PLUGINS 1
| #define ROBOT 1
| #ifdef __cplusplus
| extern "C" void std::exit (int); using std::exit;
| #endif
| #define STDC_HEADERS 1
| #define HAVE_SYS_TYPES_H 1
| #define HAVE_SYS_STAT_H 1
| #define HAVE_STDLIB_H 1
| #define HAVE_STRING_H 1
| #define HAVE_MEMORY_H 1
| #define HAVE_STRINGS_H 1
| #define HAVE_INTTYPES_H 1
| #define HAVE_STDINT_H 1
| #define HAVE_UNISTD_H 1
| #define HAVE_DLFCN_H 1
| #define HAVE_LIBM 1
| #define HAVE_ACOSF 1
| #define HAVE_ASINF 1
| #define HAVE_ATAN2F 1
| #define HAVE_ATANF 1
| #define HAVE_COSF 1
| #define HAVE_EXPF 1
| #define HAVE_FABSF 1
| #define HAVE_FLOORF 1
| #define HAVE_FMODF 1
| #define HAVE_HYPOTF 1
| #define HAVE_LOGF 1
| #define HAVE_LOG10F 1
| #define HAVE_POWF 1
| #define HAVE_SINF 1
| #define HAVE_SQRTF 1
| #define HAVE_TANF 1
| #define STDC_HEADERS 1
| #define HAVE_CMATH 1
| #define HAVE_CSTDLIB 1
| #define HAVE_CSTDIO 1
| #define HAVE_CSTRING 1
| #define HAVE_SDL_SDL_H 1
| #define HAVE_X11_XLIB_H 1
| #define HAVE_ARPA_NAMESER_COMPAT_H 1
| #define HAVE_INTTYPES_H 1
| #define HAVE_SCHED_H 1
| #define HAVE_STDINT_H 1
| #define HAVE_SYS_PARAM_H 1
| #define HAVE_SYS_TYPES_H 1
| #define HAVE_UNISTD_H 1
| #define HAVE_REGEX_H 1
| #define HAVE_SOCKLEN_T 1
| #define BZFLAG_DATA "/usr/local/share/bzflag"
| #define HAVE_SDL 1
| #define NDEBUG 1
| #define HAVE_CGLGETCURRENTCONTEXT 1
| #define HAVE_SLEEP 1
| /* end confdefs.h. */
| /* Define _stricmp to an innocuous variant, in case <limits.h> declares _stricmp.
| For example, HP-UX 11i <limits.h> declares gettimeofday. */
| #define _stricmp innocuous__stricmp
|
| /* System header to define __stub macros and hopefully few prototypes,
| which can conflict with char _stricmp (); below.
| Prefer <limits.h> to <assert.h> if __STDC__ is defined, since
| <limits.h> exists even on freestanding compilers. */
|
| #ifdef __STDC__
| # include <limits.h>
| #else
| # include <assert.h>
| #endif
|
| #undef _stricmp
|
| /* Override any gcc2 internal prototype to avoid an error. */
| #ifdef __cplusplus
| extern "C"
| {
| #endif
| /* We use char because int might match the return type of a gcc2
| builtin and then its argument prototype would still apply. */
| char _stricmp ();
| /* The GNU C library defines this for functions which it implements
| to always fail with ENOSYS. Some functions are actually named
| something starting with __ and the normal name is an alias. */
| #if defined (__stub__stricmp) || defined (__stub____stricmp)
| choke me
| #else
| char (*f) () = _stricmp;
| #endif
| #ifdef __cplusplus
| }
| #endif
|
| int
| main ()
| {
| return f != _stricmp;
| ;
| return 0;
| }
configure:26830: result: no
configure:26742: checking for _strnicmp
configure:26799: g++ -o conftest -g -O2 -Wl,-search_paths_first -mdynamic-no-pic conftest.cc -lm -framework Carbon -framework Cocoa -framework OpenGL >&5
/usr/bin/ld: Undefined symbols:
__strnicmp
collect2: ld returned 1 exit status
configure:26805: $? = 1
configure: failed program was:
| /* confdefs.h. */
|
| #define PACKAGE_NAME "BZFlag"
| #define PACKAGE_TARNAME "bzflag"
| #define PACKAGE_VERSION "2.1.14"
| #define PACKAGE_STRING "BZFlag 2.1.14"
| #define PACKAGE_BUGREPORT "http://BZFlag.org"
| #define PACKAGE "bzflag"
| #define VERSION "2.1.14"
| #define BZ_BUILD_OS "darwin8.11.1"
| #define BZ_BUILD_USER "delusional"
| #define HAVE_NCURSES_H
| #define BZ_PLUGINS 1
| #define ROBOT 1
| #ifdef __cplusplus
| extern "C" void std::exit (int); using std::exit;
| #endif
| #define STDC_HEADERS 1
| #define HAVE_SYS_TYPES_H 1
| #define HAVE_SYS_STAT_H 1
| #define HAVE_STDLIB_H 1
| #define HAVE_STRING_H 1
| #define HAVE_MEMORY_H 1
| #define HAVE_STRINGS_H 1
| #define HAVE_INTTYPES_H 1
| #define HAVE_STDINT_H 1
| #define HAVE_UNISTD_H 1
| #define HAVE_DLFCN_H 1
| #define HAVE_LIBM 1
| #define HAVE_ACOSF 1
| #define HAVE_ASINF 1
| #define HAVE_ATAN2F 1
| #define HAVE_ATANF 1
| #define HAVE_COSF 1
| #define HAVE_EXPF 1
| #define HAVE_FABSF 1
| #define HAVE_FLOORF 1
| #define HAVE_FMODF 1
| #define HAVE_HYPOTF 1
| #define HAVE_LOGF 1
| #define HAVE_LOG10F 1
| #define HAVE_POWF 1
| #define HAVE_SINF 1
| #define HAVE_SQRTF 1
| #define HAVE_TANF 1
| #define STDC_HEADERS 1
| #define HAVE_CMATH 1
| #define HAVE_CSTDLIB 1
| #define HAVE_CSTDIO 1
| #define HAVE_CSTRING 1
| #define HAVE_SDL_SDL_H 1
| #define HAVE_X11_XLIB_H 1
| #define HAVE_ARPA_NAMESER_COMPAT_H 1
| #define HAVE_INTTYPES_H 1
| #define HAVE_SCHED_H 1
| #define HAVE_STDINT_H 1
| #define HAVE_SYS_PARAM_H 1
| #define HAVE_SYS_TYPES_H 1
| #define HAVE_UNISTD_H 1
| #define HAVE_REGEX_H 1
| #define HAVE_SOCKLEN_T 1
| #define BZFLAG_DATA "/usr/local/share/bzflag"
| #define HAVE_SDL 1
| #define NDEBUG 1
| #define HAVE_CGLGETCURRENTCONTEXT 1
| #define HAVE_SLEEP 1
| /* end confdefs.h. */
| /* Define _strnicmp to an innocuous variant, in case <limits.h> declares _strnicmp.
| For example, HP-UX 11i <limits.h> declares gettimeofday. */
| #define _strnicmp innocuous__strnicmp
|
| /* System header to define __stub macros and hopefully few prototypes,
| which can conflict with char _strnicmp (); below.
| Prefer <limits.h> to <assert.h> if __STDC__ is defined, since
| <limits.h> exists even on freestanding compilers. */
|
| #ifdef __STDC__
| # include <limits.h>
| #else
| # include <assert.h>
| #endif
|
| #undef _strnicmp
|
| /* Override any gcc2 internal prototype to avoid an error. */
| #ifdef __cplusplus
| extern "C"
| {
| #endif
| /* We use char because int might match the return type of a gcc2
| builtin and then its argument prototype would still apply. */
| char _strnicmp ();
| /* The GNU C library defines this for functions which it implements
| to always fail with ENOSYS. Some functions are actually named
| something starting with __ and the normal name is an alias. */
| #if defined (__stub__strnicmp) || defined (__stub____strnicmp)
| choke me
| #else
| char (*f) () = _strnicmp;
| #endif
| #ifdef __cplusplus
| }
| #endif
|
| int
| main ()
| {
| return f != _strnicmp;
| ;
| return 0;
| }
configure:26830: result: no
configure:26742: checking for _vsnprintf
configure:26799: g++ -o conftest -g -O2 -Wl,-search_paths_first -mdynamic-no-pic conftest.cc -lm -framework Carbon -framework Cocoa -framework OpenGL >&5
/usr/bin/ld: Undefined symbols:
__vsnprintf
collect2: ld returned 1 exit status
configure:26805: $? = 1
configure: failed program was:
| /* confdefs.h. */
|
| #define PACKAGE_NAME "BZFlag"
| #define PACKAGE_TARNAME "bzflag"
| #define PACKAGE_VERSION "2.1.14"
| #define PACKAGE_STRING "BZFlag 2.1.14"
| #define PACKAGE_BUGREPORT "http://BZFlag.org"
| #define PACKAGE "bzflag"
| #define VERSION "2.1.14"
| #define BZ_BUILD_OS "darwin8.11.1"
| #define BZ_BUILD_USER "delusional"
| #define HAVE_NCURSES_H
| #define BZ_PLUGINS 1
| #define ROBOT 1
| #ifdef __cplusplus
| extern "C" void std::exit (int); using std::exit;
| #endif
| #define STDC_HEADERS 1
| #define HAVE_SYS_TYPES_H 1
| #define HAVE_SYS_STAT_H 1
| #define HAVE_STDLIB_H 1
| #define HAVE_STRING_H 1
| #define HAVE_MEMORY_H 1
| #define HAVE_STRINGS_H 1
| #define HAVE_INTTYPES_H 1
| #define HAVE_STDINT_H 1
| #define HAVE_UNISTD_H 1
| #define HAVE_DLFCN_H 1
| #define HAVE_LIBM 1
| #define HAVE_ACOSF 1
| #define HAVE_ASINF 1
| #define HAVE_ATAN2F 1
| #define HAVE_ATANF 1
| #define HAVE_COSF 1
| #define HAVE_EXPF 1
| #define HAVE_FABSF 1
| #define HAVE_FLOORF 1
| #define HAVE_FMODF 1
| #define HAVE_HYPOTF 1
| #define HAVE_LOGF 1
| #define HAVE_LOG10F 1
| #define HAVE_POWF 1
| #define HAVE_SINF 1
| #define HAVE_SQRTF 1
| #define HAVE_TANF 1
| #define STDC_HEADERS 1
| #define HAVE_CMATH 1
| #define HAVE_CSTDLIB 1
| #define HAVE_CSTDIO 1
| #define HAVE_CSTRING 1
| #define HAVE_SDL_SDL_H 1
| #define HAVE_X11_XLIB_H 1
| #define HAVE_ARPA_NAMESER_COMPAT_H 1
| #define HAVE_INTTYPES_H 1
| #define HAVE_SCHED_H 1
| #define HAVE_STDINT_H 1
| #define HAVE_SYS_PARAM_H 1
| #define HAVE_SYS_TYPES_H 1
| #define HAVE_UNISTD_H 1
| #define HAVE_REGEX_H 1
| #define HAVE_SOCKLEN_T 1
| #define BZFLAG_DATA "/usr/local/share/bzflag"
| #define HAVE_SDL 1
| #define NDEBUG 1
| #define HAVE_CGLGETCURRENTCONTEXT 1
| #define HAVE_SLEEP 1
| /* end confdefs.h. */
| /* Define _vsnprintf to an innocuous variant, in case <limits.h> declares _vsnprintf.
| For example, HP-UX 11i <limits.h> declares gettimeofday. */
| #define _vsnprintf innocuous__vsnprintf
|
| /* System header to define __stub macros and hopefully few prototypes,
| which can conflict with char _vsnprintf (); below.
| Prefer <limits.h> to <assert.h> if __STDC__ is defined, since
| <limits.h> exists even on freestanding compilers. */
|
| #ifdef __STDC__
| # include <limits.h>
| #else
| # include <assert.h>
| #endif
|
| #undef _vsnprintf
|
| /* Override any gcc2 internal prototype to avoid an error. */
| #ifdef __cplusplus
| extern "C"
| {
| #endif
| /* We use char because int might match the return type of a gcc2
| builtin and then its argument prototype would still apply. */
| char _vsnprintf ();
| /* The GNU C library defines this for functions which it implements
| to always fail with ENOSYS. Some functions are actually named
| something starting with __ and the normal name is an alias. */
| #if defined (__stub__vsnprintf) || defined (__stub____vsnprintf)
| choke me
| #else
| char (*f) () = _vsnprintf;
| #endif
| #ifdef __cplusplus
| }
| #endif
|
| int
| main ()
| {
| return f != _vsnprintf;
| ;
| return 0;
| }
configure:26830: result: no
configure:26742: checking for atexit
configure:26799: g++ -o conftest -g -O2 -Wl,-search_paths_first -mdynamic-no-pic conftest.cc -lm -framework Carbon -framework Cocoa -framework OpenGL >&5
configure:26805: $? = 0
configure:26809: test -z
|| test ! -s conftest.err
configure:26812: $? = 0
configure:26815: test -s conftest
configure:26818: $? = 0
configure:26830: result: yes
configure:26742: checking for getrlimit
configure:26799: g++ -o conftest -g -O2 -Wl,-search_paths_first -mdynamic-no-pic conftest.cc -lm -framework Carbon -framework Cocoa -framework OpenGL >&5
configure:26805: $? = 0
configure:26809: test -z
|| test ! -s conftest.err
configure:26812: $? = 0
configure:26815: test -s conftest
configure:26818: $? = 0
configure:26830: result: yes
configure:26742: checking for glXGetCurrentContext
configure:26799: g++ -o conftest -g -O2 -Wl,-search_paths_first -mdynamic-no-pic conftest.cc -lm -framework Carbon -framework Cocoa -framework OpenGL >&5
/usr/bin/ld: Undefined symbols:
_glXGetCurrentContext
collect2: ld returned 1 exit status
configure:26805: $? = 1
configure: failed program was:
| /* confdefs.h. */
|
| #define PACKAGE_NAME "BZFlag"
| #define PACKAGE_TARNAME "bzflag"
| #define PACKAGE_VERSION "2.1.14"
| #define PACKAGE_STRING "BZFlag 2.1.14"
| #define PACKAGE_BUGREPORT "http://BZFlag.org"
| #define PACKAGE "bzflag"
| #define VERSION "2.1.14"
| #define BZ_BUILD_OS "darwin8.11.1"
| #define BZ_BUILD_USER "delusional"
| #define HAVE_NCURSES_H
| #define BZ_PLUGINS 1
| #define ROBOT 1
| #ifdef __cplusplus
| extern "C" void std::exit (int); using std::exit;
| #endif
| #define STDC_HEADERS 1
| #define HAVE_SYS_TYPES_H 1
| #define HAVE_SYS_STAT_H 1
| #define HAVE_STDLIB_H 1
| #define HAVE_STRING_H 1
| #define HAVE_MEMORY_H 1
| #define HAVE_STRINGS_H 1
| #define HAVE_INTTYPES_H 1
| #define HAVE_STDINT_H 1
| #define HAVE_UNISTD_H 1
| #define HAVE_DLFCN_H 1
| #define HAVE_LIBM 1
| #define HAVE_ACOSF 1
| #define HAVE_ASINF 1
| #define HAVE_ATAN2F 1
| #define HAVE_ATANF 1
| #define HAVE_COSF 1
| #define HAVE_EXPF 1
| #define HAVE_FABSF 1
| #define HAVE_FLOORF 1
| #define HAVE_FMODF 1
| #define HAVE_HYPOTF 1
| #define HAVE_LOGF 1
| #define HAVE_LOG10F 1
| #define HAVE_POWF 1
| #define HAVE_SINF 1
| #define HAVE_SQRTF 1
| #define HAVE_TANF 1
| #define STDC_HEADERS 1
| #define HAVE_CMATH 1
| #define HAVE_CSTDLIB 1
| #define HAVE_CSTDIO 1
| #define HAVE_CSTRING 1
| #define HAVE_SDL_SDL_H 1
| #define HAVE_X11_XLIB_H 1
| #define HAVE_ARPA_NAMESER_COMPAT_H 1
| #define HAVE_INTTYPES_H 1
| #define HAVE_SCHED_H 1
| #define HAVE_STDINT_H 1
| #define HAVE_SYS_PARAM_H 1
| #define HAVE_SYS_TYPES_H 1
| #define HAVE_UNISTD_H 1
| #define HAVE_REGEX_H 1
| #define HAVE_SOCKLEN_T 1
| #define BZFLAG_DATA "/usr/local/share/bzflag"
| #define HAVE_SDL 1
| #define NDEBUG 1
| #define HAVE_CGLGETCURRENTCONTEXT 1
| #define HAVE_SLEEP 1
| #define HAVE_ATEXIT 1
| #define HAVE_GETRLIMIT 1
| /* end confdefs.h. */
| /* Define glXGetCurrentContext to an innocuous variant, in case <limits.h> declares glXGetCurrentContext.
| For example, HP-UX 11i <limits.h> declares gettimeofday. */
| #define glXGetCurrentContext innocuous_glXGetCurrentContext
|
| /* System header to define __stub macros and hopefully few prototypes,
| which can conflict with char glXGetCurrentContext (); below.
| Prefer <limits.h> to <assert.h> if __STDC__ is defined, since
| <limits.h> exists even on freestanding compilers. */
|
| #ifdef __STDC__
| # include <limits.h>
| #else
| # include <assert.h>
| #endif
|
| #undef glXGetCurrentContext
|
| /* Override any gcc2 internal prototype to avoid an error. */
| #ifdef __cplusplus
| extern "C"
| {
| #endif
| /* We use char because int might match the return type of a gcc2
| builtin and then its argument prototype would still apply. */
| char glXGetCurrentContext ();
| /* The GNU C library defines this for functions which it implements
| to always fail with ENOSYS. Some functions are actually named
| something starting with __ and the normal name is an alias. */
| #if defined (__stub_glXGetCurrentContext) || defined (__stub___glXGetCurrentContext)
| choke me
| #else
| char (*f) () = glXGetCurrentContext;
| #endif
| #ifdef __cplusplus
| }
| #endif
|
| int
| main ()
| {
| return f != glXGetCurrentContext;
| ;
| return 0;
| }
configure:26830: result: no
configure:26742: checking for sched_setaffinity
configure:26799: g++ -o conftest -g -O2 -Wl,-search_paths_first -mdynamic-no-pic conftest.cc -lm -framework Carbon -framework Cocoa -framework OpenGL >&5
/usr/bin/ld: Undefined symbols:
_sched_setaffinity
collect2: ld returned 1 exit status
configure:26805: $? = 1
configure: failed program was:
| /* confdefs.h. */
|
| #define PACKAGE_NAME "BZFlag"
| #define PACKAGE_TARNAME "bzflag"
| #define PACKAGE_VERSION "2.1.14"
| #define PACKAGE_STRING "BZFlag 2.1.14"
| #define PACKAGE_BUGREPORT "http://BZFlag.org"
| #define PACKAGE "bzflag"
| #define VERSION "2.1.14"
| #define BZ_BUILD_OS "darwin8.11.1"
| #define BZ_BUILD_USER "delusional"
| #define HAVE_NCURSES_H
| #define BZ_PLUGINS 1
| #define ROBOT 1
| #ifdef __cplusplus
| extern "C" void std::exit (int); using std::exit;
| #endif
| #define STDC_HEADERS 1
| #define HAVE_SYS_TYPES_H 1
| #define HAVE_SYS_STAT_H 1
| #define HAVE_STDLIB_H 1
| #define HAVE_STRING_H 1
| #define HAVE_MEMORY_H 1
| #define HAVE_STRINGS_H 1
| #define HAVE_INTTYPES_H 1
| #define HAVE_STDINT_H 1
| #define HAVE_UNISTD_H 1
| #define HAVE_DLFCN_H 1
| #define HAVE_LIBM 1
| #define HAVE_ACOSF 1
| #define HAVE_ASINF 1
| #define HAVE_ATAN2F 1
| #define HAVE_ATANF 1
| #define HAVE_COSF 1
| #define HAVE_EXPF 1
| #define HAVE_FABSF 1
| #define HAVE_FLOORF 1
| #define HAVE_FMODF 1
| #define HAVE_HYPOTF 1
| #define HAVE_LOGF 1
| #define HAVE_LOG10F 1
| #define HAVE_POWF 1
| #define HAVE_SINF 1
| #define HAVE_SQRTF 1
| #define HAVE_TANF 1
| #define STDC_HEADERS 1
| #define HAVE_CMATH 1
| #define HAVE_CSTDLIB 1
| #define HAVE_CSTDIO 1
| #define HAVE_CSTRING 1
| #define HAVE_SDL_SDL_H 1
| #define HAVE_X11_XLIB_H 1
| #define HAVE_ARPA_NAMESER_COMPAT_H 1
| #define HAVE_INTTYPES_H 1
| #define HAVE_SCHED_H 1
| #define HAVE_STDINT_H 1
| #define HAVE_SYS_PARAM_H 1
| #define HAVE_SYS_TYPES_H 1
| #define HAVE_UNISTD_H 1
| #define HAVE_REGEX_H 1
| #define HAVE_SOCKLEN_T 1
| #define BZFLAG_DATA "/usr/local/share/bzflag"
| #define HAVE_SDL 1
| #define NDEBUG 1
| #define HAVE_CGLGETCURRENTCONTEXT 1
| #define HAVE_SLEEP 1
| #define HAVE_ATEXIT 1
| #define HAVE_GETRLIMIT 1
| /* end confdefs.h. */
| /* Define sched_setaffinity to an innocuous variant, in case <limits.h> declares sched_setaffinity.
| For example, HP-UX 11i <limits.h> declares gettimeofday. */
| #define sched_setaffinity innocuous_sched_setaffinity
|
| /* System header to define __stub macros and hopefully few prototypes,
| which can conflict with char sched_setaffinity (); below.
| Prefer <limits.h> to <assert.h> if __STDC__ is defined, since
| <limits.h> exists even on freestanding compilers. */
|
| #ifdef __STDC__
| # include <limits.h>
| #else
| # include <assert.h>
| #endif
|
| #undef sched_setaffinity
|
| /* Override any gcc2 internal prototype to avoid an error. */
| #ifdef __cplusplus
| extern "C"
| {
| #endif
| /* We use char because int might match the return type of a gcc2
| builtin and then its argument prototype would still apply. */
| char sched_setaffinity ();
| /* The GNU C library defines this for functions which it implements
| to always fail with ENOSYS. Some functions are actually named
| something starting with __ and the normal name is an alias. */
| #if defined (__stub_sched_setaffinity) || defined (__stub___sched_setaffinity)
| choke me
| #else
| char (*f) () = sched_setaffinity;
| #endif
| #ifdef __cplusplus
| }
| #endif
|
| int
| main ()
| {
| return f != sched_setaffinity;
| ;
| return 0;
| }
configure:26830: result: no
configure:26742: checking for select
configure:26799: g++ -o conftest -g -O2 -Wl,-search_paths_first -mdynamic-no-pic conftest.cc -lm -framework Carbon -framework Cocoa -framework OpenGL >&5
configure:26805: $? = 0
configure:26809: test -z
|| test ! -s conftest.err
configure:26812: $? = 0
configure:26815: test -s conftest
configure:26818: $? = 0
configure:26830: result: yes
configure:26742: checking for snooze
configure:26799: g++ -o conftest -g -O2 -Wl,-search_paths_first -mdynamic-no-pic conftest.cc -lm -framework Carbon -framework Cocoa -framework OpenGL >&5
/usr/bin/ld: Undefined symbols:
_snooze
collect2: ld returned 1 exit status
configure:26805: $? = 1
configure: failed program was:
| /* confdefs.h. */
|
| #define PACKAGE_NAME "BZFlag"
| #define PACKAGE_TARNAME "bzflag"
| #define PACKAGE_VERSION "2.1.14"
| #define PACKAGE_STRING "BZFlag 2.1.14"
| #define PACKAGE_BUGREPORT "http://BZFlag.org"
| #define PACKAGE "bzflag"
| #define VERSION "2.1.14"
| #define BZ_BUILD_OS "darwin8.11.1"
| #define BZ_BUILD_USER "delusional"
| #define HAVE_NCURSES_H
| #define BZ_PLUGINS 1
| #define ROBOT 1
| #ifdef __cplusplus
| extern "C" void std::exit (int); using std::exit;
| #endif
| #define STDC_HEADERS 1
| #define HAVE_SYS_TYPES_H 1
| #define HAVE_SYS_STAT_H 1
| #define HAVE_STDLIB_H 1
| #define HAVE_STRING_H 1
| #define HAVE_MEMORY_H 1
| #define HAVE_STRINGS_H 1
| #define HAVE_INTTYPES_H 1
| #define HAVE_STDINT_H 1
| #define HAVE_UNISTD_H 1
| #define HAVE_DLFCN_H 1
| #define HAVE_LIBM 1
| #define HAVE_ACOSF 1
| #define HAVE_ASINF 1
| #define HAVE_ATAN2F 1
| #define HAVE_ATANF 1
| #define HAVE_COSF 1
| #define HAVE_EXPF 1
| #define HAVE_FABSF 1
| #define HAVE_FLOORF 1
| #define HAVE_FMODF 1
| #define HAVE_HYPOTF 1
| #define HAVE_LOGF 1
| #define HAVE_LOG10F 1
| #define HAVE_POWF 1
| #define HAVE_SINF 1
| #define HAVE_SQRTF 1
| #define HAVE_TANF 1
| #define STDC_HEADERS 1
| #define HAVE_CMATH 1
| #define HAVE_CSTDLIB 1
| #define HAVE_CSTDIO 1
| #define HAVE_CSTRING 1
| #define HAVE_SDL_SDL_H 1
| #define HAVE_X11_XLIB_H 1
| #define HAVE_ARPA_NAMESER_COMPAT_H 1
| #define HAVE_INTTYPES_H 1
| #define HAVE_SCHED_H 1
| #define HAVE_STDINT_H 1
| #define HAVE_SYS_PARAM_H 1
| #define HAVE_SYS_TYPES_H 1
| #define HAVE_UNISTD_H 1
| #define HAVE_REGEX_H 1
| #define HAVE_SOCKLEN_T 1
| #define BZFLAG_DATA "/usr/local/share/bzflag"
| #define HAVE_SDL 1
| #define NDEBUG 1
| #define HAVE_CGLGETCURRENTCONTEXT 1
| #define HAVE_SLEEP 1
| #define HAVE_ATEXIT 1
| #define HAVE_GETRLIMIT 1
| #define HAVE_SELECT 1
| /* end confdefs.h. */
| /* Define snooze to an innocuous variant, in case <limits.h> declares snooze.
| For example, HP-UX 11i <limits.h> declares gettimeofday. */
| #define snooze innocuous_snooze
|
| /* System header to define __stub macros and hopefully few prototypes,
| which can conflict with char snooze (); below.
| Prefer <limits.h> to <assert.h> if __STDC__ is defined, since
| <limits.h> exists even on freestanding compilers. */
|
| #ifdef __STDC__
| # include <limits.h>
| #else
| # include <assert.h>
| #endif
|
| #undef snooze
|
| /* Override any gcc2 internal prototype to avoid an error. */
| #ifdef __cplusplus
| extern "C"
| {
| #endif
| /* We use char because int might match the return type of a gcc2
| builtin and then its argument prototype would still apply. */
| char snooze ();
| /* The GNU C library defines this for functions which it implements
| to always fail with ENOSYS. Some functions are actually named
| something starting with __ and the normal name is an alias. */
| #if defined (__stub_snooze) || defined (__stub___snooze)
| choke me
| #else
| char (*f) () = snooze;
| #endif
| #ifdef __cplusplus
| }
| #endif
|
| int
| main ()
| {
| return f != snooze;
| ;
| return 0;
| }
configure:26830: result: no
configure:26742: checking for usleep
configure:26799: g++ -o conftest -g -O2 -Wl,-search_paths_first -mdynamic-no-pic conftest.cc -lm -framework Carbon -framework Cocoa -framework OpenGL >&5
configure:26805: $? = 0
configure:26809: test -z
|| test ! -s conftest.err
configure:26812: $? = 0
configure:26815: test -s conftest
configure:26818: $? = 0
configure:26830: result: yes
configure:26742: checking for vsnprintf
configure:26799: g++ -o conftest -g -O2 -Wl,-search_paths_first -mdynamic-no-pic conftest.cc -lm -framework Carbon -framework Cocoa -framework OpenGL >&5
configure:26805: $? = 0
configure:26809: test -z
|| test ! -s conftest.err
configure:26812: $? = 0
configure:26815: test -s conftest
configure:26818: $? = 0
configure:26830: result: yes
configure:26742: checking for wglGetCurrentContext
configure:26799: g++ -o conftest -g -O2 -Wl,-search_paths_first -mdynamic-no-pic conftest.cc -lm -framework Carbon -framework Cocoa -framework OpenGL >&5
/usr/bin/ld: Undefined symbols:
_wglGetCurrentContext
collect2: ld returned 1 exit status
configure:26805: $? = 1
configure: failed program was:
| /* confdefs.h. */
|
| #define PACKAGE_NAME "BZFlag"
| #define PACKAGE_TARNAME "bzflag"
| #define PACKAGE_VERSION "2.1.14"
| #define PACKAGE_STRING "BZFlag 2.1.14"
| #define PACKAGE_BUGREPORT "http://BZFlag.org"
| #define PACKAGE "bzflag"
| #define VERSION "2.1.14"
| #define BZ_BUILD_OS "darwin8.11.1"
| #define BZ_BUILD_USER "delusional"
| #define HAVE_NCURSES_H
| #define BZ_PLUGINS 1
| #define ROBOT 1
| #ifdef __cplusplus
| extern "C" void std::exit (int); using std::exit;
| #endif
| #define STDC_HEADERS 1
| #define HAVE_SYS_TYPES_H 1
| #define HAVE_SYS_STAT_H 1
| #define HAVE_STDLIB_H 1
| #define HAVE_STRING_H 1
| #define HAVE_MEMORY_H 1
| #define HAVE_STRINGS_H 1
| #define HAVE_INTTYPES_H 1
| #define HAVE_STDINT_H 1
| #define HAVE_UNISTD_H 1
| #define HAVE_DLFCN_H 1
| #define HAVE_LIBM 1
| #define HAVE_ACOSF 1
| #define HAVE_ASINF 1
| #define HAVE_ATAN2F 1
| #define HAVE_ATANF 1
| #define HAVE_COSF 1
| #define HAVE_EXPF 1
| #define HAVE_FABSF 1
| #define HAVE_FLOORF 1
| #define HAVE_FMODF 1
| #define HAVE_HYPOTF 1
| #define HAVE_LOGF 1
| #define HAVE_LOG10F 1
| #define HAVE_POWF 1
| #define HAVE_SINF 1
| #define HAVE_SQRTF 1
| #define HAVE_TANF 1
| #define STDC_HEADERS 1
| #define HAVE_CMATH 1
| #define HAVE_CSTDLIB 1
| #define HAVE_CSTDIO 1
| #define HAVE_CSTRING 1
| #define HAVE_SDL_SDL_H 1
| #define HAVE_X11_XLIB_H 1
| #define HAVE_ARPA_NAMESER_COMPAT_H 1
| #define HAVE_INTTYPES_H 1
| #define HAVE_SCHED_H 1
| #define HAVE_STDINT_H 1
| #define HAVE_SYS_PARAM_H 1
| #define HAVE_SYS_TYPES_H 1
| #define HAVE_UNISTD_H 1
| #define HAVE_REGEX_H 1
| #define HAVE_SOCKLEN_T 1
| #define BZFLAG_DATA "/usr/local/share/bzflag"
| #define HAVE_SDL 1
| #define NDEBUG 1
| #define HAVE_CGLGETCURRENTCONTEXT 1
| #define HAVE_SLEEP 1
| #define HAVE_ATEXIT 1
| #define HAVE_GETRLIMIT 1
| #define HAVE_SELECT 1
| #define HAVE_USLEEP 1
| #define HAVE_VSNPRINTF 1
| /* end confdefs.h. */
| /* Define wglGetCurrentContext to an innocuous variant, in case <limits.h> declares wglGetCurrentContext.
| For example, HP-UX 11i <limits.h> declares gettimeofday. */
| #define wglGetCurrentContext innocuous_wglGetCurrentContext
|
| /* System header to define __stub macros and hopefully few prototypes,
| which can conflict with char wglGetCurrentContext (); below.
| Prefer <limits.h> to <assert.h> if __STDC__ is defined, since
| <limits.h> exists even on freestanding compilers. */
|
| #ifdef __STDC__
| # include <limits.h>
| #else
| # include <assert.h>
| #endif
|
| #undef wglGetCurrentContext
|
| /* Override any gcc2 internal prototype to avoid an error. */
| #ifdef __cplusplus
| extern "C"
| {
| #endif
| /* We use char because int might match the return type of a gcc2
| builtin and then its argument prototype would still apply. */
| char wglGetCurrentContext ();
| /* The GNU C library defines this for functions which it implements
| to always fail with ENOSYS. Some functions are actually named
| something starting with __ and the normal name is an alias. */
| #if defined (__stub_wglGetCurrentContext) || defined (__stub___wglGetCurrentContext)
| choke me
| #else
| char (*f) () = wglGetCurrentContext;
| #endif
| #ifdef __cplusplus
| }
| #endif
|
| int
| main ()
| {
| return f != wglGetCurrentContext;
| ;
| return 0;
| }
configure:26830: result: no
configure:26849: checking for isnan
configure:26876: g++ -c -g -O2 conftest.cc >&5
configure:26882: $? = 0
configure:26886: test -z
|| test ! -s conftest.err
configure:26889: $? = 0
configure:26892: test -s conftest.o
configure:26895: $? = 0
configure:26971: result: yes
configure:27002: g++ -c -g -O2 conftest.cc >&5
configure:27008: $? = 0
configure:27012: test -z
|| test ! -s conftest.err
configure:27015: $? = 0
configure:27018: test -s conftest.o
configure:27021: $? = 0
configure:27055: g++ -c -g -O2 conftest.cc >&5
configure:27061: $? = 0
configure:27065: test -z
|| test ! -s conftest.err
configure:27068: $? = 0
configure:27071: test -s conftest.o
configure:27074: $? = 0
configure:27109: g++ -c -g -O2 conftest.cc >&5
configure:27115: $? = 0
configure:27119: test -z
|| test ! -s conftest.err
configure:27122: $? = 0
configure:27125: test -s conftest.o
configure:27128: $? = 0
configure:27160: checking ... s e r v i c e s
configure:27162: result: (8 of 9)
configure:27296: checking for linux rumble joystick support
configure:27314: g++ -c -g -O2 conftest.cc >&5
conftest.cc:77:25: error: linux/input.h: No such file or directory
conftest.cc: In function 'int main()':
conftest.cc:81: error: aggregate 'ff_effect x' has incomplete type and cannot be defined
configure:27320: $? = 1
configure: failed program was:
| /* confdefs.h. */
|
| #define PACKAGE_NAME "BZFlag"
| #define PACKAGE_TARNAME "bzflag"
| #define PACKAGE_VERSION "2.1.14"
| #define PACKAGE_STRING "BZFlag 2.1.14"
| #define PACKAGE_BUGREPORT "http://BZFlag.org"
| #define PACKAGE "bzflag"
| #define VERSION "2.1.14"
| #define BZ_BUILD_OS "darwin8.11.1"
| #define BZ_BUILD_USER "delusional"
| #define HAVE_NCURSES_H
| #define BZ_PLUGINS 1
| #define ROBOT 1
| #ifdef __cplusplus
| extern "C" void std::exit (int); using std::exit;
| #endif
| #define STDC_HEADERS 1
| #define HAVE_SYS_TYPES_H 1
| #define HAVE_SYS_STAT_H 1
| #define HAVE_STDLIB_H 1
| #define HAVE_STRING_H 1
| #define HAVE_MEMORY_H 1
| #define HAVE_STRINGS_H 1
| #define HAVE_INTTYPES_H 1
| #define HAVE_STDINT_H 1
| #define HAVE_UNISTD_H 1
| #define HAVE_DLFCN_H 1
| #define HAVE_LIBM 1
| #define HAVE_ACOSF 1
| #define HAVE_ASINF 1
| #define HAVE_ATAN2F 1
| #define HAVE_ATANF 1
| #define HAVE_COSF 1
| #define HAVE_EXPF 1
| #define HAVE_FABSF 1
| #define HAVE_FLOORF 1
| #define HAVE_FMODF 1
| #define HAVE_HYPOTF 1
| #define HAVE_LOGF 1
| #define HAVE_LOG10F 1
| #define HAVE_POWF 1
| #define HAVE_SINF 1
| #define HAVE_SQRTF 1
| #define HAVE_TANF 1
| #define STDC_HEADERS 1
| #define HAVE_CMATH 1
| #define HAVE_CSTDLIB 1
| #define HAVE_CSTDIO 1
| #define HAVE_CSTRING 1
| #define HAVE_SDL_SDL_H 1
| #define HAVE_X11_XLIB_H 1
| #define HAVE_ARPA_NAMESER_COMPAT_H 1
| #define HAVE_INTTYPES_H 1
| #define HAVE_SCHED_H 1
| #define HAVE_STDINT_H 1
| #define HAVE_SYS_PARAM_H 1
| #define HAVE_SYS_TYPES_H 1
| #define HAVE_UNISTD_H 1
| #define HAVE_REGEX_H 1
| #define HAVE_SOCKLEN_T 1
| #define BZFLAG_DATA "/usr/local/share/bzflag"
| #define HAVE_SDL 1
| #define NDEBUG 1
| #define HAVE_CGLGETCURRENTCONTEXT 1
| #define HAVE_SLEEP 1
| #define HAVE_ATEXIT 1
| #define HAVE_GETRLIMIT 1
| #define HAVE_SELECT 1
| #define HAVE_USLEEP 1
| #define HAVE_VSNPRINTF 1
| #define HAVE_STD__ISNAN 1
| #define HAVE_STD__MIN 1
| #define HAVE_STD__MAX 1
| #define HAVE_STD__COUNT 1
| /* end confdefs.h. */
| #include <linux/input.h>
| int
| main ()
| {
| struct ff_effect x; x.u.rumble.weak_magnitude = 42; return 0;
| ;
| return 0;
| }
configure:27350: result: no
configure:27354: checking for linux force feedback joystick support
configure:27372: g++ -c -g -O2 conftest.cc >&5
conftest.cc:77:25: error: linux/input.h: No such file or directory
conftest.cc: In function 'int main()':
conftest.cc:81: error: aggregate 'ff_effect x' has incomplete type and cannot be defined
configure:27378: $? = 1
configure: failed program was:
| /* confdefs.h. */
|
| #define PACKAGE_NAME "BZFlag"
| #define PACKAGE_TARNAME "bzflag"
| #define PACKAGE_VERSION "2.1.14"
| #define PACKAGE_STRING "BZFlag 2.1.14"
| #define PACKAGE_BUGREPORT "http://BZFlag.org"
| #define PACKAGE "bzflag"
| #define VERSION "2.1.14"
| #define BZ_BUILD_OS "darwin8.11.1"
| #define BZ_BUILD_USER "delusional"
| #define HAVE_NCURSES_H
| #define BZ_PLUGINS 1
| #define ROBOT 1
| #ifdef __cplusplus
| extern "C" void std::exit (int); using std::exit;
| #endif
| #define STDC_HEADERS 1
| #define HAVE_SYS_TYPES_H 1
| #define HAVE_SYS_STAT_H 1
| #define HAVE_STDLIB_H 1
| #define HAVE_STRING_H 1
| #define HAVE_MEMORY_H 1
| #define HAVE_STRINGS_H 1
| #define HAVE_INTTYPES_H 1
| #define HAVE_STDINT_H 1
| #define HAVE_UNISTD_H 1
| #define HAVE_DLFCN_H 1
| #define HAVE_LIBM 1
| #define HAVE_ACOSF 1
| #define HAVE_ASINF 1
| #define HAVE_ATAN2F 1
| #define HAVE_ATANF 1
| #define HAVE_COSF 1
| #define HAVE_EXPF 1
| #define HAVE_FABSF 1
| #define HAVE_FLOORF 1
| #define HAVE_FMODF 1
| #define HAVE_HYPOTF 1
| #define HAVE_LOGF 1
| #define HAVE_LOG10F 1
| #define HAVE_POWF 1
| #define HAVE_SINF 1
| #define HAVE_SQRTF 1
| #define HAVE_TANF 1
| #define STDC_HEADERS 1
| #define HAVE_CMATH 1
| #define HAVE_CSTDLIB 1
| #define HAVE_CSTDIO 1
| #define HAVE_CSTRING 1
| #define HAVE_SDL_SDL_H 1
| #define HAVE_X11_XLIB_H 1
| #define HAVE_ARPA_NAMESER_COMPAT_H 1
| #define HAVE_INTTYPES_H 1
| #define HAVE_SCHED_H 1
| #define HAVE_STDINT_H 1
| #define HAVE_SYS_PARAM_H 1
| #define HAVE_SYS_TYPES_H 1
| #define HAVE_UNISTD_H 1
| #define HAVE_REGEX_H 1
| #define HAVE_SOCKLEN_T 1
| #define BZFLAG_DATA "/usr/local/share/bzflag"
| #define HAVE_SDL 1
| #define NDEBUG 1
| #define HAVE_CGLGETCURRENTCONTEXT 1
| #define HAVE_SLEEP 1
| #define HAVE_ATEXIT 1
| #define HAVE_GETRLIMIT 1
| #define HAVE_SELECT 1
| #define HAVE_USLEEP 1
| #define HAVE_VSNPRINTF 1
| #define HAVE_STD__ISNAN 1
| #define HAVE_STD__MIN 1
| #define HAVE_STD__MAX 1
| #define HAVE_STD__COUNT 1
| /* end confdefs.h. */
| #include <linux/input.h>
| int
| main ()
| {
| struct ff_effect x; x.direction = 0x4000; return 0;
| ;
| return 0;
| }
configure:27408: result: no
configure:28002: checking whether to build the included ares lookup library
configure:28015: result: yes
configure:28032: checking for regular expression functionality
configure:28063: g++ -o conftest -g -O2 -Wl,-search_paths_first -mdynamic-no-pic -lc conftest.cc -lm -framework Carbon -framework Cocoa -framework OpenGL >&5
configure:28066: $? = 0
configure:28068: ./conftest
configure:28071: $? = 0
configure:28083: result: yes
configure:28086: checking whether to build the included regular expression library
configure:28099: result: no (using system)
configure:28114: checking whether to build the included zlib compression library
configure:28127: result: no (using system)
configure:28196: checking for gawk
configure:28222: result: awk
configure:28283: checking for curl-config
configure:28301: found /usr/bin/curl-config
configure:28313: result: /usr/bin/curl-config
configure:28323: checking for the version of libcurl
configure:28330: result: 7.13.1
configure:28391: checking whether libcurl is usable
configure:28429: g++ -o conftest -g -O2 -Wl,-search_paths_first -mdynamic-no-pic conftest.cc -L/usr/lib -lcurl -lssl -lcrypto -lz -lm -framework Carbon -framework Cocoa -framework OpenGL >&5
configure:28435: $? = 0
configure:28439: test -z
|| test ! -s conftest.err
configure:28442: $? = 0
configure:28445: test -s conftest
configure:28448: $? = 0
configure:28466: result: yes
configure:28479: checking for curl_free
configure:28536: g++ -o conftest -g -O2 -Wl,-search_paths_first -mdynamic-no-pic conftest.cc -lm -framework Carbon -framework Cocoa -framework OpenGL -L/usr/lib -lcurl -lssl -lcrypto -lz >&5
configure:28542: $? = 0
configure:28546: test -z
|| test ! -s conftest.err
configure:28549: $? = 0
configure:28552: test -s conftest
configure:28555: $? = 0
configure:28567: result: yes
configure:28653: checking whether to build the included curl library
configure:28664: result: no (using system)
configure:28726: checking for freetype-config
configure:28757: result: no
configure:28766: checking for FreeType -- version >= 7.0.1
configure:28885: result: no
configure:28941: checking whether to build the included freetype library
configure:28955: result: yes
configure:28989: checking for main in -lftgl
configure:29013: g++ -o conftest -g -O2 -Wl,-search_paths_first -mdynamic-no-pic conftest.cc -lftgl -lm -framework Carbon -framework Cocoa -framework OpenGL >&5
/usr/bin/ld: can't locate file for: -lftgl
collect2: ld returned 1 exit status
configure:29019: $? = 1
configure: failed program was:
| /* confdefs.h. */
|
| #define PACKAGE_NAME "BZFlag"
| #define PACKAGE_TARNAME "bzflag"
| #define PACKAGE_VERSION "2.1.14"
| #define PACKAGE_STRING "BZFlag 2.1.14"
| #define PACKAGE_BUGREPORT "http://BZFlag.org"
| #define PACKAGE "bzflag"
| #define VERSION "2.1.14"
| #define BZ_BUILD_OS "darwin8.11.1"
| #define BZ_BUILD_USER "delusional"
| #define HAVE_NCURSES_H
| #define BZ_PLUGINS 1
| #define ROBOT 1
| #ifdef __cplusplus
| extern "C" void std::exit (int); using std::exit;
| #endif
| #define STDC_HEADERS 1
| #define HAVE_SYS_TYPES_H 1
| #define HAVE_SYS_STAT_H 1
| #define HAVE_STDLIB_H 1
| #define HAVE_STRING_H 1
| #define HAVE_MEMORY_H 1
| #define HAVE_STRINGS_H 1
| #define HAVE_INTTYPES_H 1
| #define HAVE_STDINT_H 1
| #define HAVE_UNISTD_H 1
| #define HAVE_DLFCN_H 1
| #define HAVE_LIBM 1
| #define HAVE_ACOSF 1
| #define HAVE_ASINF 1
| #define HAVE_ATAN2F 1
| #define HAVE_ATANF 1
| #define HAVE_COSF 1
| #define HAVE_EXPF 1
| #define HAVE_FABSF 1
| #define HAVE_FLOORF 1
| #define HAVE_FMODF 1
| #define HAVE_HYPOTF 1
| #define HAVE_LOGF 1
| #define HAVE_LOG10F 1
| #define HAVE_POWF 1
| #define HAVE_SINF 1
| #define HAVE_SQRTF 1
| #define HAVE_TANF 1
| #define STDC_HEADERS 1
| #define HAVE_CMATH 1
| #define HAVE_CSTDLIB 1
| #define HAVE_CSTDIO 1
| #define HAVE_CSTRING 1
| #define HAVE_SDL_SDL_H 1
| #define HAVE_X11_XLIB_H 1
| #define HAVE_ARPA_NAMESER_COMPAT_H 1
| #define HAVE_INTTYPES_H 1
| #define HAVE_SCHED_H 1
| #define HAVE_STDINT_H 1
| #define HAVE_SYS_PARAM_H 1
| #define HAVE_SYS_TYPES_H 1
| #define HAVE_UNISTD_H 1
| #define HAVE_REGEX_H 1
| #define HAVE_SOCKLEN_T 1
| #define BZFLAG_DATA "/usr/local/share/bzflag"
| #define HAVE_SDL 1
| #define NDEBUG 1
| #define HAVE_CGLGETCURRENTCONTEXT 1
| #define HAVE_SLEEP 1
| #define HAVE_ATEXIT 1
| #define HAVE_GETRLIMIT 1
| #define HAVE_SELECT 1
| #define HAVE_USLEEP 1
| #define HAVE_VSNPRINTF 1
| #define HAVE_STD__ISNAN 1
| #define HAVE_STD__MIN 1
| #define HAVE_STD__MAX 1
| #define HAVE_STD__COUNT 1
| #define BUILD_ARES 1
| #define HAVE_LIBCURL 1
| #define LIBCURL_FEATURE_SSL 1
| #define LIBCURL_FEATURE_IPV6 1
| #define LIBCURL_FEATURE_LIBZ 1
| #define LIBCURL_PROTOCOL_HTTP 1
| #define LIBCURL_PROTOCOL_HTTPS 1
| #define LIBCURL_PROTOCOL_FTP 1
| #define LIBCURL_PROTOCOL_FTPS 1
| #define LIBCURL_PROTOCOL_GOPHER 1
| #define LIBCURL_PROTOCOL_FILE 1
| #define LIBCURL_PROTOCOL_TELNET 1
| #define LIBCURL_PROTOCOL_LDAP 1
| #define LIBCURL_PROTOCOL_DICT 1
| #define BUILD_FREETYPE 1
| /* end confdefs.h. */
|
|
| int
| main ()
| {
| main ();
| ;
| return 0;
| }
configure:29045: result: no
configure:29052: checking whether to build the included ftgl library
configure:29064: result: yes
configure:29121: checking ... o u t p u t
configure:29123: result: (9 of 9)
configure:29523: creating ./config.status
## ---------------------- ##
## Running config.status. ##
## ---------------------- ##
This file was extended by BZFlag config.status 2.1.14, which was
generated by GNU Autoconf 2.59. Invocation command line was
CONFIG_FILES =
CONFIG_HEADERS =
CONFIG_LINKS =
CONFIG_COMMANDS =
$ ./config.status
on phil-matous-computer.local
config.status:888: creating BZFlag.xcodeproj/Makefile
config.status:888: creating Makefile
config.status:888: creating bzflag.info
config.status:888: creating bzflag.lsm
config.status:888: creating bzflag.spec
config.status:888: creating data/Makefile
config.status:888: creating data/fonts/Makefile
config.status:888: creating data/l10n/Makefile
config.status:888: creating data/skins/Makefile
config.status:888: creating data/skins/red/Makefile
config.status:888: creating data/skins/green/Makefile
config.status:888: creating data/skins/blue/Makefile
config.status:888: creating data/skins/purple/Makefile
config.status:888: creating data/skins/hunter/Makefile
config.status:888: creating data/skins/rabbit/Makefile
config.status:888: creating data/skins/rogue/Makefile
config.status:888: creating data/skins/observer/Makefile
config.status:888: creating debian/Makefile
config.status:888: creating doc/Makefile
config.status:888: creating doc/faq/Makefile
config.status:888: creating doc/guide/Commands/Makefile
config.status:888: creating doc/guide/Flags/Makefile
config.status:888: creating doc/guide/Geometry/Makefile
config.status:888: creating doc/guide/Installation/Makefile
config.status:888: creating doc/guide/Makefile
config.status:888: creating doc/guide/Tactics/Makefile
config.status:888: creating doc/howto/Makefile
config.status:888: creating doc/man/Makefile
config.status:888: creating include/Makefile
config.status:888: creating m4/Makefile
config.status:888: creating man/Makefile
config.status:888: creating man/bzadmin.6
config.status:888: creating man/bzflag.6
config.status:888: creating man/bzfs.6
config.status:888: creating man/bzw.5
config.status:888: creating misc/Makefile
config.status:888: creating package/Makefile
config.status:888: creating package/irix/Makefile
config.status:888: creating package/linux/Makefile
config.status:888: creating package/rpm/Makefile
config.status:888: creating package/win32/Makefile
config.status:888: creating package/win32/nsis/Makefile
config.status:888: creating src/3D/Makefile
config.status:888: creating src/Makefile
config.status:888: creating src/bzadmin/Makefile
config.status:888: creating src/bzflag/Makefile
config.status:888: creating src/bzfs/Makefile
config.status:888: creating src/bzrobots/Makefile
config.status:888: creating src/common/Makefile
config.status:888: creating src/date/Makefile
config.status:888: creating src/game/Makefile
config.status:888: creating src/geometry/Makefile
config.status:888: creating src/geometry/models/Makefile
config.status:888: creating src/geometry/models/tank/Makefile
config.status:888: creating src/mediafile/Makefile
config.status:888: creating src/net/Makefile
config.status:888: creating src/obstacle/Makefile
config.status:888: creating src/ogl/Makefile
config.status:888: creating src/other/Makefile
config.status:888: creating src/other/freetype/Makefile
config.status:888: creating src/other/ftgl/Makefile
config.status:888: creating src/other/regex/Makefile
config.status:888: creating src/other/zlib/Makefile
config.status:888: creating src/platform/MacOSX/BZFlag-Info.plist
config.status:888: creating src/platform/MacOSX/Makefile
config.status:888: creating src/platform/Makefile
config.status:888: creating src/scene/Makefile
config.status:888: creating tools/Makefile
config.status:888: creating tools/modeltool/Makefile
config.status:888: creating tools/modeltool/vc71/Makefile
config.status:888: creating tools/modeltool/vc8/Makefile
config.status:888: creating MSVC/Makefile
config.status:888: creating MSVC/VC71/Makefile
config.status:888: creating MSVC/VC8/Makefile
config.status:888: creating MSVC/VC9/Makefile
config.status:992: creating include/config.h
config.status:1436: executing depfiles commands
configure:31043: configuring in plugins
configure:31160: running /bin/sh './configure' --prefix=/usr/local --cache-file=../config.cache.darwin8.11.1.phil-matous-computer.local --srcdir=.
configure:31043: configuring in src/other/ares
configure:31160: running /bin/sh './configure' --prefix=/usr/local --cache-file=../../../config.cache.darwin8.11.1.phil-matous-computer.local --srcdir=.
configure:31197: result: Found -all_load in libtool script, removing
configure:31197: result: Found -all_load in libtool script, removing
configure:31272: result: Done.
configure:31274: result:
configure:31285: result: BZFlag-2.99.00.20071127 configured with the following:
configure:31296: result:
configure:31298: result: Prefix: /usr/local
configure:31300: result: Binaries: /usr/local/bin
configure:31302: result: Configuration files: /usr/local/etc
configure:31304: result: Manual pages: /usr/local/man
configure:31306: result:
configure:31308: result: CC = gcc
configure:31310: result: CXX = g++
configure:31312: result: CFLAGS = -g -O2
configure:31314: result: CXXFLAGS = -g -O2
configure:31316: result: CPPFLAGS =
configure:31318: result: LDFLAGS = -Wl,-search_paths_first -mdynamic-no-pic
configure:31320: result: LIBS = -lm -framework Carbon -framework Cocoa -framework OpenGL
configure:31322: result:
configure:31324: result: Build ares ........: yes
configure:31326: result: Build curl ........: no (using system)
configure:31328: result: Build freetype2 ...: yes
configure:31330: result: Build ftgl ........: yes
configure:31332: result: Build regex .......: no (using system)
configure:31334: result: Build zlib ........: no (using system)
configure:31336: result:
configure:31338: result: BZFlag client .....: yes (with SDL)
configure:31340: result: BZFlag server .....: yes (with plugins)
configure:31342: result: BZAdmin client ....: yes
configure:31344: result: BZRobots client ...: yes (without python)
configure:31346: result:
configure:31349: result: Elapsed configuration time: 1 minute, 40 seconds
configure:31352: result: ---
configure:31354: result: ./configure complete, type 'make' to begin building
configure:31356: result:
## ---------------- ##
## Cache variables. ##
## ---------------- ##
ac_cv_build=i386-apple-darwin8.11.1
ac_cv_build_alias=i386-apple-darwin8.11.1
ac_cv_c_bigendian=no
ac_cv_c_compiler_gnu=yes
ac_cv_c_const=yes
ac_cv_cxx_compiler_gnu=yes
ac_cv_env_CC_set=
ac_cv_env_CC_value=
ac_cv_env_CFLAGS_set=
ac_cv_env_CFLAGS_value=
ac_cv_env_CPPFLAGS_set=
ac_cv_env_CPPFLAGS_value=
ac_cv_env_CPP_set=
ac_cv_env_CPP_value=
ac_cv_env_CXXCPP_set=
ac_cv_env_CXXCPP_value=
ac_cv_env_CXXFLAGS_set=
ac_cv_env_CXXFLAGS_value=
ac_cv_env_CXX_set=
ac_cv_env_CXX_value=
ac_cv_env_F77_set=
ac_cv_env_F77_value=
ac_cv_env_FFLAGS_set=
ac_cv_env_FFLAGS_value=
ac_cv_env_LDFLAGS_set=
ac_cv_env_LDFLAGS_value=
ac_cv_env_PYTHON_VERSION_set=
ac_cv_env_PYTHON_VERSION_value=
ac_cv_env_build_alias_set=
ac_cv_env_build_alias_value=
ac_cv_env_host_alias_set=
ac_cv_env_host_alias_value=
ac_cv_env_target_alias_set=
ac_cv_env_target_alias_value=
ac_cv_exeext=
ac_cv_f77_compiler_gnu=no
ac_cv_func_CGLGetCurrentContext=yes
ac_cv_func_Sleep=yes
ac_cv_func_WaitForSingleObject=no
ac_cv_func__stricmp=no
ac_cv_func__strnicmp=no
ac_cv_func__vsnprintf=no
ac_cv_func_atexit=yes
ac_cv_func_curl_free=yes
ac_cv_func_getrlimit=yes
ac_cv_func_glXGetCurrentContext=no
ac_cv_func_sched_setaffinity=no
ac_cv_func_select=yes
ac_cv_func_snooze=no
ac_cv_func_usleep=yes
ac_cv_func_vsnprintf=yes
ac_cv_func_wglGetCurrentContext=no
ac_cv_header_GL_glx_h=no
ac_cv_header_SDL_SDL_h=yes
ac_cv_header_X11_Xlib_h=yes
ac_cv_header_arpa_nameser_compat_h=yes
ac_cv_header_bstring_h=no
ac_cv_header_cmath=yes
ac_cv_header_cstdio=yes
ac_cv_header_cstdlib=yes
ac_cv_header_cstring=yes
ac_cv_header_dlfcn_h=yes
ac_cv_header_dsound_h=no
ac_cv_header_inttypes_h=yes
ac_cv_header_linux_input_h=no
ac_cv_header_memory_h=yes
ac_cv_header_process_h=no
ac_cv_header_regex_h=yes
ac_cv_header_sched_h=yes
ac_cv_header_stdc=yes
ac_cv_header_stdint_h=yes
ac_cv_header_stdlib_h=yes
ac_cv_header_string_h=yes
ac_cv_header_strings_h=yes
ac_cv_header_sys_param_h=yes
ac_cv_header_sys_stat_h=yes
ac_cv_header_sys_types_h=yes
ac_cv_header_unistd_h=yes
ac_cv_header_values_h=no
ac_cv_host=i386-apple-darwin8.11.1
ac_cv_host_alias=i386-apple-darwin8.11.1
ac_cv_lib_bind_gethostent=no
ac_cv_lib_c_regcomp=yes
ac_cv_lib_cares_ares_init=no
ac_cv_lib_dl_dlopen=yes
ac_cv_lib_ftgl_main=no
ac_cv_lib_m_acosf=yes
ac_cv_lib_m_asinf=yes
ac_cv_lib_m_atan2f=yes
ac_cv_lib_m_atanf=yes
ac_cv_lib_m_cosf=yes
ac_cv_lib_m_expf=yes
ac_cv_lib_m_fabsf=yes
ac_cv_lib_m_floorf=yes
ac_cv_lib_m_fmodf=yes
ac_cv_lib_m_hypotf=yes
ac_cv_lib_m_log10f=yes
ac_cv_lib_m_logf=yes
ac_cv_lib_m_powf=yes
ac_cv_lib_m_sinf=yes
ac_cv_lib_m_sqrtf=yes
ac_cv_lib_m_tanf=yes
ac_cv_lib_socket_gethostent=no
ac_cv_lib_socket_socket=no
ac_cv_lib_z_compress=yes
ac_cv_objext=o
ac_cv_path_FT2_CONFIG=no
ac_cv_path_SDL_CONFIG=/usr/local/bin/sdl-config
ac_cv_path__libcurl_config=/usr/bin/curl-config
ac_cv_path_install='/usr/bin/install -c'
ac_cv_prog_AR=ar
ac_cv_prog_AWK=awk
ac_cv_prog_CPP='gcc -E'
ac_cv_prog_CXXCPP='g++ -E'
ac_cv_prog_HASPOD2MAN=yes
ac_cv_prog_HASWHOAMI=yes
ac_cv_prog_ac_ct_CC=gcc
ac_cv_prog_ac_ct_CXX=g++
ac_cv_prog_ac_ct_RANLIB=ranlib
ac_cv_prog_ac_ct_STRIP=strip
ac_cv_prog_ac_ct_WINDRES=:
ac_cv_prog_cc_g=yes
ac_cv_prog_cc_stdc=
ac_cv_prog_cxx_g=yes
ac_cv_prog_egrep='grep -E'
ac_cv_prog_f77_g=no
ac_cv_prog_make_make_set=yes
ac_cv_search_glBegin='-framework OpenGL'
ac_cv_search_gluScaleImage='-framework OpenGL'
ac_cv_target=i386-apple-darwin8.11.1
ac_cv_target_alias=i386-apple-darwin8.11.1
ac_cv_type_socklen_t=yes
am_cv_CC_dependencies_compiler_type=gcc3
am_cv_CXX_dependencies_compiler_type=gcc3
libcurl_cv_lib_curl_usable=yes
libcurl_cv_lib_curl_version=7.13.1
lt_cv_deplibs_check_method=pass_all
lt_cv_dlopen=dlopen
lt_cv_dlopen_libs=-ldl
lt_cv_dlopen_self=yes
lt_cv_dlopen_self_static=yes
lt_cv_file_magic_cmd='/usr/bin/file -L'
lt_cv_file_magic_test_file=/usr/lib/libSystem.dylib
lt_cv_ld_reload_flag=-r
lt_cv_objdir=.libs
lt_cv_path_LD=/usr/bin/ld
lt_cv_path_LDCXX=/usr/bin/ld
lt_cv_path_NM='/usr/bin/nm -p'
lt_cv_path_SED=/usr/bin/sed
lt_cv_prog_compiler_c_o=yes
lt_cv_prog_compiler_c_o_CXX=yes
lt_cv_prog_compiler_rtti_exceptions=no
lt_cv_prog_gnu_ld=no
lt_cv_prog_gnu_ldcxx=no
lt_cv_sys_global_symbol_pipe='sed -n -e '\''s/^.*[ ]\([BCDEGRST][BCDEGRST]*\)[ ][ ]*\(_\)\([_A-Za-z][_A-Za-z0-9]*\)$/\1 \2\3 \3/p'\'''
lt_cv_sys_global_symbol_to_c_name_address='sed -n -e '\''s/^: \([^ ]*\) $/ {\"\1\", (lt_ptr) 0},/p'\'' -e '\''s/^[BCDEGRST] \([^ ]*\) \([^ ]*\)$/ {"\2", (lt_ptr) \&\2},/p'\'''
lt_cv_sys_global_symbol_to_cdecl='sed -n -e '\''s/^. .* \(.*\)$/extern int \1;/p'\'''
lt_cv_sys_max_cmd_len=65536
lt_lt_cv_prog_compiler_c_o='"yes"'
lt_lt_cv_prog_compiler_c_o_CXX='"yes"'
lt_lt_cv_sys_global_symbol_pipe='"sed -n -e '\''s/^.*[ ]\\([BCDEGRST][BCDEGRST]*\\)[ ][ ]*\\(_\\)\\([_A-Za-z][_A-Za-z0-9]*\\)\$/\\1 \\2\\3 \\3/p'\''"'
lt_lt_cv_sys_global_symbol_to_c_name_address='"sed -n -e '\''s/^: \\([^ ]*\\) \$/ {\\\"\\1\\\", (lt_ptr) 0},/p'\'' -e '\''s/^[BCDEGRST] \\([^ ]*\\) \\([^ ]*\\)\$/ {\"\\2\", (lt_ptr) \\&\\2},/p'\''"'
lt_lt_cv_sys_global_symbol_to_cdecl='"sed -n -e '\''s/^. .* \\(.*\\)\$/extern int \\1;/p'\''"'
mp_cv_ncurses=yes
## ----------------- ##
## Output variables. ##
## ----------------- ##
ACLOCAL='${SHELL} /Users/delusional/bzflag/misc/missing --run aclocal-1.6'
AMDEPBACKSLASH='\'
AMDEP_FALSE='#'
AMDEP_TRUE=''
AMTAR='${SHELL} /Users/delusional/bzflag/misc/missing --run tar'
AR='ar'
AR_FLAGS='cru'
AUTOCONF='${SHELL} /Users/delusional/bzflag/misc/missing --run autoconf'
AUTOHEADER='${SHELL} /Users/delusional/bzflag/misc/missing --run autoheader'
AUTOMAKE='${SHELL} /Users/delusional/bzflag/misc/missing --run automake-1.6'
AWK='awk'
BEOS_FALSE=''
BEOS_TRUE='#'
BUGGY_MIPSPRO_FALSE=''
BUGGY_MIPSPRO_TRUE='#'
BUILD_ARES_FALSE='#'
BUILD_ARES_TRUE=''
BUILD_CURL_FALSE=''
BUILD_CURL_TRUE='#'
BUILD_FREETYPE_FALSE='#'
BUILD_FREETYPE_TRUE=''
BUILD_FTGL_FALSE='#'
BUILD_FTGL_TRUE=''
BUILD_PLUGINS_FALSE='#'
BUILD_PLUGINS_TRUE=''
BUILD_REGEX_FALSE=''
BUILD_REGEX_TRUE='#'
BUILD_ZLIB_FALSE=''
BUILD_ZLIB_TRUE='#'
BZADMIN_INCLUDED_FALSE='#'
BZADMIN_INCLUDED_TRUE=''
BZFLAG_DATA='/usr/local/share/bzflag'
BZFLAG_DATE='2007-11-27'
BZFLAG_VERSION='2.99.00'
BZROBOTS_INCLUDED_FALSE='#'
BZROBOTS_INCLUDED_TRUE=''
BZROBOTS_PYTHON_ENABLED_FALSE=''
BZROBOTS_PYTHON_ENABLED_TRUE='#'
CC='gcc'
CCACHE=''
CCDEPMODE='depmode=gcc3'
CFLAGS='-g -O2'
CLIENT_INCLUDED_FALSE='#'
CLIENT_INCLUDED_TRUE=''
CONFIG=''
CONFIG_CACHE='config.cache.darwin8.11.1.phil-matous-computer.local'
CONF_CFLAGS=' -pipe -pedantic -fno-exceptions -W -Wall -Wundef -Wno-import -O3'
CONF_CPPFLAGS=''
CONF_CXXFLAGS=' -pipe -pedantic -fno-exceptions -W -Wall -Wundef -Wno-import -O3 -ffast-math -fomit-frame-pointer -fexpensive-optimizations -fno-exceptions'
CONF_TIME='13 00 18'
CPP='gcc -E'
CPPFLAGS=''
CURSES_LIB='-lncurses'
CXX='g++'
CXXCPP='g++ -E'
CXXDEPMODE='depmode=gcc3'
CXXFLAGS='-g -O2'
DEFS='-DHAVE_CONFIG_H'
DEPDIR='.deps'
ECHO='echo'
ECHO_C=''
ECHO_N='-n'
ECHO_T=''
EGREP='grep -E'
EXEEXT=''
F77=''
FFLAGS=''
FRAMEWORK_OPENGL='-framework OpenGL'
FT2_CFLAGS=''
FT2_CONFIG='no'
FT2_LIBS=''
GLEW_LIBS=''
GLIBS='-framework OpenGL -framework OpenGL '
HASPOD2MAN='yes'
HASPOD2MAN_FALSE='#'
HASPOD2MAN_TRUE=''
HASWHOAMI='yes'
HAVE_CURSES_FALSE='#'
HAVE_CURSES_TRUE=''
HAVE_SDL_FALSE='#'
HAVE_SDL_TRUE=''
HPUX_FALSE=''
HPUX_TRUE='#'
INSTALL_DATA='${INSTALL} -m 644'
INSTALL_PROGRAM='${INSTALL}'
INSTALL_SCRIPT='${INSTALL}'
INSTALL_STRIP_PROGRAM='${SHELL} $(install_sh) -c -s'
IRIX_FALSE=''
IRIX_TRUE='#'
LDFLAGS=' -Wl,-search_paths_first -mdynamic-no-pic'
LIBCARES='${top_builddir}/src/other/ares/libcares.la'
LIBCURL='-L/usr/lib -lcurl -lssl -lcrypto -lz'
LIBCURL_CPPFLAGS=''
LIBDIR='$(top_srcdir)/lib'
LIBFREETYPE='${top_builddir}/src/other/freetype/libfreetype.la'
LIBFTGL='${top_builddir}/src/other/ftgl/libftgl.la'
LIBOBJS=''
LIBREGEX='-lc'
LIBS='-lm -framework Carbon -framework Cocoa -framework OpenGL'
LIBTOOL='$(SHELL) $(top_builddir)/libtool --silent'
LIBTOOLFLAGS='--silent'
LIBTOOL_DEPS='misc/ltmain.sh'
LIBZ='-lz'
LINUX_FALSE=''
LINUX_TRUE='#'
LN_S='ln -s'
LTLIBOBJS=''
MACOS_FALSE='#'
MACOS_TRUE=''
MAJOR_VERSION='2'
MAKEINFO='${SHELL} /Users/delusional/bzflag/misc/missing --run makeinfo'
MINOR_VERSION='99'
MKDIR_P='$(mkinstalldirs)'
OBJEXT='o'
PACKAGE='bzflag'
PACKAGE_BUGREPORT='http://BZFlag.org'
PACKAGE_NAME='BZFlag'
PACKAGE_STRING='BZFlag 2.1.14'
PACKAGE_TARNAME='bzflag'
PACKAGE_VERSION='2.1.14'
PATH_SEPARATOR=':'
PC_FALSE=''
PC_TRUE='#'
PPC_FALSE=''
PPC_TRUE='#'
PYTHON=''
PYTHON_CPPFLAGS=''
PYTHON_EXTRA_LDFLAGS=''
PYTHON_EXTRA_LIBS=''
PYTHON_LDFLAGS=''
PYTHON_SITE_PKG=''
PYTHON_VERSION=''
RANLIB='ranlib'
SDL_CFLAGS='-I/usr/local/include/SDL -D_GNU_SOURCE=1 -D_THREAD_SAFE'
SDL_CONFIG='/usr/local/bin/sdl-config'
SDL_IMAGE_LIBS=''
SDL_LIBS='-L/usr/local/lib -lSDLmain -lSDL -Wl,-framework,Cocoa'
SERVER_INCLUDED_FALSE='#'
SERVER_INCLUDED_TRUE=''
SET_MAKE=''
SHELL='/bin/sh'
SOLARIS_FALSE=''
SOLARIS_TRUE='#'
STRIP='strip'
SWIG=''
SWIG_PYTHON_CPPFLAGS=''
VERSION='2.1.14'
WIN32_FALSE=''
WIN32_TRUE='#'
WINDRES=':'
X_CFLAGS=''
X_EXTRA_LIBS=''
X_LIBS=''
X_PRE_LIBS=''
_libcurl_config=''
ac_ct_AR=''
ac_ct_CC='gcc'
ac_ct_CXX='g++'
ac_ct_F77=''
ac_ct_RANLIB='ranlib'
ac_ct_STRIP='strip'
ac_ct_WINDRES=':'
am__include='include'
am__quote=''
bindir='/usr/local/bin'
build='i386-apple-darwin8.11.1'
build_alias=''
build_cpu='i386'
build_os='darwin8.11.1'
build_vendor='apple'
datadir='${prefix}/share'
exec_prefix='${prefix}'
host='i386-apple-darwin8.11.1'
host_alias=''
host_cpu='i386'
host_os='darwin8.11.1'
host_vendor='apple'
includedir='${prefix}/include'
infodir='${prefix}/info'
install_sh='/Users/delusional/bzflag/misc/install-sh'
libdir='${exec_prefix}/lib'
libexecdir='${exec_prefix}/libexec'
localstatedir='${prefix}/var'
mandir='/usr/local/man'
mkdir_p='$(mkinstalldirs)'
oldincludedir='/usr/include'
prefix='/usr/local'
program_transform_name='s,x,x,'
sbindir='${exec_prefix}/sbin'
sharedstatedir='${prefix}/com'
subdirs=' plugins src/other/ares'
sysconfdir='/usr/local/etc'
target='i386-apple-darwin8.11.1'
target_alias=''
target_cpu='i386'
target_os='darwin8.11.1'
target_vendor='apple'
## ----------- ##
## confdefs.h. ##
## ----------- ##
#define BUILD_ARES 1
#define BUILD_FREETYPE 1
#define BUILD_FTGL 1
#define BZFLAG_DATA "/usr/local/share/bzflag"
#define BZ_BUILD_OS "darwin8.11.1"
#define BZ_BUILD_USER "delusional"
#define BZ_PLUGINS 1
#define HAVE_ACOSF 1
#define HAVE_ARPA_NAMESER_COMPAT_H 1
#define HAVE_ASINF 1
#define HAVE_ATAN2F 1
#define HAVE_ATANF 1
#define HAVE_ATEXIT 1
#define HAVE_CGLGETCURRENTCONTEXT 1
#define HAVE_CMATH 1
#define HAVE_COSF 1
#define HAVE_CSTDIO 1
#define HAVE_CSTDLIB 1
#define HAVE_CSTRING 1
#define HAVE_DLFCN_H 1
#define HAVE_EXPF 1
#define HAVE_FABSF 1
#define HAVE_FLOORF 1
#define HAVE_FMODF 1
#define HAVE_GETRLIMIT 1
#define HAVE_HYPOTF 1
#define HAVE_INTTYPES_H 1
#define HAVE_INTTYPES_H 1
#define HAVE_LIBCURL 1
#define HAVE_LIBM 1
#define HAVE_LOG10F 1
#define HAVE_LOGF 1
#define HAVE_MEMORY_H 1
#define HAVE_NCURSES_H
#define HAVE_POWF 1
#define HAVE_REGEX_H 1
#define HAVE_SCHED_H 1
#define HAVE_SDL 1
#define HAVE_SDL_SDL_H 1
#define HAVE_SELECT 1
#define HAVE_SINF 1
#define HAVE_SLEEP 1
#define HAVE_SOCKLEN_T 1
#define HAVE_SQRTF 1
#define HAVE_STDINT_H 1
#define HAVE_STDINT_H 1
#define HAVE_STDLIB_H 1
#define HAVE_STD__COUNT 1
#define HAVE_STD__ISNAN 1
#define HAVE_STD__MAX 1
#define HAVE_STD__MIN 1
#define HAVE_STRINGS_H 1
#define HAVE_STRING_H 1
#define HAVE_SYS_PARAM_H 1
#define HAVE_SYS_STAT_H 1
#define HAVE_SYS_TYPES_H 1
#define HAVE_SYS_TYPES_H 1
#define HAVE_TANF 1
#define HAVE_UNISTD_H 1
#define HAVE_UNISTD_H 1
#define HAVE_USLEEP 1
#define HAVE_VSNPRINTF 1
#define HAVE_X11_XLIB_H 1
#define LIBCURL_FEATURE_IPV6 1
#define LIBCURL_FEATURE_LIBZ 1
#define LIBCURL_FEATURE_SSL 1
#define LIBCURL_PROTOCOL_DICT 1
#define LIBCURL_PROTOCOL_FILE 1
#define LIBCURL_PROTOCOL_FTP 1
#define LIBCURL_PROTOCOL_FTPS 1
#define LIBCURL_PROTOCOL_GOPHER 1
#define LIBCURL_PROTOCOL_HTTP 1
#define LIBCURL_PROTOCOL_HTTPS 1
#define LIBCURL_PROTOCOL_LDAP 1
#define LIBCURL_PROTOCOL_TELNET 1
#define NDEBUG 1
#define PACKAGE "bzflag"
#define PACKAGE_BUGREPORT "http://BZFlag.org"
#define PACKAGE_NAME "BZFlag"
#define PACKAGE_STRING "BZFlag 2.1.14"
#define PACKAGE_TARNAME "bzflag"
#define PACKAGE_VERSION "2.1.14"
#define ROBOT 1
#define STDC_HEADERS 1
#define STDC_HEADERS 1
#define VERSION "2.1.14"
#endif
#ifdef __cplusplus
extern "C" void std::exit (int); using std::exit;
configure: exit 0