All pastes #798797 Raw Edit

Someone

public text v1 · immutable
#798797 ·published 2007-11-27 01:00 UTC
rendered paste body
checking for perl5... no
checking for perl... perl
checking for indent... indent
configure: creating ./config.status
config.status: creating Makefile
config.status: creating gconf-2.m4
config.status: creating gconf-zip
config.status: creating gconf/Makefile
config.status: creating backends/Makefile
config.status: creating po/Makefile.in
config.status: creating doc/Makefile
config.status: creating doc/gconf/Makefile
config.status: creating examples/Makefile
config.status: creating tests/Makefile
config.status: creating gconf-2.0.pc
config.status: creating config.h
config.status: executing depfiles commands
config.status: executing intltool commands
config.status: executing default-1 commands
config.status: executing po/stamp-it commands
make  all-recursive
make[1]: Entering directory `/var/tmp/portage/gnome-base/gconf-2.20.1/work/GConf-2.20.1'
Making all in gconf
make[2]: Entering directory `/var/tmp/portage/gnome-base/gconf-2.20.1/work/GConf-2.20.1/gconf'
/usr/bin/orbit-idl-2 ./GConfX.idl
/usr/bin/orbit-idl-2 ./GConfX.idl
orbit-idl-2 2.14.10 compiling
  mode, hide preprocessor errors, passes: stubs skels common headers 

Processing file ./GConfX.idl
orbit-idl-2 2.14.10 compiling
  mode, hide preprocessor errors, passes: stubs skels common headers 

Processing file ./GConfX.idl
Error: Empty file

** (orbit-idl-2:21457): WARNING **: ./GConfX.idl compilation failed
make[2]: *** [GConfX-skels.c] Error 1
make[2]: *** Waiting for unfinished jobs....
Error: Empty file

** (orbit-idl-2:21456): WARNING **: ./GConfX.idl compilation failed
make[2]: *** [GConfX-common.c] Error 1
make[2]: Leaving directory `/var/tmp/portage/gnome-base/gconf-2.20.1/work/GConf-2.20.1/gconf'
make[1]: *** [all-recursive] Error 1
make[1]: Leaving directory `/var/tmp/portage/gnome-base/gconf-2.20.1/work/GConf-2.20.1'
make: *** [all] Error 2
 * 
 * ERROR: gnome-base/gconf-2.20.1 failed.
 * Call stack:
 *       ebuild.sh, line 1701:  Called dyn_compile
 *       ebuild.sh, line 1039:  Called qa_call 'src_compile'
 *       ebuild.sh, line   44:  Called src_compile
 *       ebuild.sh, line 1383:  Called gnome2_src_compile
 *   gnome2.eclass, line   71:  Called die
 * The specific snippet of code:
 *      emake || die "compile failure"
 *  The die message:
 *   compile failure
 * 
 * If you need support, post the topmost build error, and the call stack if relevant.
 * A complete build log is located at '/var/tmp/portage/gnome-base/gconf-2.20.1/temp/build.log'.
 * 

 * Messages for package gnome-base/gconf-2.20.1:

 * 
 * ERROR: gnome-base/gconf-2.20.1 failed.
 * Call stack:
 *       ebuild.sh, line 1701:  Called dyn_compile
 *       ebuild.sh, line 1039:  Called qa_call 'src_compile'
 *       ebuild.sh, line   44:  Called src_compile
 *       ebuild.sh, line 1383:  Called gnome2_src_compile
 *   gnome2.eclass, line   71:  Called die
 * The specific snippet of code:
 *      emake || die "compile failure"
 *  The die message:
 *   compile failure
 * 
 * If you need support, post the topmost build error, and the call stack if relevant.
 * A complete build log is located at '/var/tmp/portage/gnome-base/gconf-2.20.1/temp/build.log'.
 *