All pastes #798674 Raw Edit

Unnamed

public text v1 · immutable
#798674 ·published 2007-11-26 22:59 UTC
rendered paste body

C:\test\archivesAnt>echo %JAVA_HOME%
C:\Program Files\Java\jdk1.6.0_02

C:\test\archivesAnt>ant -v
Apache Ant version 1.6.5 compiled on June 2 2005
Buildfile: build.xml
Detected Java version: 1.5 in: C:\Program Files\Java\jdk1.6.0_02\jre
Detected OS: Windows XP
parsing buildfile C:\test\archivesAnt\build.xml with URI = file:///C:/test/archi
vesAnt/build.xml
Project base dir set to: C:\test\archivesAnt
Build sequence for target(s) `begin' is [begin]
Complete build sequence is [begin, ]

begin:
     [echo]  Hello World!
[GenerateArchives] schema is jar:file:/C:/test/archivesAnt/plugins/archivescore.
jar!/packages.xsd
[GenerateArchives] schema tostring is jar:file:/C:/test/archivesAnt/plugins/arch
ivescore.jar!/packages.xsd
[GenerateArchives] stream is sun.net.www.protocol.jar.JarURLConnection$JarURLInp
utStream@4f459c

BUILD FAILED
C:\test\archivesAnt\build.xml:15: java.lang.IllegalStateException: Failed to cre
ate schema loader: org.apache.xerces.dom.DOMXSImplementationSourceImpl cannot be
 cast to org.w3c.dom.DOMImplementationSource
        at org.apache.tools.ant.Task.perform(Task.java:373)
        at org.apache.tools.ant.Target.execute(Target.java:341)
        at org.apache.tools.ant.Target.performTasks(Target.java:369)
        at org.apache.tools.ant.Project.executeSortedTargets(Project.java:1216)
        at org.apache.tools.ant.Project.executeTarget(Project.java:1185)
        at org.apache.tools.ant.helper.DefaultExecutor.executeTargets(DefaultExe
cutor.java:40)
        at org.apache.tools.ant.Project.executeTargets(Project.java:1068)
        at org.apache.tools.ant.Main.runBuild(Main.java:668)
        at org.apache.tools.ant.Main.startAnt(Main.java:187)
        at org.apache.tools.ant.launch.Launcher.run(Launcher.java:246)
        at org.apache.tools.ant.launch.Launcher.main(Launcher.java:67)
Caused by: java.lang.IllegalStateException: Failed to create schema loader: org.
apache.xerces.dom.DOMXSImplementationSourceImpl cannot be cast to org.w3c.dom.DO
MImplementationSource
        at org.jboss.xb.binding.sunday.unmarshalling.XsdBinder.getXSImplementati
on(XsdBinder.java:972)
        at org.jboss.xb.binding.sunday.unmarshalling.XsdBinder.loadSchema(XsdBin
der.java:917)
        at org.jboss.xb.binding.sunday.unmarshalling.XsdBinder.bind(XsdBinder.ja
va:112)
        at org.jboss.ide.eclipse.archives.core.model.internal.xb.XMLBinding.init
(XMLBinding.java:75)
        at org.jboss.ide.eclipse.archives.core.model.internal.xb.XMLBinding.unma
rshal(XMLBinding.java:101)
        at org.jboss.ide.eclipse.archives.core.model.ArchivesModel.registerProje
ct(ArchivesModel.java:237)
        at org.jboss.ide.eclipse.archives.core.ant.GenerateArchivesTask.execute(
GenerateArchivesTask.java:43)
        at org.apache.tools.ant.UnknownElement.execute(UnknownElement.java:275)
        at org.apache.tools.ant.Task.perform(Task.java:364)
        ... 10 more
--- Nested Exception ---
java.lang.IllegalStateException: Failed to create schema loader: org.apache.xerc
es.dom.DOMXSImplementationSourceImpl cannot be cast to org.w3c.dom.DOMImplementa
tionSource
        at org.jboss.xb.binding.sunday.unmarshalling.XsdBinder.getXSImplementati
on(XsdBinder.java:972)
        at org.jboss.xb.binding.sunday.unmarshalling.XsdBinder.loadSchema(XsdBin
der.java:917)
        at org.jboss.xb.binding.sunday.unmarshalling.XsdBinder.bind(XsdBinder.ja
va:112)
        at org.jboss.ide.eclipse.archives.core.model.internal.xb.XMLBinding.init
(XMLBinding.java:75)
        at org.jboss.ide.eclipse.archives.core.model.internal.xb.XMLBinding.unma
rshal(XMLBinding.java:101)
        at org.jboss.ide.eclipse.archives.core.model.ArchivesModel.registerProje
ct(ArchivesModel.java:237)
        at org.jboss.ide.eclipse.archives.core.ant.GenerateArchivesTask.execute(
GenerateArchivesTask.java:43)
        at org.apache.tools.ant.UnknownElement.execute(UnknownElement.java:275)
        at org.apache.tools.ant.Task.perform(Task.java:364)
        at org.apache.tools.ant.Target.execute(Target.java:341)
        at org.apache.tools.ant.Target.performTasks(Target.java:369)
        at org.apache.tools.ant.Project.executeSortedTargets(Project.java:1216)
        at org.apache.tools.ant.Project.executeTarget(Project.java:1185)
        at org.apache.tools.ant.helper.DefaultExecutor.executeTargets(DefaultExe
cutor.java:40)
        at org.apache.tools.ant.Project.executeTargets(Project.java:1068)
        at org.apache.tools.ant.Main.runBuild(Main.java:668)
        at org.apache.tools.ant.Main.startAnt(Main.java:187)
        at org.apache.tools.ant.launch.Launcher.run(Launcher.java:246)
        at org.apache.tools.ant.launch.Launcher.main(Launcher.java:67)

Total time: 0 seconds
C:\test\archivesAnt>