CompileC "build/Transmission.build/Release - Debug/Transmission.build/Objects-normal/ppc/StatsWindowController.o" /var/tmp/transmission.m0k.org/trunk/macosx/StatsWindowController.m normal ppc objective-c com.apple.compilers.gcc.4_0
cd /var/tmp/transmission.m0k.org/trunk
/Developer/usr/bin/gcc-4.0 -x objective-c -arch ppc -pipe -Wno-trigraphs -fpascal-strings -fasm-blocks -Os -mdynamic-no-pic -fmessage-length=0 -mtune=G4 -fvisibility=hidden -mmacosx-version-min=10.4 "-I/var/tmp/transmission.m0k.org/trunk/build/Transmission.build/Release
- Debug/Transmission.build/Transmission.hmap" "-F/var/tmp/transmission.m0k.org/trunk/build/Release - Debug" -Fmacosx "-I/var/tmp/transmission.m0k.org/trunk/build/Release - Debug/include" "-I/var/tmp/transmission.m0k.org/trunk/build/Transmission.build/Release - Debug/Transmis
sion.build/DerivedSources" -isysroot /Developer/SDKs/MacOSX10.5.sdk -include /Library/Caches/com.apple.Xcode.501/SharedPrecompiledHeaders/Transmission_Prefix-dsypbjeshhnqcwepvlmyggvkvyrh/Transmission_Prefix.pch -c /var/tmp/transmission.m0k.org/trunk/macosx/StatsWindowControl
ler.m -o "/var/tmp/transmission.m0k.org/trunk/build/Transmission.build/Release - Debug/Transmission.build/Objects-normal/ppc/StatsWindowController.o"
/var/tmp/transmission.m0k.org/trunk/macosx/StatsWindowController.m: In function '-[StatsWindowController(Private) updateStats]':
/var/tmp/transmission.m0k.org/trunk/macosx/StatsWindowController.m:82: error: 'tr_session_stats' has no member named 'uploadedGigs'
/var/tmp/transmission.m0k.org/trunk/macosx/StatsWindowController.m:82: error: 'tr_session_stats' has no member named 'uploadedBytes'
/var/tmp/transmission.m0k.org/trunk/macosx/StatsWindowController.m:83: error: 'tr_session_stats' has no member named 'uploadedGigs'
/var/tmp/transmission.m0k.org/trunk/macosx/StatsWindowController.m:83: error: 'tr_session_stats' has no member named 'uploadedBytes'
/var/tmp/transmission.m0k.org/trunk/macosx/StatsWindowController.m:86: error: 'tr_session_stats' has no member named 'downloadedGigs'
/var/tmp/transmission.m0k.org/trunk/macosx/StatsWindowController.m:87: error: 'tr_session_stats' has no member named 'downloadedBytes'
/var/tmp/transmission.m0k.org/trunk/macosx/StatsWindowController.m:88: error: 'tr_session_stats' has no member named 'downloadedGigs'
/var/tmp/transmission.m0k.org/trunk/macosx/StatsWindowController.m:89: error: 'tr_session_stats' has no member named 'downloadedBytes'
** BUILD FAILED **