rendered paste bodycc -DHAVE_CONFIG_H -I. -I/home/buz/bin/kdebase/kdebase-3.5.8/./ksysguard/ksysguardd/Linux -I../../.. -I/home/buz/bin/kdebase/kdebase-3.5.8/./ksysguard/ksysguardd/Linux/../../CContLib -I/home/buz/bin/kdebase/kdebase-3.5.8/./ksysguard/ksysguardd/Linux/.. -I/usr/include/kde -I/usr/share/qt3/include -I. -I/usr/include/sasl -D_GNU_SOURCE -DQT_THREAD_SUPPORT -D_REENTRANT -D_FILE_OFFSET_BITS=64 -D_LARGE_FILES=1 -Wall -std=iso9899:1990 -W -Wall -Wchar-subscripts -Wshadow -Wpointer-arith -Wmissing-prototypes -Wwrite-strings -D_XOPEN_SOURCE=500 -D_BSD_SOURCE -DNDEBUG -O2 -g -Wall -O2 -Wformat-security -Wmissing-format-attribute -D_GNU_SOURCE -c /home/buz/bin/kdebase/kdebase-3.5.8/./ksysguard/ksysguardd/Linux/acpi.c
/home/buz/bin/kdebase/kdebase-3.5.8/./ksysguard/ksysguardd/Linux/acpi.c: In function ‘printThermalZoneTemperatureInfo’:
/home/buz/bin/kdebase/kdebase-3.5.8/./ksysguard/ksysguardd/Linux/acpi.c:322: warning: unused parameter ‘cmd’
/home/buz/bin/kdebase/kdebase-3.5.8/./ksysguard/ksysguardd/Linux/acpi.c: In function ‘printFanStateInfo’:
/home/buz/bin/kdebase/kdebase-3.5.8/./ksysguard/ksysguardd/Linux/acpi.c:413: warning: unused parameter ‘cmd’
cc -DHAVE_CONFIG_H -I. -I/home/buz/bin/kdebase/kdebase-3.5.8/./ksysguard/ksysguardd/Linux -I../../.. -I/home/buz/bin/kdebase/kdebase-3.5.8/./ksysguard/ksysguardd/Linux/../../CContLib -I/home/buz/bin/kdebase/kdebase-3.5.8/./ksysguard/ksysguardd/Linux/.. -I/usr/include/kde -I/usr/share/qt3/include -I. -I/usr/include/sasl -D_GNU_SOURCE -DQT_THREAD_SUPPORT -D_REENTRANT -D_FILE_OFFSET_BITS=64 -D_LARGE_FILES=1 -Wall -std=iso9899:1990 -W -Wall -Wchar-subscripts -Wshadow -Wpointer-arith -Wmissing-prototypes -Wwrite-strings -D_XOPEN_SOURCE=500 -D_BSD_SOURCE -DNDEBUG -O2 -g -Wall -O2 -Wformat-security -Wmissing-format-attribute -D_GNU_SOURCE -c /home/buz/bin/kdebase/kdebase-3.5.8/./ksysguard/ksysguardd/Linux/loadavg.c
cc -DHAVE_CONFIG_H -I. -I/home/buz/bin/kdebase/kdebase-3.5.8/./ksysguard/ksysguardd/Linux -I../../.. -I/home/buz/bin/kdebase/kdebase-3.5.8/./ksysguard/ksysguardd/Linux/../../CContLib -I/home/buz/bin/kdebase/kdebase-3.5.8/./ksysguard/ksysguardd/Linux/.. -I/usr/include/kde -I/usr/share/qt3/include -I. -I/usr/include/sasl -D_GNU_SOURCE -DQT_THREAD_SUPPORT -D_REENTRANT -D_FILE_OFFSET_BITS=64 -D_LARGE_FILES=1 -Wall -std=iso9899:1990 -W -Wall -Wchar-subscripts -Wshadow -Wpointer-arith -Wmissing-prototypes -Wwrite-strings -D_XOPEN_SOURCE=500 -D_BSD_SOURCE -DNDEBUG -O2 -g -Wall -O2 -Wformat-security -Wmissing-format-attribute -D_GNU_SOURCE -c /home/buz/bin/kdebase/kdebase-3.5.8/./ksysguard/ksysguardd/Linux/cpuinfo.c
cc -DHAVE_CONFIG_H -I. -I/home/buz/bin/kdebase/kdebase-3.5.8/./ksysguard/ksysguardd/Linux -I../../.. -I/home/buz/bin/kdebase/kdebase-3.5.8/./ksysguard/ksysguardd/Linux/../../CContLib -I/home/buz/bin/kdebase/kdebase-3.5.8/./ksysguard/ksysguardd/Linux/.. -I/usr/include/kde -I/usr/share/qt3/include -I. -I/usr/include/sasl -D_GNU_SOURCE -DQT_THREAD_SUPPORT -D_REENTRANT -D_FILE_OFFSET_BITS=64 -D_LARGE_FILES=1 -Wall -std=iso9899:1990 -W -Wall -Wchar-subscripts -Wshadow -Wpointer-arith -Wmissing-prototypes -Wwrite-strings -D_XOPEN_SOURCE=500 -D_BSD_SOURCE -DNDEBUG -O2 -g -Wall -O2 -Wformat-security -Wmissing-format-attribute -D_GNU_SOURCE -c /home/buz/bin/kdebase/kdebase-3.5.8/./ksysguard/ksysguardd/Linux/lmsensors.c
/home/buz/bin/kdebase/kdebase-3.5.8/./ksysguard/ksysguardd/Linux/lmsensors.c:39: error: expected ‘:’, ‘,’, ‘;’, ‘}’ or ‘__attribute__’ before ‘*’ token
/home/buz/bin/kdebase/kdebase-3.5.8/./ksysguard/ksysguardd/Linux/lmsensors.c: In function ‘initLmSensors’:
/home/buz/bin/kdebase/kdebase-3.5.8/./ksysguard/ksysguardd/Linux/lmsensors.c:88: warning: passing argument 1 of ‘sensors_get_detected_chips’ from incompatible pointer type
/home/buz/bin/kdebase/kdebase-3.5.8/./ksysguard/ksysguardd/Linux/lmsensors.c:88: error: too few arguments to function ‘sensors_get_detected_chips’
/home/buz/bin/kdebase/kdebase-3.5.8/./ksysguard/ksysguardd/Linux/lmsensors.c:90: error: expected ‘=’, ‘,’, ‘;’, ‘asm’ or ‘__attribute__’ before ‘*’ token
/home/buz/bin/kdebase/kdebase-3.5.8/./ksysguard/ksysguardd/Linux/lmsensors.c:90: error: ‘sfd’ undeclared (first use in this function)
/home/buz/bin/kdebase/kdebase-3.5.8/./ksysguard/ksysguardd/Linux/lmsensors.c:90: error: (Each undeclared identifier is reported only once
/home/buz/bin/kdebase/kdebase-3.5.8/./ksysguard/ksysguardd/Linux/lmsensors.c:90: error: for each function it appears in.)
/home/buz/bin/kdebase/kdebase-3.5.8/./ksysguard/ksysguardd/Linux/lmsensors.c:92: warning: implicit declaration of function ‘sensors_get_all_features’
/home/buz/bin/kdebase/kdebase-3.5.8/./ksysguard/ksysguardd/Linux/lmsensors.c:93: error: ‘SENSORS_NO_MAPPING’ undeclared (first use in this function)
/home/buz/bin/kdebase/kdebase-3.5.8/./ksysguard/ksysguardd/Linux/lmsensors.c:98: error: incompatible type for argument 1 of ‘sensors_get_label’
/home/buz/bin/kdebase/kdebase-3.5.8/./ksysguard/ksysguardd/Linux/lmsensors.c:98: error: too many arguments to function ‘sensors_get_label’
/home/buz/bin/kdebase/kdebase-3.5.8/./ksysguard/ksysguardd/Linux/lmsensors.c:112: error: ‘LMSENSOR’ has no member named ‘sfd’
/home/buz/bin/kdebase/kdebase-3.5.8/./ksysguard/ksysguardd/Linux/lmsensors.c: In function ‘printLmSensor’:
/home/buz/bin/kdebase/kdebase-3.5.8/./ksysguard/ksysguardd/Linux/lmsensors.c:141: warning: implicit declaration of function ‘sensors_get_feature’
/home/buz/bin/kdebase/kdebase-3.5.8/./ksysguard/ksysguardd/Linux/lmsensors.c:141: error: ‘LMSENSOR’ has no member named ‘sfd’
make[5]: *** [lmsensors.o] Error 1
make[5]: Leaving directory `/home/buz/bin/kdebase/kdebase-3.5.8/obj-i486-linux-gnu/ksysguard/ksysguardd/Linux'
make[4]: *** [all-recursive] Error 1
make[4]: Leaving directory `/home/buz/bin/kdebase/kdebase-3.5.8/obj-i486-linux-gnu/ksysguard/ksysguardd'
make[3]: *** [all-recursive] Error 1
make[3]: Leaving directory `/home/buz/bin/kdebase/kdebase-3.5.8/obj-i486-linux-gnu/ksysguard'
make[2]: *** [all-recursive] Error 1
make[2]: Leaving directory `/home/buz/bin/kdebase/kdebase-3.5.8/obj-i486-linux-gnu'
make[1]: *** [all] Error 2
make[1]: Leaving directory `/home/buz/bin/kdebase/kdebase-3.5.8/obj-i486-linux-gnu'
make: *** [debian/stamp-makefile-build] Error 2
debuild: fatal error at line 1247:
debian/rules build failed
(reverse-i-search)`p': patch -p1 < ../kdebase_3.5.8-1ubuntu2.diff