All pastes #797694 Raw Edit

Untitled

public text v1 · immutable
#797694 ·published 2007-11-26 04:52 UTC
rendered paste body
rm -f ../../exports/lib/libXdmcp.a
cd ../../exports/lib && ln -s ../../lib/Xdmcp/libXdmcp.a .
make[4]: Leaving directory `/var/tmp/portage/x11-base/kdrive-4.3.0-r5/work/xc/lib/Xdmcp'
making all in lib/Xi...
make[4]: Entering directory `/var/tmp/portage/x11-base/kdrive-4.3.0-r5/work/xc/lib/Xi'
rm -f XAllowDv.o
gcc -m32 -c -O2 -march=prescott -pipe -fomit-frame-pointer      -I../.. -I../../exports/include -I/usr/X11R6/include  -Dlinux -D__i386__ -D_POSIX_C_SOURCE=199309L 				-D_POSIX_SOURCE -D_XOPEN_SOURCE 				-D_BSD_SOURCE -D_SVID_SOURCE 				 -D_GNU_SOURCE 				  -DFUNCPROTO=15 -DNARROWPROTO -DXTHREADS  -D_REENTRANT -DXUSE_MTSAFE_API    -DMALLOC_0_RETURNS_NULL     -fPIC XAllowDv.c
In file included from /usr/include/X11/Xlibint.h:44,
                 from XAllowDv.c:59:
/usr/include/X11/Xlib.h: In function 'XSetOMValues':
/usr/include/X11/Xlib.h:3573: error: expected declaration specifiers before '_X_SENTINEL'
/usr/include/X11/Xlib.h:3578: error: expected '=', ',', ';', 'asm' or '__attribute__' before '_X_SENTINEL'
/usr/include/X11/Xlib.h:3582: error: storage class specified for parameter 'XDisplayOfOM'
/usr/include/X11/Xlib.h:3586: error: storage class specified for parameter 'XLocaleOfOM'
/usr/include/X11/Xlib.h:3591: error: expected '=', ',', ';', 'asm' or '__attribute__' before '_X_SENTINEL'
/usr/include/X11/Xlib.h:3595: error: storage class specified for parameter 'XDestroyOC'
/usr/include/X11/Xlib.h:3599: error: storage class specified for parameter 'XOMOfOC'
/usr/include/X11/Xlib.h:3604: error: expected '=', ',', ';', 'asm' or '__attribute__' before '_X_SENTINEL'
/usr/include/X11/Xlib.h:3609: error: expected '=', ',', ';', 'asm' or '__attribute__' before '_X_SENTINEL'
/usr/include/X11/Xlib.h:3617: error: storage class specified for parameter 'XCreateFontSet'
/usr/include/X11/Xlib.h:3622: error: storage class specified for parameter 'XFreeFontSet'
/usr/include/X11/Xlib.h:3628: error: storage class specified for parameter 'XFontsOfFontSet'
/usr/include/X11/Xlib.h:3632: error: storage class specified for parameter 'XBaseFontNameListOfFontSet'
/usr/include/X11/Xlib.h:3636: error: storage class specified for parameter 'XLocaleOfFontSet'
/usr/include/X11/Xlib.h:3640: error: storage class specified for parameter 'XContextDependentDrawing'
/usr/include/X11/Xlib.h:3644: error: storage class specified for parameter 'XDirectionalDependentDrawing'
/usr/include/X11/Xlib.h:3648: error: storage class specified for parameter 'XContextualDrawing'
/usr/include/X11/Xlib.h:3652: error: storage class specified for parameter 'XExtentsOfFontSet'
/usr/include/X11/Xlib.h:3658: error: storage class specified for parameter 'XmbTextEscapement'
/usr/include/X11/Xlib.h:3664: error: storage class specified for parameter 'XwcTextEscapement'
/usr/include/X11/Xlib.h:3670: error: storage class specified for parameter 'Xutf8TextEscapement'
/usr/include/X11/Xlib.h:3678: error: storage class specified for parameter 'XmbTextExtents'
/usr/include/X11/Xlib.h:3686: error: storage class specified for parameter 'XwcTextExtents'
/usr/include/X11/Xlib.h:3694: error: storage class specified for parameter 'Xutf8TextExtents'
/usr/include/X11/Xlib.h:3706: error: storage class specified for parameter 'XmbTextPerCharExtents'
/usr/include/X11/Xlib.h:3718: error: storage class specified for parameter 'XwcTextPerCharExtents'
/usr/include/X11/Xlib.h:3730: error: storage class specified for parameter 'Xutf8TextPerCharExtents'
/usr/include/X11/Xlib.h:3740: error: storage class specified for parameter 'XmbDrawText'
/usr/include/X11/Xlib.h:3750: error: storage class specified for parameter 'XwcDrawText'
/usr/include/X11/Xlib.h:3760: error: storage class specified for parameter 'Xutf8DrawText'
/usr/include/X11/Xlib.h:3771: error: storage class specified for parameter 'XmbDrawString'
/usr/include/X11/Xlib.h:3782: error: storage class specified for parameter 'XwcDrawString'
/usr/include/X11/Xlib.h:3793: error: storage class specified for parameter 'Xutf8DrawString'
/usr/include/X11/Xlib.h:3804: error: storage class specified for parameter 'XmbDrawImageString'
/usr/include/X11/Xlib.h:3815: error: storage class specified for parameter 'XwcDrawImageString'
/usr/include/X11/Xlib.h:3826: error: storage class specified for parameter 'Xutf8DrawImageString'
/usr/include/X11/Xlib.h:3833: error: storage class specified for parameter 'XOpenIM'
/usr/include/X11/Xlib.h:3837: error: storage class specified for parameter 'XCloseIM'
/usr/include/X11/Xlib.h:3841: error: expected '=', ',', ';', 'asm' or '__attribute__' before '_X_SENTINEL'
/usr/include/X11/Xlib.h:3845: error: expected '=', ',', ';', 'asm' or '__attribute__' before '_X_SENTINEL'
/usr/include/X11/Xlib.h:3849: error: storage class specified for parameter 'XDisplayOfIM'
/usr/include/X11/Xlib.h:3853: error: storage class specified for parameter 'XLocaleOfIM'
/usr/include/X11/Xlib.h:3857: error: expected '=', ',', ';', 'asm' or '__attribute__' before '_X_SENTINEL'
/usr/include/X11/Xlib.h:3861: error: storage class specified for parameter 'XDestroyIC'
/usr/include/X11/Xlib.h:3865: error: storage class specified for parameter 'XSetICFocus'
/usr/include/X11/Xlib.h:3869: error: storage class specified for parameter 'XUnsetICFocus'
/usr/include/X11/Xlib.h:3873: error: storage class specified for parameter 'XwcResetIC'
/usr/include/X11/Xlib.h:3877: error: storage class specified for parameter 'XmbResetIC'
/usr/include/X11/Xlib.h:3881: error: storage class specified for parameter 'Xutf8ResetIC'
/usr/include/X11/Xlib.h:3885: error: expected '=', ',', ';', 'asm' or '__attribute__' before '_X_SENTINEL'
/usr/include/X11/Xlib.h:3889: error: expected '=', ',', ';', 'asm' or '__attribute__' before '_X_SENTINEL'
/usr/include/X11/Xlib.h:3893: error: storage class specified for parameter 'XIMOfIC'
/usr/include/X11/Xlib.h:3898: error: storage class specified for parameter 'XFilterEvent'
/usr/include/X11/Xlib.h:3907: error: storage class specified for parameter 'XmbLookupString'
/usr/include/X11/Xlib.h:3916: error: storage class specified for parameter 'XwcLookupString'
/usr/include/X11/Xlib.h:3925: error: storage class specified for parameter 'Xutf8LookupString'
/usr/include/X11/Xlib.h:3929: error: expected '=', ',', ';', 'asm' or '__attribute__' before '_X_SENTINEL'
/usr/include/X11/Xlib.h:3940: error: storage class specified for parameter 'XRegisterIMInstantiateCallback'
/usr/include/X11/Xlib.h:3949: error: storage class specified for parameter 'XUnregisterIMInstantiateCallback'
/usr/include/X11/Xlib.h:3957: error: storage class specified for parameter 'XConnectionWatchProc'
/usr/include/X11/Xlib.h:3964: error: storage class specified for parameter 'XInternalConnectionNumbers'
/usr/include/X11/Xlib.h:3969: error: storage class specified for parameter 'XProcessInternalConnection'
/usr/include/X11/Xlib.h:3973: error: expected declaration specifiers or '...' before 'XConnectionWatchProc'
/usr/include/X11/Xlib.h:3975: error: storage class specified for parameter 'XAddConnectionWatch'
/usr/include/X11/Xlib.h:3979: error: expected declaration specifiers or '...' before 'XConnectionWatchProc'
/usr/include/X11/Xlib.h:3981: error: storage class specified for parameter 'XRemoveConnectionWatch'
/usr/include/X11/Xlib.h:3988: error: storage class specified for parameter 'XSetAuthorization'
/usr/include/X11/Xlib.h:3999: error: storage class specified for parameter '_Xmbtowc'
/usr/include/X11/Xlib.h:4004: error: storage class specified for parameter '_Xwctomb'
In file included from XAllowDv.c:59:
/usr/include/X11/Xlibint.h:208: error: storage class specified for parameter '_XQEvent'
In file included from /usr/include/errno.h:37,
                 from /usr/include/X11/Xlibint.h:222,
                 from XAllowDv.c:59:
/usr/include/bits/errno.h:43: error: storage class specified for parameter '__errno_location'
In file included from /usr/include/X11/Xlibint.h:222,
                 from XAllowDv.c:59:
/usr/include/errno.h:55: error: storage class specified for parameter 'program_invocation_name'
/usr/include/errno.h:55: error: storage class specified for parameter 'program_invocation_short_name'
/usr/include/errno.h:69: error: storage class specified for parameter 'error_t'
In file included from ../../exports/include/X11/Xfuncs.h:50,
                 from /usr/include/X11/Xlibint.h:224,
                 from XAllowDv.c:59:
/usr/include/string.h:40: error: storage class specified for parameter 'memcpy'
/usr/include/string.h:44: error: storage class specified for parameter 'memmove'
/usr/include/string.h:53: error: storage class specified for parameter 'memccpy'
/usr/include/string.h:59: error: storage class specified for parameter 'memset'
/usr/include/string.h:63: error: storage class specified for parameter 'memcmp'
/usr/include/string.h:67: error: storage class specified for parameter 'memchr'
/usr/include/string.h:74: error: storage class specified for parameter 'rawmemchr'
/usr/include/string.h:78: error: storage class specified for parameter 'memrchr'
/usr/include/string.h:85: error: storage class specified for parameter 'strcpy'
/usr/include/string.h:89: error: storage class specified for parameter 'strncpy'
/usr/include/string.h:93: error: storage class specified for parameter 'strcat'
/usr/include/string.h:96: error: storage class specified for parameter 'strncat'
/usr/include/string.h:100: error: storage class specified for parameter 'strcmp'
/usr/include/string.h:103: error: storage class specified for parameter 'strncmp'
/usr/include/string.h:107: error: storage class specified for parameter 'strcoll'
/usr/include/string.h:111: error: storage class specified for parameter 'strxfrm'
In file included from /usr/include/string.h:119,
                 from ../../exports/include/X11/Xfuncs.h:50,
                 from /usr/include/X11/Xlibint.h:224,
                 from XAllowDv.c:59:
/usr/include/xlocale.h:40: error: storage class specified for parameter '__locale_t'
In file included from ../../exports/include/X11/Xfuncs.h:50,
                 from /usr/include/X11/Xlibint.h:224,
                 from XAllowDv.c:59:
/usr/include/string.h:121: error: expected declaration specifiers or '...' before '__locale_t'
/usr/include/string.h:122: error: storage class specified for parameter 'strcoll_l'
/usr/include/string.h:122: error: nonnull argument with out-of-range operand number (argument 1, operand 3)
/usr/include/string.h:125: error: expected declaration specifiers or '...' before '__locale_t'
/usr/include/string.h:125: error: storage class specified for parameter 'strxfrm_l'
/usr/include/string.h:125: error: nonnull argument with out-of-range operand number (argument 1, operand 4)
/usr/include/string.h:131: error: storage class specified for parameter 'strdup'
/usr/include/string.h:139: error: storage class specified for parameter 'strndup'
/usr/include/string.h:168: error: storage class specified for parameter 'strchr'
/usr/include/string.h:171: error: storage class specified for parameter 'strrchr'
/usr/include/string.h:178: error: storage class specified for parameter 'strchrnul'
/usr/include/string.h:185: error: storage class specified for parameter 'strcspn'
/usr/include/string.h:189: error: storage class specified for parameter 'strspn'
/usr/include/string.h:192: error: storage class specified for parameter 'strpbrk'
/usr/include/string.h:195: error: storage class specified for parameter 'strstr'
/usr/include/string.h:200: error: storage class specified for parameter 'strtok'
/usr/include/string.h:208: error: storage class specified for parameter '__strtok_r'
/usr/include/string.h:212: error: storage class specified for parameter 'strtok_r'
/usr/include/string.h:218: error: storage class specified for parameter 'strcasestr'
/usr/include/string.h:227: error: storage class specified for parameter 'memmem'
/usr/include/string.h:233: error: storage class specified for parameter '__mempcpy'
/usr/include/string.h:236: error: storage class specified for parameter 'mempcpy'
/usr/include/string.h:243: error: storage class specified for parameter 'strlen'
/usr/include/string.h:250: error: storage class specified for parameter 'strnlen'
/usr/include/string.h:256: error: storage class specified for parameter 'strerror'
/usr/include/string.h:282: error: storage class specified for parameter 'strerror_r'
/usr/include/string.h:288: error: expected declaration specifiers or '...' before '__locale_t'
/usr/include/string.h:288: error: storage class specified for parameter 'strerror_l'
/usr/include/string.h:294: error: storage class specified for parameter '__bzero'
/usr/include/string.h:299: error: storage class specified for parameter 'bcopy'
/usr/include/string.h:302: error: storage class specified for parameter 'bzero'
/usr/include/string.h:306: error: storage class specified for parameter 'bcmp'
/usr/include/string.h:310: error: storage class specified for parameter 'index'
/usr/include/string.h:314: error: storage class specified for parameter 'rindex'
/usr/include/string.h:318: error: storage class specified for parameter 'ffs'
/usr/include/string.h:323: error: storage class specified for parameter 'ffsl'
/usr/include/string.h:325: error: expected declaration specifiers before '__extension__'
/usr/include/string.h:332: error: storage class specified for parameter 'strcasecmp'
/usr/include/string.h:336: error: storage class specified for parameter 'strncasecmp'
/usr/include/string.h:343: error: expected declaration specifiers or '...' before '__locale_t'
/usr/include/string.h:344: error: storage class specified for parameter 'strcasecmp_l'
/usr/include/string.h:344: error: nonnull argument with out-of-range operand number (argument 1, operand 3)
/usr/include/string.h:347: error: expected declaration specifiers or '...' before '__locale_t'
/usr/include/string.h:348: error: storage class specified for parameter 'strncasecmp_l'
/usr/include/string.h:348: error: nonnull argument with out-of-range operand number (argument 1, operand 4)
/usr/include/string.h:356: error: storage class specified for parameter 'strsep'
/usr/include/string.h:362: error: storage class specified for parameter 'strverscmp'
/usr/include/string.h:365: error: storage class specified for parameter 'strsignal'
/usr/include/string.h:369: error: storage class specified for parameter '__stpcpy'
/usr/include/string.h:371: error: storage class specified for parameter 'stpcpy'
/usr/include/string.h:377: error: storage class specified for parameter '__stpncpy'
/usr/include/string.h:380: error: storage class specified for parameter 'stpncpy'
/usr/include/string.h:383: error: storage class specified for parameter 'strfry'
/usr/include/string.h:386: error: storage class specified for parameter 'memfrob'
/usr/include/string.h:393: error: storage class specified for parameter 'basename'
In file included from /usr/include/string.h:424,
                 from ../../exports/include/X11/Xfuncs.h:50,
                 from /usr/include/X11/Xlibint.h:224,
                 from XAllowDv.c:59:
/usr/include/bits/string2.h:394: error: storage class specified for parameter '__rawmemchr'
/usr/include/bits/string2.h:969: error: storage class specified for parameter '__strcspn_c1'
/usr/include/bits/string2.h:972: error: expected '=', ',', ';', 'asm' or '__attribute__' before '{' token
/usr/include/bits/string2.h:980: error: storage class specified for parameter '__strcspn_c2'
/usr/include/bits/string2.h:983: error: expected '=', ',', ';', 'asm' or '__attribute__' before '{' token
/usr/include/bits/string2.h:992: error: storage class specified for parameter '__strcspn_c3'
/usr/include/bits/string2.h:996: error: expected '=', ',', ';', 'asm' or '__attribute__' before '{' token
/usr/include/bits/string2.h:1045: error: storage class specified for parameter '__strspn_c1'
/usr/include/bits/string2.h:1048: error: expected '=', ',', ';', 'asm' or '__attribute__' before '{' token
/usr/include/bits/string2.h:1057: error: storage class specified for parameter '__strspn_c2'
/usr/include/bits/string2.h:1060: error: expected '=', ',', ';', 'asm' or '__attribute__' before '{' token
/usr/include/bits/string2.h:1069: error: storage class specified for parameter '__strspn_c3'
/usr/include/bits/string2.h:1072: error: expected '=', ',', ';', 'asm' or '__attribute__' before '{' token
/usr/include/bits/string2.h:1122: error: storage class specified for parameter '__strpbrk_c2'
/usr/include/bits/string2.h:1125: error: expected '=', ',', ';', 'asm' or '__attribute__' before '{' token
/usr/include/bits/string2.h:1133: error: storage class specified for parameter '__strpbrk_c3'
/usr/include/bits/string2.h:1137: error: expected '=', ',', ';', 'asm' or '__attribute__' before '{' token
/usr/include/bits/string2.h:1173: error: storage class specified for parameter '__strtok_r_1c'
/usr/include/bits/string2.h:1176: error: expected '=', ',', ';', 'asm' or '__attribute__' before '{' token
/usr/include/bits/string2.h:1205: error: storage class specified for parameter '__strsep_g'
/usr/include/bits/string2.h:1223: error: storage class specified for parameter '__strsep_1c'
/usr/include/bits/string2.h:1226: error: expected '=', ',', ';', 'asm' or '__attribute__' before '{' token
/usr/include/bits/string2.h:1233: error: storage class specified for parameter '__strsep_2c'
/usr/include/bits/string2.h:1236: error: expected '=', ',', ';', 'asm' or '__attribute__' before '{' token
/usr/include/bits/string2.h:1261: error: storage class specified for parameter '__strsep_3c'
/usr/include/bits/string2.h:1264: error: expected '=', ',', ';', 'asm' or '__attribute__' before '{' token
In file included from /usr/include/bits/string2.h:1300,
                 from /usr/include/string.h:424,
                 from ../../exports/include/X11/Xfuncs.h:50,
                 from /usr/include/X11/Xlibint.h:224,
                 from XAllowDv.c:59:
/usr/include/stdlib.h:589: error: storage class specified for parameter 'malloc'
/usr/include/stdlib.h:592: error: storage class specified for parameter 'calloc'
In file included from /usr/include/string.h:424,
                 from ../../exports/include/X11/Xfuncs.h:50,
                 from /usr/include/X11/Xlibint.h:224,
                 from XAllowDv.c:59:
/usr/include/bits/string2.h:1304: error: storage class specified for parameter '__strdup'
/usr/include/bits/string2.h:1324: error: storage class specified for parameter '__strndup'
In file included from /usr/include/X11/Xlibint.h:232,
                 from XAllowDv.c:59:
/usr/include/stdlib.h:72: error: storage class specified for parameter '__WAIT_STATUS'
/usr/include/stdlib.h:102: error: storage class specified for parameter 'div_t'
/usr/include/stdlib.h:110: error: storage class specified for parameter 'ldiv_t'
/usr/include/stdlib.h:118: error: expected declaration specifiers before '__extension__'
/usr/include/stdlib.h:122: error: expected declaration specifiers before 'lldiv_t'
/usr/include/stdlib.h:140: error: storage class specified for parameter '__ctype_get_mb_cur_max'
/usr/include/stdlib.h:146: error: storage class specified for parameter 'atof'
/usr/include/stdlib.h:149: error: storage class specified for parameter 'atoi'
/usr/include/stdlib.h:152: error: storage class specified for parameter 'atol'
/usr/include/stdlib.h:158: error: expected declaration specifiers before '__extension__'
/usr/include/stdlib.h:167: error: storage class specified for parameter 'strtod'
/usr/include/stdlib.h:174: error: storage class specified for parameter 'strtof'
/usr/include/stdlib.h:178: error: storage class specified for parameter 'strtold'
/usr/include/stdlib.h:186: error: storage class specified for parameter 'strtol'
/usr/include/stdlib.h:190: error: storage class specified for parameter 'strtoul'
/usr/include/stdlib.h:195: error: expected declaration specifiers before '__extension__'
/usr/include/stdlib.h:200: error: expected declaration specifiers before '__extension__'
/usr/include/stdlib.h:209: error: expected declaration specifiers before '__extension__'
/usr/include/stdlib.h:214: error: expected declaration specifiers before '__extension__'
/usr/include/stdlib.h:242: error: expected declaration specifiers or '...' before '__locale_t'
/usr/include/stdlib.h:242: error: storage class specified for parameter 'strtol_l'
/usr/include/stdlib.h:242: error: nonnull argument with out-of-range operand number (argument 1, operand 4)
/usr/include/stdlib.h:246: error: expected declaration specifiers or '...' before '__locale_t'
/usr/include/stdlib.h:247: error: storage class specified for parameter 'strtoul_l'
/usr/include/stdlib.h:247: error: nonnull argument with out-of-range operand number (argument 1, operand 4)
/usr/include/stdlib.h:249: error: expected declaration specifiers before '__extension__'
/usr/include/stdlib.h:255: error: expected declaration specifiers before '__extension__'
/usr/include/stdlib.h:262: error: expected declaration specifiers or '...' before '__locale_t'
/usr/include/stdlib.h:263: error: storage class specified for parameter 'strtod_l'
/usr/include/stdlib.h:263: error: nonnull argument with out-of-range operand number (argument 1, operand 3)
/usr/include/stdlib.h:266: error: expected declaration specifiers or '...' before '__locale_t'
/usr/include/stdlib.h:267: error: storage class specified for parameter 'strtof_l'
/usr/include/stdlib.h:267: error: nonnull argument with out-of-range operand number (argument 1, operand 3)
/usr/include/stdlib.h:271: error: expected declaration specifiers or '...' before '__locale_t'
/usr/include/stdlib.h:272: error: storage class specified for parameter 'strtold_l'
/usr/include/stdlib.h:272: error: nonnull argument with out-of-range operand number (argument 1, operand 3)
/usr/include/stdlib.h:281: error: storage class specified for parameter '__strtod_internal'
/usr/include/stdlib.h:284: error: storage class specified for parameter '__strtof_internal'
/usr/include/stdlib.h:288: error: storage class specified for parameter '__strtold_internal'
/usr/include/stdlib.h:293: error: storage class specified for parameter '__strtol_internal'
/usr/include/stdlib.h:300: error: storage class specified for parameter '__strtoul_internal'
/usr/include/stdlib.h:305: error: expected declaration specifiers before '__extension__'
/usr/include/stdlib.h:313: error: expected declaration specifiers before '__extension__'
/usr/include/stdlib.h:329: error: expected '=', ',', ';', 'asm' or '__attribute__' before '{' token
/usr/include/stdlib.h:335: error: expected '=', ',', ';', 'asm' or '__attribute__' before '{' token
/usr/include/stdlib.h:341: error: expected '=', ',', ';', 'asm' or '__attribute__' before '{' token
/usr/include/stdlib.h:350: error: expected '=', ',', ';', 'asm' or '__attribute__' before '{' token
/usr/include/stdlib.h:356: error: expected '=', ',', ';', 'asm' or '__attribute__' before '{' token
/usr/include/stdlib.h:364: error: expected declaration specifiers before '__extension__'
/usr/include/stdlib.h:370: error: expected declaration specifiers before '__extension__'
/usr/include/stdlib.h:380: error: expected declaration specifiers before '__extension__'
/usr/include/stdlib.h:386: error: expected declaration specifiers before '__extension__'
/usr/include/stdlib.h:398: error: expected '=', ',', ';', 'asm' or '__attribute__' before '{' token
/usr/include/stdlib.h:403: error: expected '=', ',', ';', 'asm' or '__attribute__' before '{' token
/usr/include/stdlib.h:408: error: expected '=', ',', ';', 'asm' or '__attribute__' before '{' token
/usr/include/stdlib.h:415: error: expected declaration specifiers before '__extension__'
/usr/include/stdlib.h:429: error: storage class specified for parameter 'l64a'
/usr/include/stdlib.h:433: error: storage class specified for parameter 'a64l'
/usr/include/stdlib.h:445: error: storage class specified for parameter 'random'
/usr/include/stdlib.h:448: error: storage class specified for parameter 'srandom'
/usr/include/stdlib.h:455: error: storage class specified for parameter 'initstate'
/usr/include/stdlib.h:459: error: storage class specified for parameter 'setstate'
/usr/include/stdlib.h:479: error: storage class specified for parameter 'random_r'
/usr/include/stdlib.h:482: error: storage class specified for parameter 'srandom_r'
/usr/include/stdlib.h:487: error: storage class specified for parameter 'initstate_r'
/usr/include/stdlib.h:491: error: storage class specified for parameter 'setstate_r'
/usr/include/stdlib.h:498: error: storage class specified for parameter 'rand'
/usr/include/stdlib.h:500: error: storage class specified for parameter 'srand'
/usr/include/stdlib.h:505: error: storage class specified for parameter 'rand_r'
/usr/include/stdlib.h:513: error: storage class specified for parameter 'drand48'
/usr/include/stdlib.h:514: error: storage class specified for parameter 'erand48'
/usr/include/stdlib.h:517: error: storage class specified for parameter 'lrand48'
/usr/include/stdlib.h:519: error: storage class specified for parameter 'nrand48'
/usr/include/stdlib.h:522: error: storage class specified for parameter 'mrand48'
/usr/include/stdlib.h:524: error: storage class specified for parameter 'jrand48'
/usr/include/stdlib.h:527: error: storage class specified for parameter 'srand48'
/usr/include/stdlib.h:529: error: storage class specified for parameter 'seed48'
/usr/include/stdlib.h:530: error: storage class specified for parameter 'lcong48'
/usr/include/stdlib.h:547: error: storage class specified for parameter 'drand48_r'
/usr/include/stdlib.h:550: error: storage class specified for parameter 'erand48_r'
/usr/include/stdlib.h:555: error: storage class specified for parameter 'lrand48_r'
/usr/include/stdlib.h:559: error: storage class specified for parameter 'nrand48_r'
/usr/include/stdlib.h:564: error: storage class specified for parameter 'mrand48_r'
/usr/include/stdlib.h:568: error: storage class specified for parameter 'jrand48_r'
/usr/include/stdlib.h:572: error: storage class specified for parameter 'srand48_r'
/usr/include/stdlib.h:575: error: storage class specified for parameter 'seed48_r'
/usr/include/stdlib.h:579: error: storage class specified for parameter 'lcong48_r'
/usr/include/stdlib.h:601: error: storage class specified for parameter 'realloc'
/usr/include/stdlib.h:603: error: storage class specified for parameter 'free'
/usr/include/stdlib.h:608: error: storage class specified for parameter 'cfree'
In file included from /usr/include/stdlib.h:613,
                 from /usr/include/X11/Xlibint.h:232,
                 from XAllowDv.c:59:
/usr/include/alloca.h:33: error: storage class specified for parameter 'alloca'
In file included from /usr/include/X11/Xlibint.h:232,
                 from XAllowDv.c:59:
/usr/include/stdlib.h:617: error: storage class specified for parameter 'valloc'
/usr/include/stdlib.h:623: error: storage class specified for parameter 'posix_memalign'
/usr/include/stdlib.h:628: error: storage class specified for parameter 'abort'
/usr/include/stdlib.h:632: error: storage class specified for parameter 'atexit'
/usr/include/stdlib.h:639: error: storage class specified for parameter 'on_exit'
/usr/include/stdlib.h:646: error: storage class specified for parameter 'exit'
/usr/include/stdlib.h:653: error: storage class specified for parameter '_Exit'
/usr/include/stdlib.h:660: error: storage class specified for parameter 'getenv'
/usr/include/stdlib.h:666: error: storage class specified for parameter '__secure_getenv'
/usr/include/stdlib.h:672: error: storage class specified for parameter 'putenv'
/usr/include/stdlib.h:679: error: storage class specified for parameter 'setenv'
/usr/include/stdlib.h:682: error: storage class specified for parameter 'unsetenv'
/usr/include/stdlib.h:689: error: storage class specified for parameter 'clearenv'
/usr/include/stdlib.h:698: error: storage class specified for parameter 'mktemp'
/usr/include/stdlib.h:709: error: storage class specified for parameter 'mkstemp'
/usr/include/stdlib.h:719: error: storage class specified for parameter 'mkstemp64'
/usr/include/stdlib.h:729: error: storage class specified for parameter 'mkdtemp'
/usr/include/stdlib.h:738: error: storage class specified for parameter 'system'
/usr/include/stdlib.h:746: error: storage class specified for parameter 'canonicalize_file_name'
/usr/include/stdlib.h:756: error: storage class specified for parameter 'realpath'
/usr/include/stdlib.h:763: error: storage class specified for parameter '__compar_fn_t'
/usr/include/stdlib.h:766: error: expected '=', ',', ';', 'asm' or '__attribute__' before 'comparison_fn_t'
/usr/include/stdlib.h:774: error: expected declaration specifiers or '...' before '__compar_fn_t'
/usr/include/stdlib.h:775: error: storage class specified for parameter 'bsearch'
/usr/include/stdlib.h:775: error: nonnull argument with out-of-range operand number (argument 1, operand 5)
/usr/include/stdlib.h:780: error: expected declaration specifiers or '...' before '__compar_fn_t'
/usr/include/stdlib.h:780: error: storage class specified for parameter 'qsort'
/usr/include/stdlib.h:780: error: nonnull argument with out-of-range operand number (argument 1, operand 4)
/usr/include/stdlib.h:784: error: storage class specified for parameter 'abs'
/usr/include/stdlib.h:785: error: storage class specified for parameter 'labs'
/usr/include/stdlib.h:789: error: expected declaration specifiers before '__extension__'
/usr/include/stdlib.h:798: error: expected '=', ',', ';', 'asm' or '__attribute__' before 'div'
/usr/include/stdlib.h:800: error: expected '=', ',', ';', 'asm' or '__attribute__' before 'ldiv'
/usr/include/stdlib.h:806: error: expected declaration specifiers before '__extension__'
/usr/include/stdlib.h:821: error: storage class specified for parameter 'ecvt'
/usr/include/stdlib.h:827: error: storage class specified for parameter 'fcvt'
/usr/include/stdlib.h:833: error: storage class specified for parameter 'gcvt'
/usr/include/stdlib.h:840: error: storage class specified for parameter 'qecvt'
/usr/include/stdlib.h:843: error: storage class specified for parameter 'qfcvt'
/usr/include/stdlib.h:845: error: storage class specified for parameter 'qgcvt'
/usr/include/stdlib.h:852: error: storage class specified for parameter 'ecvt_r'
/usr/include/stdlib.h:855: error: storage class specified for parameter 'fcvt_r'
/usr/include/stdlib.h:860: error: storage class specified for parameter 'qecvt_r'
/usr/include/stdlib.h:864: error: storage class specified for parameter 'qfcvt_r'
/usr/include/stdlib.h:872: error: storage class specified for parameter 'mblen'
/usr/include/stdlib.h:876: error: storage class specified for parameter 'mbtowc'
/usr/include/stdlib.h:879: error: storage class specified for parameter 'wctomb'
/usr/include/stdlib.h:884: error: storage class specified for parameter 'mbstowcs'
/usr/include/stdlib.h:888: error: storage class specified for parameter 'wcstombs'
/usr/include/stdlib.h:897: error: storage class specified for parameter 'rpmatch'
/usr/include/stdlib.h:911: error: storage class specified for parameter 'getsubopt'
/usr/include/stdlib.h:917: error: storage class specified for parameter 'setkey'
/usr/include/stdlib.h:925: error: storage class specified for parameter 'posix_openpt'
/usr/include/stdlib.h:933: error: storage class specified for parameter 'grantpt'
/usr/include/stdlib.h:937: error: storage class specified for parameter 'unlockpt'
/usr/include/stdlib.h:942: error: storage class specified for parameter 'ptsname'
/usr/include/stdlib.h:950: error: storage class specified for parameter 'ptsname_r'
/usr/include/stdlib.h:953: error: storage class specified for parameter 'getpt'
/usr/include/stdlib.h:961: error: storage class specified for parameter 'getloadavg'
In file included from XAllowDv.c:59:
/usr/include/X11/Xlibint.h:248: error: storage class specified for parameter 'LockInfoPtr'
/usr/include/X11/Xlibint.h:280: error: storage class specified for parameter '_XCreateMutex_fn'
/usr/include/X11/Xlibint.h:283: error: storage class specified for parameter '_XFreeMutex_fn'
/usr/include/X11/Xlibint.h:290: error: storage class specified for parameter '_XLockMutex_fn'
/usr/include/X11/Xlibint.h:297: error: storage class specified for parameter '_XUnlockMutex_fn'
/usr/include/X11/Xlibint.h:299: error: expected '=', ',', ';', 'asm' or '__attribute__' before '_Xglobal_lock'
In file included from XAllowDv.c:59:
/usr/include/X11/Xlibint.h:583: error: storage class specified for parameter '_XFlushGCCache'
/usr/include/X11/Xlibint.h:751: error: storage class specified for parameter '_XAsyncHandler'
/usr/include/X11/Xlibint.h:761: error: storage class specified for parameter '_XAsyncErrorState'
/usr/include/X11/Xlibint.h:763: error: expected declaration specifiers or '...' before '_XAsyncHandler'
/usr/include/X11/Xlibint.h:763: error: storage class specified for parameter '_XDeqAsyncHandler'
/usr/include/X11/Xlibint.h:773: error: storage class specified for parameter 'FreeFuncType'
/usr/include/X11/Xlibint.h:777: error: storage class specified for parameter 'FreeModmapType'
/usr/include/X11/Xlibint.h:783: error: expected specifier-qualifier-list before 'FreeFuncType'
/usr/include/X11/Xlibint.h:792: error: storage class specified for parameter '_XFreeFuncRec'
/usr/include/X11/Xlibint.h:799: error: storage class specified for parameter 'CreateGCType'
/usr/include/X11/Xlibint.h:805: error: storage class specified for parameter 'CopyGCType'
/usr/include/X11/Xlibint.h:811: error: storage class specified for parameter 'FlushGCType'
/usr/include/X11/Xlibint.h:817: error: storage class specified for parameter 'FreeGCType'
/usr/include/X11/Xlibint.h:823: error: storage class specified for parameter 'CreateFontType'
/usr/include/X11/Xlibint.h:829: error: storage class specified for parameter 'FreeFontType'
/usr/include/X11/Xlibint.h:834: error: storage class specified for parameter 'CloseDisplayType'
/usr/include/X11/Xlibint.h:841: error: storage class specified for parameter 'ErrorType'
/usr/include/X11/Xlibint.h:849: error: storage class specified for parameter 'ErrorStringType'
/usr/include/X11/Xlibint.h:855: error: storage class specified for parameter 'PrintErrorType'
/usr/include/X11/Xlibint.h:862: error: storage class specified for parameter 'BeforeFlushType'
/usr/include/X11/Xlibint.h:870: error: expected specifier-qualifier-list before 'CreateGCType'
/usr/include/X11/Xlibint.h:883: error: storage class specified for parameter '_XExtension'
/usr/include/X11/Xlibint.h:893: error: storage class specified for parameter '_XError'
/usr/include/X11/Xlibint.h:896: error: storage class specified for parameter '_XIOError'
/usr/include/X11/Xlibint.h:899: error: storage class specified for parameter '_XIOErrorFunction'
/usr/include/X11/Xlibint.h:903: error: storage class specified for parameter '_XErrorFunction'
/usr/include/X11/Xlibint.h:907: error: storage class specified for parameter '_XEatData'
/usr/include/X11/Xlibint.h:911: error: storage class specified for parameter '_XAllocScratch'
/usr/include/X11/Xlibint.h:915: error: storage class specified for parameter '_XAllocTemp'
/usr/include/X11/Xlibint.h:920: error: storage class specified for parameter '_XFreeTemp'
/usr/include/X11/Xlibint.h:924: error: storage class specified for parameter '_XVIDtoVisual'
/usr/include/X11/Xlibint.h:928: error: storage class specified for parameter '_XSetLastRequestRead'
/usr/include/X11/Xlibint.h:932: error: storage class specified for parameter '_XGetHostname'
/usr/include/X11/Xlibint.h:936: error: storage class specified for parameter '_XScreenOfWindow'
/usr/include/X11/Xlibint.h:943: error: storage class specified for parameter '_XAsyncErrorHandler'
/usr/include/X11/Xlibint.h:952: error: storage class specified for parameter '_XGetAsyncReply'
/usr/include/X11/Xlibint.h:961: error: storage class specified for parameter '_XGetAsyncData'
/usr/include/X11/Xlibint.h:964: error: storage class specified for parameter '_XSetSeqSyncFunction'
/usr/include/X11/Xlibint.h:967: error: storage class specified for parameter '_XFlush'
/usr/include/X11/Xlibint.h:971: error: storage class specified for parameter '_XEventsQueued'
/usr/include/X11/Xlibint.h:974: error: storage class specified for parameter '_XReadEvents'
/usr/include/X11/Xlibint.h:979: error: storage class specified for parameter '_XRead'
/usr/include/X11/Xlibint.h:984: error: storage class specified for parameter '_XReadPad'
/usr/include/X11/Xlibint.h:989: error: storage class specified for parameter '_XSend'
/usr/include/X11/Xlibint.h:995: error: storage class specified for parameter '_XReply'
/usr/include/X11/Xlibint.h:999: error: storage class specified for parameter '_XEnq'
/usr/include/X11/Xlibint.h:1002: error: expected declaration specifiers or '...' before '_XQEvent'
/usr/include/X11/Xlibint.h:1003: error: expected declaration specifiers or '...' before '_XQEvent'
/usr/include/X11/Xlibint.h:1004: error: storage class specified for parameter '_XDeq'
/usr/include/X11/Xlibint.h:1010: error: storage class specified for parameter '_XUnknownWireEvent'
/usr/include/X11/Xlibint.h:1015: error: storage class specified for parameter '_XUnknownNativeEvent'
/usr/include/X11/Xlibint.h:1017: error: storage class specified for parameter '_XWireToEvent'
/usr/include/X11/Xlibint.h:1018: error: storage class specified for parameter '_XDefaultWireError'
/usr/include/X11/Xlibint.h:1019: error: storage class specified for parameter '_XPollfdCacheInit'
/usr/include/X11/Xlibint.h:1020: error: storage class specified for parameter '_XPollfdCacheAdd'
/usr/include/X11/Xlibint.h:1021: error: storage class specified for parameter '_XPollfdCacheDel'
/usr/include/X11/Xlibint.h:1022: error: storage class specified for parameter '_XAllocID'
/usr/include/X11/Xlibint.h:1023: error: storage class specified for parameter '_XAllocIDs'
/usr/include/X11/Xlibint.h:1027: error: storage class specified for parameter '_XFreeExtData'
/usr/include/X11/Xlibint.h:1039: error: storage class specified for parameter 'XESetCreateGC'
/usr/include/X11/Xlibint.h:1051: error: storage class specified for parameter 'XESetCopyGC'
/usr/include/X11/Xlibint.h:1063: error: storage class specified for parameter 'XESetFlushGC'
/usr/include/X11/Xlibint.h:1075: error: storage class specified for parameter 'XESetFreeGC'
/usr/include/X11/Xlibint.h:1087: error: storage class specified for parameter 'XESetCreateFont'
/usr/include/X11/Xlibint.h:1099: error: storage class specified for parameter 'XESetFreeFont'
/usr/include/X11/Xlibint.h:1110: error: storage class specified for parameter 'XESetCloseDisplay'
/usr/include/X11/Xlibint.h:1123: error: storage class specified for parameter 'XESetError'
/usr/include/X11/Xlibint.h:1137: error: storage class specified for parameter 'XESetErrorString'
/usr/include/X11/Xlibint.h:1149: error: storage class specified for parameter 'XESetPrintErrorValues'
/usr/include/X11/Xlibint.h:1161: error: storage class specified for parameter 'XESetWireToEvent'
/usr/include/X11/Xlibint.h:1173: error: storage class specified for parameter 'XESetEventToWire'
/usr/include/X11/Xlibint.h:1185: error: storage class specified for parameter 'XESetWireToError'
/usr/include/X11/Xlibint.h:1198: error: storage class specified for parameter 'XESetBeforeFlush'
/usr/include/X11/Xlibint.h:1206: error: storage class specified for parameter '_XInternalConnectionProc'
/usr/include/X11/Xlibint.h:1212: error: expected declaration specifiers or '...' before '_XInternalConnectionProc'
/usr/include/X11/Xlibint.h:1214: error: storage class specified for parameter '_XRegisterInternalConnection'
/usr/include/X11/Xlibint.h:1219: error: storage class specified for parameter '_XUnregisterInternalConnection'
/usr/include/X11/Xlibint.h:1224: error: storage class specified for parameter '_XProcessInternalConnection'
/usr/include/X11/Xlibint.h:1230: error: expected specifier-qualifier-list before '_XInternalConnectionProc'
/usr/include/X11/Xlibint.h:1237: error: expected specifier-qualifier-list before 'XConnectionWatchProc'
/usr/include/X11/Xlibint.h:1252: error: storage class specified for parameter '_XTextHeight'
/usr/include/X11/Xlibint.h:1258: error: storage class specified for parameter '_XTextHeight16'
/usr/include/X11/Xlibint.h:1288: error: storage class specified for parameter '_XEventToWire'
/usr/include/X11/Xlibint.h:1295: error: storage class specified for parameter '_XF86LoadQueryLocaleFont'
/usr/include/X11/Xlibint.h:1301: error: storage class specified for parameter '_XProcessWindowAttributes'
/usr/include/X11/Xlibint.h:1305: error: storage class specified for parameter '_XDefaultError'
/usr/include/X11/Xlibint.h:1308: error: storage class specified for parameter '_XDefaultIOError'
/usr/include/X11/Xlibint.h:1316: error: storage class specified for parameter '_XSetClipRectangles'
In file included from XAllowDv.c:60:
../../exports/include/X11/extensions/XInput.h:192: error: storage class specified for parameter 'XDeviceKeyEvent'
../../exports/include/X11/extensions/XInput.h:194: error: expected '=', ',', ';', 'asm' or '__attribute__' before 'XDeviceKeyPressedEvent'
../../exports/include/X11/extensions/XInput.h:195: error: expected '=', ',', ';', 'asm' or '__attribute__' before 'XDeviceKeyReleasedEvent'
../../exports/include/X11/extensions/XInput.h:224: error: storage class specified for parameter 'XDeviceButtonEvent'
../../exports/include/X11/extensions/XInput.h:226: error: expected '=', ',', ';', 'asm' or '__attribute__' before 'XDeviceButtonPressedEvent'
../../exports/include/X11/extensions/XInput.h:227: error: expected '=', ',', ';', 'asm' or '__attribute__' before 'XDeviceButtonReleasedEvent'
../../exports/include/X11/extensions/XInput.h:257: error: storage class specified for parameter 'XDeviceMotionEvent'
../../exports/include/X11/extensions/XInput.h:282: error: storage class specified for parameter 'XDeviceFocusChangeEvent'
../../exports/include/X11/extensions/XInput.h:284: error: expected '=', ',', ';', 'asm' or '__attribute__' before 'XDeviceFocusInEvent'
../../exports/include/X11/extensions/XInput.h:285: error: expected '=', ',', ';', 'asm' or '__attribute__' before 'XDeviceFocusOutEvent'
../../exports/include/X11/extensions/XInput.h:313: error: storage class specified for parameter 'XProximityNotifyEvent'
../../exports/include/X11/extensions/XInput.h:314: error: expected '=', ',', ';', 'asm' or '__attribute__' before 'XProximityInEvent'
../../exports/include/X11/extensions/XInput.h:315: error: expected '=', ',', ';', 'asm' or '__attribute__' before 'XProximityOutEvent'
../../exports/include/X11/extensions/XInput.h:332: error: storage class specified for parameter 'XInputClass'
../../exports/include/X11/extensions/XInput.h:344: error: storage class specified for parameter 'XDeviceStateNotifyEvent'
../../exports/include/X11/extensions/XInput.h:356: error: storage class specified for parameter 'XValuatorStatus'
../../exports/include/X11/extensions/XInput.h:367: error: storage class specified for parameter 'XKeyStatus'
../../exports/include/X11/extensions/XInput.h:378: error: storage class specified for parameter 'XButtonStatus'
../../exports/include/X11/extensions/XInput.h:399: error: storage class specified for parameter 'XDeviceMappingEvent'
../../exports/include/X11/extensions/XInput.h:417: error: storage class specified for parameter 'XChangeDeviceNotifyEvent'
../../exports/include/X11/extensions/XInput.h:435: error: storage class specified for parameter 'XFeedbackState'
../../exports/include/X11/extensions/XInput.h:452: error: storage class specified for parameter 'XKbdFeedbackState'
../../exports/include/X11/extensions/XInput.h:465: error: storage class specified for parameter 'XPtrFeedbackState'
../../exports/include/X11/extensions/XInput.h:478: error: storage class specified for parameter 'XIntegerFeedbackState'
../../exports/include/X11/extensions/XInput.h:491: error: storage class specified for parameter 'XStringFeedbackState'
../../exports/include/X11/extensions/XInput.h:504: error: storage class specified for parameter 'XBellFeedbackState'
../../exports/include/X11/extensions/XInput.h:516: error: storage class specified for parameter 'XLedFeedbackState'
../../exports/include/X11/extensions/XInput.h:526: error: storage class specified for parameter 'XFeedbackControl'
../../exports/include/X11/extensions/XInput.h:539: error: storage class specified for parameter 'XPtrFeedbackControl'
../../exports/include/X11/extensions/XInput.h:557: error: storage class specified for parameter 'XKbdFeedbackControl'
../../exports/include/X11/extensions/XInput.h:569: error: storage class specified for parameter 'XStringFeedbackControl'
../../exports/include/X11/extensions/XInput.h:580: error: storage class specified for parameter 'XIntegerFeedbackControl'
../../exports/include/X11/extensions/XInput.h:593: error: storage class specified for parameter 'XBellFeedbackControl'
../../exports/include/X11/extensions/XInput.h:605: error: storage class specified for parameter 'XLedFeedbackControl'
../../exports/include/X11/extensions/XInput.h:616: error: storage class specified for parameter 'XDeviceControl'
../../exports/include/X11/extensions/XInput.h:624: error: storage class specified for parameter 'XDeviceResolutionControl'
../../exports/include/X11/extensions/XInput.h:633: error: storage class specified for parameter 'XDeviceResolutionState'
../../exports/include/X11/extensions/XInput.h:645: error: storage class specified for parameter 'XAnyClassPtr'
../../exports/include/X11/extensions/XInput.h:654: error: storage class specified for parameter 'XAnyClassInfo'
../../exports/include/X11/extensions/XInput.h:656: error: storage class specified for parameter 'XDeviceInfoPtr'
../../exports/include/X11/extensions/XInput.h:665: error: expected specifier-qualifier-list before 'XAnyClassPtr'
../../exports/include/X11/extensions/XInput.h:666: error: storage class specified for parameter 'XDeviceInfo'
../../exports/include/X11/extensions/XInput.h:668: error: storage class specified for parameter 'XKeyInfoPtr'
../../exports/include/X11/extensions/XInput.h:681: error: storage class specified for parameter 'XKeyInfo'
../../exports/include/X11/extensions/XInput.h:683: error: storage class specified for parameter 'XButtonInfoPtr'
../../exports/include/X11/extensions/XInput.h:693: error: storage class specified for parameter 'XButtonInfo'
../../exports/include/X11/extensions/XInput.h:695: error: storage class specified for parameter 'XAxisInfoPtr'
../../exports/include/X11/extensions/XInput.h:701: error: storage class specified for parameter 'XAxisInfo'
../../exports/include/X11/extensions/XInput.h:703: error: storage class specified for parameter 'XValuatorInfoPtr'
../../exports/include/X11/extensions/XInput.h:716: error: expected specifier-qualifier-list before 'XAxisInfoPtr'
../../exports/include/X11/extensions/XInput.h:717: error: storage class specified for parameter 'XValuatorInfo'
../../exports/include/X11/extensions/XInput.h:734: error: storage class specified for parameter 'XInputClassInfo'
../../exports/include/X11/extensions/XInput.h:739: error: expected specifier-qualifier-list before 'XInputClassInfo'
../../exports/include/X11/extensions/XInput.h:740: error: storage class specified for parameter 'XDevice'
../../exports/include/X11/extensions/XInput.h:753: error: storage class specified for parameter 'XEventList'
../../exports/include/X11/extensions/XInput.h:766: error: storage class specified for parameter 'XDeviceTimeCoord'
../../exports/include/X11/extensions/XInput.h:779: error: expected specifier-qualifier-list before 'XInputClass'
../../exports/include/X11/extensions/XInput.h:780: error: storage class specified for parameter 'XDeviceState'
../../exports/include/X11/extensions/XInput.h:803: error: storage class specified for parameter 'XValuatorState'
../../exports/include/X11/extensions/XInput.h:814: error: storage class specified for parameter 'XKeyState'
../../exports/include/X11/extensions/XInput.h:825: error: storage class specified for parameter 'XButtonState'
../../exports/include/X11/extensions/XInput.h:838: error: expected declaration specifiers or '...' before 'XDevice'
../../exports/include/X11/extensions/XInput.h:840: error: storage class specified for parameter 'XChangeKeyboardDevice'
../../exports/include/X11/extensions/XInput.h:845: error: expected declaration specifiers or '...' before 'XDevice'
../../exports/include/X11/extensions/XInput.h:849: error: storage class specified for parameter 'XChangePointerDevice'
../../exports/include/X11/extensions/XInput.h:854: error: expected declaration specifiers or '...' before 'XDevice'
../../exports/include/X11/extensions/XInput.h:863: error: storage class specified for parameter 'XGrabDevice'
../../exports/include/X11/extensions/XInput.h:868: error: expected declaration specifiers or '...' before 'XDevice'
../../exports/include/X11/extensions/XInput.h:871: error: storage class specified for parameter 'XUngrabDevice'
../../exports/include/X11/extensions/XInput.h:876: error: expected declaration specifiers or '...' before 'XDevice'
../../exports/include/X11/extensions/XInput.h:879: error: expected declaration specifiers or '...' before 'XDevice'
../../exports/include/X11/extensions/XInput.h:887: error: storage class specified for parameter 'XGrabDeviceKey'
../../exports/include/X11/extensions/XInput.h:892: error: expected declaration specifiers or '...' before 'XDevice'
../../exports/include/X11/extensions/XInput.h:895: error: expected declaration specifiers or '...' before 'XDevice'
../../exports/include/X11/extensions/XInput.h:898: error: storage class specified for parameter 'XUngrabDeviceKey'
../../exports/include/X11/extensions/XInput.h:903: error: expected declaration specifiers or '...' before 'XDevice'
../../exports/include/X11/extensions/XInput.h:906: error: expected declaration specifiers or '...' before 'XDevice'
../../exports/include/X11/extensions/XInput.h:914: error: storage class specified for parameter 'XGrabDeviceButton'
../../exports/include/X11/extensions/XInput.h:919: error: expected declaration specifiers or '...' before 'XDevice'
../../exports/include/X11/extensions/XInput.h:922: error: expected declaration specifiers or '...' before 'XDevice'
../../exports/include/X11/extensions/XInput.h:925: error: storage class specified for parameter 'XUngrabDeviceButton'
../../exports/include/X11/extensions/XInput.h:930: error: expected declaration specifiers or '...' before 'XDevice'
../../exports/include/X11/extensions/XInput.h:934: error: storage class specified for parameter 'XAllowDeviceEvents'
../../exports/include/X11/extensions/XInput.h:939: error: expected declaration specifiers or '...' before 'XDevice'
../../exports/include/X11/extensions/XInput.h:944: error: storage class specified for parameter 'XGetDeviceFocus'
../../exports/include/X11/extensions/XInput.h:949: error: expected declaration specifiers or '...' before 'XDevice'
../../exports/include/X11/extensions/XInput.h:954: error: storage class specified for parameter 'XSetDeviceFocus'
../../exports/include/X11/extensions/XInput.h:956: error: expected '=', ',', ';', 'asm' or '__attribute__' before '*' token
../../exports/include/X11/extensions/XInput.h:966: error: expected ')' before '*' token
../../exports/include/X11/extensions/XInput.h:973: error: expected declaration specifiers or '...' before 'XDevice'
../../exports/include/X11/extensions/XInput.h:975: error: expected declaration specifiers or '...' before 'XFeedbackControl'
../../exports/include/X11/extensions/XInput.h:977: error: storage class specified for parameter 'XChangeFeedbackControl'
../../exports/include/X11/extensions/XInput.h:982: error: expected declaration specifiers or '...' before 'XDevice'
../../exports/include/X11/extensions/XInput.h:987: error: storage class specified for parameter 'XDeviceBell'
../../exports/include/X11/extensions/XInput.h:992: error: expected declaration specifiers or '...' before 'XDevice'
../../exports/include/X11/extensions/XInput.h:1001: error: storage class specified for parameter 'XGetDeviceKeyMapping'
../../exports/include/X11/extensions/XInput.h:1006: error: expected declaration specifiers or '...' before 'XDevice'
../../exports/include/X11/extensions/XInput.h:1012: error: storage class specified for parameter 'XChangeDeviceKeyMapping'
../../exports/include/X11/extensions/XInput.h:1017: error: expected declaration specifiers or '...' before 'XDevice'
../../exports/include/X11/extensions/XInput.h:1019: error: storage class specified for parameter 'XGetDeviceModifierMapping'
../../exports/include/X11/extensions/XInput.h:1024: error: expected declaration specifiers or '...' before 'XDevice'
../../exports/include/X11/extensions/XInput.h:1027: error: storage class specified for parameter 'XSetDeviceModifierMapping'
../../exports/include/X11/extensions/XInput.h:1032: error: expected declaration specifiers or '...' before 'XDevice'
../../exports/include/X11/extensions/XInput.h:1036: error: storage class specified for parameter 'XSetDeviceButtonMapping'
../../exports/include/X11/extensions/XInput.h:1041: error: expected declaration specifiers or '...' before 'XDevice'
../../exports/include/X11/extensions/XInput.h:1045: error: storage class specified for parameter 'XGetDeviceButtonMapping'
../../exports/include/X11/extensions/XInput.h:1047: error: expected '=', ',', ';', 'asm' or '__attribute__' before '*' token
../../exports/include/X11/extensions/XInput.h:1056: error: expected ')' before '*' token
../../exports/include/X11/extensions/XInput.h:1065: error: storage class specified for parameter 'XGetExtensionVersion'
../../exports/include/X11/extensions/XInput.h:1067: error: expected '=', ',', ';', 'asm' or '__attribute__' before '*' token
../../exports/include/X11/extensions/XInput.h:1076: error: expected ')' before '*' token
../../exports/include/X11/extensions/XInput.h:1080: error: expected '=', ',', ';', 'asm' or '__attribute__' before '*' token
../../exports/include/X11/extensions/XInput.h:1090: error: expected declaration specifiers or '...' before 'XDevice'
../../exports/include/X11/extensions/XInput.h:1092: error: storage class specified for parameter 'XCloseDevice'
../../exports/include/X11/extensions/XInput.h:1097: error: expected declaration specifiers or '...' before 'XDevice'
../../exports/include/X11/extensions/XInput.h:1100: error: storage class specified for parameter 'XSetDeviceMode'
../../exports/include/X11/extensions/XInput.h:1105: error: expected declaration specifiers or '...' before 'XDevice'
../../exports/include/X11/extensions/XInput.h:1110: error: storage class specified for parameter 'XSetDeviceValuators'
../../exports/include/X11/extensions/XInput.h:1112: error: expected '=', ',', ';', 'asm' or '__attribute__' before '*' token
../../exports/include/X11/extensions/XInput.h:1123: error: expected declaration specifiers or '...' before 'XDevice'
../../exports/include/X11/extensions/XInput.h:1125: error: expected declaration specifiers or '...' before 'XDeviceControl'
../../exports/include/X11/extensions/XInput.h:1127: error: storage class specified for parameter 'XChangeDeviceControl'
../../exports/include/X11/extensions/XInput.h:1136: error: storage class specified for parameter 'XSelectExtensionEvent'
../../exports/include/X11/extensions/XInput.h:1147: error: storage class specified for parameter 'XGetSelectedExtensionEvents'
../../exports/include/X11/extensions/XInput.h:1157: error: storage class specified for parameter 'XChangeDeviceDontPropagateList'
../../exports/include/X11/extensions/XInput.h:1165: error: storage class specified for parameter 'XGetDeviceDontPropagateList'
../../exports/include/X11/extensions/XInput.h:1170: error: expected declaration specifiers or '...' before 'XDevice'
../../exports/include/X11/extensions/XInput.h:1177: error: storage class specified for parameter 'XSendExtensionEvent'
../../exports/include/X11/extensions/XInput.h:1179: error: expected '=', ',', ';', 'asm' or '__attribute__' before '*' token
../../exports/include/X11/extensions/XInput.h:1193: error: expected ')' before '*' token
../../exports/include/X11/extensions/XInput.h:1199: error: expected ')' before '*' token
In file included from ../../exports/include/X11/extensions/extutil.h:40,
                 from XAllowDv.c:61:
../../exports/include/X11/extensions/Xext.h:51: error: storage class specified for parameter 'XSetExtensionErrorHandler'
../../exports/include/X11/extensions/Xext.h:58: error: storage class specified for parameter 'XMissingExtension'
In file included from XAllowDv.c:61:
../../exports/include/X11/extensions/extutil.h:51: error: storage class specified for parameter 'XExtDisplayInfo'
../../exports/include/X11/extensions/extutil.h:54: error: expected specifier-qualifier-list before 'XExtDisplayInfo'
../../exports/include/X11/extensions/extutil.h:57: error: storage class specified for parameter 'XExtensionInfo'
../../exports/include/X11/extensions/extutil.h:139: error: storage class specified for parameter 'XExtensionHooks'
../../exports/include/X11/extensions/extutil.h:141: error: expected '=', ',', ';', 'asm' or '__attribute__' before '*' token
../../exports/include/X11/extensions/extutil.h:148: error: expected ')' before '*' token
../../exports/include/X11/extensions/extutil.h:151: error: expected '=', ',', ';', 'asm' or '__attribute__' before '*' token
../../exports/include/X11/extensions/extutil.h:163: error: expected ')' before '*' token
../../exports/include/X11/extensions/extutil.h:167: error: expected '=', ',', ';', 'asm' or '__attribute__' before '*' token
In file included from XAllowDv.c:62:
XIint.h:11: error: expected '=', ',', ';', 'asm' or '__attribute__' before '*' token
XIint.h:22: error: storage class specified for parameter '_XiCheckExtInit'
XAllowDv.c:65: error: expected '=', ',', ';', 'asm' or '__attribute__' before 'register'
XAllowDv.c:66: error: expected declaration specifiers before 'XDevice'
XAllowDv.c:69: error: old-style parameter declarations in prototyped function definition
/usr/include/X11/Xlib.h:3571: error: parameter name omitted
XAllowDv.c:71: error: 'XExtDisplayInfo' undeclared (first use in this function)
XAllowDv.c:71: error: (Each undeclared identifier is reported only once
XAllowDv.c:71: error: for each function it appears in.)
XAllowDv.c:71: error: 'info' undeclared (first use in this function)
XAllowDv.c:71: error: 'dpy' undeclared (first use in this function)
XAllowDv.c:75: warning: return makes pointer from integer without a cast
XAllowDv.c:80: error: 'dev' undeclared (first use in this function)
XAllowDv.c:81: error: 'event_mode' undeclared (first use in this function)
XAllowDv.c:82: error: 'time' undeclared (first use in this function)
make[4]: *** [XAllowDv.o] Error 1
make[4]: Leaving directory `/var/tmp/portage/x11-base/kdrive-4.3.0-r5/work/xc/lib/Xi'
make[3]: *** [all] Error 2
make[3]: Leaving directory `/var/tmp/portage/x11-base/kdrive-4.3.0-r5/work/xc/lib'
make[2]: *** [all] Error 2
make[2]: Leaving directory `/var/tmp/portage/x11-base/kdrive-4.3.0-r5/work/xc'
make[1]: *** [World] Error 2
make[1]: Leaving directory `/var/tmp/portage/x11-base/kdrive-4.3.0-r5/work/xc'
make: *** [World] Error 2
 * 
 * ERROR: x11-base/kdrive-4.3.0-r5 failed.
 * Call stack:
 *               ebuild.sh, line 1762:  Called dyn_compile
 *               ebuild.sh, line  891:  Called qa_call 'src_compile'
 *               ebuild.sh, line   35:  Called src_compile
 *             environment, line 3156:  Called die
 * The specific snippet of code:
 *       emake World WORLDOPTS="" || diefunc "$FUNCNAME" "$LINENO" "$?";
 *  The die message:
 *   (no error message)
 * 
 * If you need support, post the topmost build error, and the call stack if relevant.
 * A complete build log is located at '/var/tmp/portage/x11-base/kdrive-4.3.0-r5/temp/build.log'.
 * 
 
 * Messages for package x11-base/kdrive-4.3.0-r5:
 
 * 
 * ERROR: x11-base/kdrive-4.3.0-r5 failed.
 * Call stack:
 *               ebuild.sh, line 1762:  Called dyn_compile
 *               ebuild.sh, line  891:  Called qa_call 'src_compile'
 *               ebuild.sh, line   35:  Called src_compile
 *             environment, line 3156:  Called die
 * The specific snippet of code:
 *       emake World WORLDOPTS="" || diefunc "$FUNCNAME" "$LINENO" "$?";
 *  The die message:
 *   (no error message)
 * 
 * If you need support, post the topmost build error, and the call stack if relevant.
 * A complete build log is located at '/var/tmp/portage/x11-base/kdrive-4.3.0-r5/temp/build.log'.
 *