All pastes #79680 Raw Edit

MetaPhaze

public text v1 · immutable
·published 2006-07-05 16:33 UTC
rendered paste body
if /bin/sh ./libtool --silent --tag=CC --mode=compile i686-pc-linux-gnu-gcc -DHA 
VE_CONFIG_H -I. -I. -I./magick -I./wand   -I/usr/include/freetype2 -I/usr/includ 
e/libxml2  -march=pentium4 -O3 -pipe -Wall -pthread -MT coders/coders_xwd_la-xwd 
.lo -MD -MP -MF "coders/.deps/coders_xwd_la-xwd.Tpo" -c -o coders/coders_xwd_la- 
xwd.lo `test -f 'coders/xwd.c' || echo './'`coders/xwd.c; \
then mv -f "coders/.deps/coders_xwd_la-xwd.Tpo" "coders/.deps/coders_xwd_la-xwd. 
Plo"; else rm -f "coders/.deps/coders_xwd_la-xwd.Tpo"; exit 1; fi
distcc[22855] ERROR: compile /var/tmp/ccache/png.tmp.maynard.22817.i on localhos 
t failed
coders/png.c: In function `ReadOnePNGImage':
coders/png.c:1755: warning: implicit declaration of function `png_access_version 
'
coders/png.c:1764: error: `png_ptr' undeclared (first use in this function)
coders/png.c:1764: error: (Each undeclared identifier is reported only once
coders/png.c:1764: error: for each function it appears in.)
make: *** [coders/coders_png_la-png.lo] Error 1
make: *** Waiting for unfinished jobs....

!!! ERROR: media-gfx/imagemagick-6.2.5.5 failed.
Call stack:
  ebuild.sh, line 1539:   Called dyn_compile
  ebuild.sh, line 939:   Called src_compile
  imagemagick-6.2.5.5.ebuild, line 86:   Called die

!!! compile problem
!!! If you need support, post the topmost build error, and the call stack if rel 
evant.