All pastes #796041 Raw Edit

Untitled

public text v1 · immutable
#796041 ·published 2007-11-24 18:34 UTC
rendered paste body
i686-pc-linux-gnu-g++ -DHAVE_CONFIG_H -DG_LOG_DOMAIN=\"gtkmm\" -I../../gtk -I../../gtk -I../../pango -I../../pango -I../../atk -I../../atk -I../../gdk -I../../gdk -I../../gtk -I../../gtk -I/usr/include/glibmm-2.4 -I/usr/lib/glibmm-2.4/include -I/usr/include/sigc++-2.0 -I/usr/lib/sigc++-2.0/include -I/usr/include/glib-2.0 -I/usr/lib/glib-2.0/include -I/usr/include/cairomm-1.0 -I/usr/include/cairo -I/usr/include/freetype2 -I/usr/include/libpng12 -I/usr/include/gtk-2.0 -I/usr/lib/gtk-2.0/include -I/usr/include/atk-1.0 -I/usr/include/pango-1.0 -I/usr/include/gtk-unix-print-2.0 -pthread -I/usr/include/glib-2.0 -I/usr/lib/glib-2.0/include -O2 -march=i686 -pipe -mno-tls-direct-seg-refs -Wall -MT tooltips.lo -MD -MP -MF .deps/tooltips.Tpo -c tooltips.cc  -fPIC -DPIC -o .libs/tooltips.o
distcc[12267] (dcc_get_hostlist) Warning: no hostlist is set; can't distribute work
distcc[12267] (dcc_build_somewhere) Warning: failed to distribute, running locally instead
make[5]: Leaving directory `/var/tmp/portage/dev-cpp/gtkmm-2.10.9/work/gtkmm-2.10.9/gtk/gtkmm'
make[4]: *** [all-recursive] Error 1
make[4]: Leaving directory `/var/tmp/portage/dev-cpp/gtkmm-2.10.9/work/gtkmm-2.10.9/gtk/gtkmm'
make[3]: *** [all-recursive] Error 1
make[3]: Leaving directory `/var/tmp/portage/dev-cpp/gtkmm-2.10.9/work/gtkmm-2.10.9/gtk'
make[2]: *** [all] Error 2
make[2]: Leaving directory `/var/tmp/portage/dev-cpp/gtkmm-2.10.9/work/gtkmm-2.10.9/gtk'
make[1]: *** [all-recursive] Error 1
make[1]: Leaving directory `/var/tmp/portage/dev-cpp/gtkmm-2.10.9/work/gtkmm-2.10.9'
make: *** [all] Error 2
 *
 * ERROR: dev-cpp/gtkmm-2.10.9 failed.
 * Call stack:
 *       ebuild.sh, line 1701:  Called dyn_compile
 *       ebuild.sh, line 1039:  Called qa_call 'src_compile'
 *       ebuild.sh, line   44:  Called src_compile
 *       ebuild.sh, line 1383:  Called gnome2_src_compile
 *   gnome2.eclass, line   71:  Called die
 * The specific snippet of code:
 *      emake || die "compile failure"
 *  The die message:
 *   compile failure
 *
 * If you need support, post the topmost build error, and the call stack if relevant.
 * A complete build log is located at '/var/tmp/portage/dev-cpp/gtkmm-2.10.9/temp/build.log'.
 *

 * Messages for package dev-cpp/gtkmm-2.10.9:

 *
 * ERROR: dev-cpp/gtkmm-2.10.9 failed.
 * Call stack:
 *       ebuild.sh, line 1701:  Called dyn_compile
 *       ebuild.sh, line 1039:  Called qa_call 'src_compile'
 *       ebuild.sh, line   44:  Called src_compile
 *       ebuild.sh, line 1383:  Called gnome2_src_compile
 *   gnome2.eclass, line   71:  Called die
 * The specific snippet of code:
 *      emake || die "compile failure"
 *  The die message:
 *   compile failure
 *
 * If you need support, post the topmost build error, and the call stack if relevant.
 * A complete build log is located at '/var/tmp/portage/dev-cpp/gtkmm-2.10.9/temp/build.log'.