All pastes #795745 Raw Edit

Vermischtes

public text v1 · immutable
#795745 ·published 2007-11-24 12:14 UTC
rendered paste body
[ 68%] Building CXX object workspace/plasma/applets/kickoff/CMakeFiles/plasma_applet_launcher.dir/core/searchmodel.o
/home/az/src/kde/kdebase/workspace/plasma/applets/kickoff/core/searchmodel.cpp:29:40: strigi/qtdbus/strigiclient.h: Datei oder Verzeichnis nicht gefunden
/home/az/src/kde/kdebase/workspace/plasma/applets/kickoff/core/searchmodel.cpp: In
   member function `virtual void Kickoff::IndexerSearch::setQuery(const 
   QString&)':
/home/az/src/kde/kdebase/workspace/plasma/applets/kickoff/core/searchmodel.cpp:217: error: ISO
   C++ forbids declaration of `StrigiClient' with no type
/home/az/src/kde/kdebase/workspace/plasma/applets/kickoff/core/searchmodel.cpp:217: error: syntax
   error before `;' token
/home/az/src/kde/kdebase/workspace/plasma/applets/kickoff/core/searchmodel.cpp:220: error: `
   StrigiHit' undeclared (first use this function)
/home/az/src/kde/kdebase/workspace/plasma/applets/kickoff/core/searchmodel.cpp:220: error: (Each
   undeclared identifier is reported only once for each function it appears 
   in.)
/home/az/src/kde/kdebase/workspace/plasma/applets/kickoff/core/searchmodel.cpp:220: error: template
   argument 1 is invalid
/home/az/src/kde/kdebase/workspace/plasma/applets/kickoff/core/searchmodel.cpp:220: error: ISO
   C++ forbids declaration of `hits' with no type
/home/az/src/kde/kdebase/workspace/plasma/applets/kickoff/core/searchmodel.cpp:220: error: `
   searchClient' undeclared (first use this function)
/usr/include/QtCore/qglobal.h: At global scope:
/usr/include/QtCore/qglobal.h: In instantiation of `QForeachContainer<int>':
/home/az/src/kde/kdebase/workspace/plasma/applets/kickoff/core/searchmodel.cpp:221:   instantiated from here
/usr/include/QtCore/qglobal.h:1838: error: `int' is not a class, struct, or 
   union type
/usr/include/QtCore/qglobal.h:1838: error: `int' is not a class, struct, or 
   union type
/home/az/src/kde/kdebase/workspace/plasma/applets/kickoff/core/searchmodel.cpp: In
   member function `virtual void Kickoff::IndexerSearch::setQuery(const 
   QString&)':
/home/az/src/kde/kdebase/workspace/plasma/applets/kickoff/core/searchmodel.cpp:221: error: '
   class QForeachContainer<int>' has no member named 'i'
/home/az/src/kde/kdebase/workspace/plasma/applets/kickoff/core/searchmodel.cpp:221: error: '
   class QForeachContainer<int>' has no member named 'e'
/home/az/src/kde/kdebase/workspace/plasma/applets/kickoff/core/searchmodel.cpp:221: error: '
   class QForeachContainer<int>' has no member named 'i'
/home/az/src/kde/kdebase/workspace/plasma/applets/kickoff/core/searchmodel.cpp:221: error: ISO
   C++ forbids declaration of `StrigiHit' with no type
/home/az/src/kde/kdebase/workspace/plasma/applets/kickoff/core/searchmodel.cpp:221: error: uninitialized
   const `StrigiHit'
/home/az/src/kde/kdebase/workspace/plasma/applets/kickoff/core/searchmodel.cpp:221: error: syntax
   error before `&' token
/home/az/src/kde/kdebase/workspace/plasma/applets/kickoff/core/searchmodel.cpp:222: error: `
   hit' undeclared (first use this function)
/home/az/src/kde/kdebase/workspace/plasma/applets/kickoff/core/searchmodel.cpp:221: warning: unused
   variable `const int StrigiHit'
/home/az/src/kde/kdebase/workspace/plasma/applets/kickoff/core/searchmodel.cpp:217: warning: unused
   variable `int StrigiClient'
/usr/include/QtCore/qglobal.h: In constructor `
   QForeachContainer<T>::QForeachContainer(const T&) [with T = int]':
/home/az/src/kde/kdebase/workspace/plasma/applets/kickoff/core/searchmodel.cpp:221:   instantiated from here
/usr/include/QtCore/qglobal.h:1835: error: unnamed initializer for `
   QForeachContainer<int>', which has no base classes
/usr/include/QtCore/qglobal.h:1835: error: request for member `begin' in `
   this->QForeachContainer<int>::c', which is of non-aggregate type `const int'
/usr/include/QtCore/qglobal.h:1835: error: unnamed initializer for `
   QForeachContainer<int>', which has no base classes
/usr/include/QtCore/qglobal.h:1835: error: request for member `end' in `
   this->QForeachContainer<int>::c', which is of non-aggregate type `const int'
make[2]: *** [workspace/plasma/applets/kickoff/CMakeFiles/plasma_applet_launcher.dir/core/searchmodel.o] Fehler 1
make[2]: Das Target »workspace/plasma/applets/kickoff/CMakeFiles/plasma_applet_launcher.dir/build« wurde wegen Fehlern nicht aktualisiert.
make[1]: *** [workspace/plasma/applets/kickoff/CMakeFiles/plasma_applet_launcher.dir/all] Fehler 2
[ 68%] Built target plasma_applet_url
[ 68%] Built target plasma_applet_pager
[ 68%] Built target plasma_applet_systemtray
[ 68%] Built target plasma_applet_devicenotifier
[ 68%] Built target plasma_applet_tasks
[ 69%] Built target plasma_applet_lockout
[ 69%] Built target plasma_containment_desktop
[ 69%] Built target plasma_containment_panel
[ 69%] Built target plasma_engine_dict
[ 69%] Built target plasma_engine_hotplug
[ 69%] Building CXX object workspace/plasma/dataengines/filebrowser/CMakeFiles/plasma_engine_filebrowser.dir/filebrowserengine.o
/home/az/src/kde/kdebase/workspace/plasma/dataengines/filebrowser/filebrowserengine.cpp: In
   member function `void FileBrowserEngine::updateData(const QString&, 
   FileBrowserEngine::EventType)':
/home/az/src/kde/kdebase/workspace/plasma/dataengines/filebrowser/filebrowserengine.cpp:113: error: syntax
   error before `:' token
/home/az/src/kde/kdebase/workspace/plasma/dataengines/filebrowser/filebrowserengine.cpp:114: error: syntax
   error before `:' token
/home/az/src/kde/kdebase/workspace/plasma/dataengines/filebrowser/filebrowserengine.cpp:115: error: syntax
   error before `:' token
/home/az/src/kde/kdebase/workspace/plasma/dataengines/filebrowser/filebrowserengine.cpp:116: error: syntax
   error before `:' token
make[2]: *** [workspace/plasma/dataengines/filebrowser/CMakeFiles/plasma_engine_filebrowser.dir/filebrowserengine.o] Fehler 1
make[2]: Das Target »workspace/plasma/dataengines/filebrowser/CMakeFiles/plasma_engine_filebrowser.dir/build« wurde wegen Fehlern nicht aktualisiert.
make[1]: *** [workspace/plasma/dataengines/filebrowser/CMakeFiles/plasma_engine_filebrowser.dir/all] Fehler 2