>>> Emerging (1 of 8) x11-plugins/compiz-fusion-plugins-main-9999 to /
* checking ebuild checksums ;-) ... [ ok ]
* checking auxfile checksums ;-) ... [ ok ]
* checking miscfile checksums ;-) ... [ ok ]
>>> Unpacking source...
* git update start -->
* repository: git://anongit.compiz-fusion.org/fusion/plugins-main
* local clone: /usr/portage/distfiles/git-src/compiz-fusion-plugins-main
* committish: master
>>> Unpacked to /var/tmp/portage/x11-plugins/compiz-fusion-plugins-main-9999/work/plugins-main
>>> Source unpacked.
>>> Compiling source in /var/tmp/portage/x11-plugins/compiz-fusion-plugins-main-9999/work/plugins-main ...
* Running eautoreconf in '/var/tmp/portage/x11-plugins/compiz-fusion-plugins-main-9999/work/plugins-main' ...
* Running aclocal ... [ ok ]
* Running libtoolize --copy --force --automake ... [ ok ]
* Running aclocal ... [ ok ]
* Running autoconf ... [ ok ]
* Running autoheader ... [ ok ]
* Running automake --add-missing --copy ... [ ok ]
* Running elibtoolize in: plugins-main
* Applying sed-1.5.6.patch ...
Copying file mkinstalldirs
Copying file po/Makefile.in.in
Please add the files
codeset.m4 gettext.m4 glibc21.m4 iconv.m4 isc-posix.m4 lcmessage.m4
progtest.m4
from the /usr/share/aclocal directory to your autoconf macro directory
or directly to your aclocal.m4 file.
You will also need config.guess and config.sub, which you can get from
ftp://ftp.gnu.org/pub/gnu/config/.
* econf: updating plugins-main/config.sub with /usr/share/gnuconfig/config.sub
* econf: updating plugins-main/config.guess with /usr/share/gnuconfig/config.guess
./configure --prefix=/usr --host=i686-pc-linux-gnu --mandir=/usr/share/man --infodir=/usr/share/info --datadir=/usr/share --sysconfdir=/etc --localstatedir=/var/lib --build=i686-pc-linux-gnu
checking for a BSD-compatible install... /usr/bin/install -c
checking whether build environment is sane... yes
checking for a thread-safe mkdir -p... /bin/mkdir -p
checking for gawk... gawk
checking whether make sets $(MAKE)... yes
checking whether to enable maintainer-specific portions of Makefiles... no
checking for style of include used by make... GNU
checking for i686-pc-linux-gnu-gcc... i686-pc-linux-gnu-gcc
checking for C compiler default output file name... a.out
checking whether the C compiler works... yes
checking whether we are cross compiling... no
checking for suffix of executables...
checking for suffix of object files... o
checking whether we are using the GNU C compiler... yes
checking whether i686-pc-linux-gnu-gcc accepts -g... yes
checking for i686-pc-linux-gnu-gcc option to accept ISO C89... none needed
checking dependency style of i686-pc-linux-gnu-gcc... gcc3
checking for library containing strerror... none required
checking for i686-pc-linux-gnu-gcc... (cached) i686-pc-linux-gnu-gcc
checking whether we are using the GNU C compiler... (cached) yes
checking whether i686-pc-linux-gnu-gcc accepts -g... (cached) yes
checking for i686-pc-linux-gnu-gcc option to accept ISO C89... (cached) none needed
checking dependency style of i686-pc-linux-gnu-gcc... (cached) gcc3
checking how to run the C preprocessor... i686-pc-linux-gnu-gcc -E
checking build system type... i686-pc-linux-gnu
checking host system type... i686-pc-linux-gnu
checking for a sed that does not truncate output... /bin/sed
checking for grep that handles long lines and -e... /bin/grep
checking for egrep... /bin/grep -E
checking for ld used by i686-pc-linux-gnu-gcc... /usr/i686-pc-linux-gnu/bin/ld
checking if the linker (/usr/i686-pc-linux-gnu/bin/ld) is GNU ld... yes
checking for /usr/i686-pc-linux-gnu/bin/ld option to reload object files... -r
checking for BSD-compatible nm... /usr/bin/nm -B
checking whether ln -s works... yes
checking how to recognize dependent libraries... pass_all
checking for ANSI C header files... yes
checking for sys/types.h... yes
checking for sys/stat.h... yes
checking for stdlib.h... yes
checking for string.h... yes
checking for memory.h... yes
checking for strings.h... yes
checking for inttypes.h... yes
checking for stdint.h... yes
checking for unistd.h... yes
checking dlfcn.h usability... yes
checking dlfcn.h presence... yes
checking for dlfcn.h... yes
checking for i686-pc-linux-gnu-g++... i686-pc-linux-gnu-g++
checking whether we are using the GNU C++ compiler... yes
checking whether i686-pc-linux-gnu-g++ accepts -g... yes
checking dependency style of i686-pc-linux-gnu-g++... gcc3
checking how to run the C++ preprocessor... i686-pc-linux-gnu-g++ -E
checking for i686-pc-linux-gnu-g77... no
checking for i686-pc-linux-gnu-xlf... no
checking for i686-pc-linux-gnu-f77... no
checking for i686-pc-linux-gnu-frt... no
checking for i686-pc-linux-gnu-pgf77... no
checking for i686-pc-linux-gnu-cf77... no
checking for i686-pc-linux-gnu-fort77... no
checking for i686-pc-linux-gnu-fl32... no
checking for i686-pc-linux-gnu-af77... no
checking for i686-pc-linux-gnu-xlf90... no
checking for i686-pc-linux-gnu-f90... no
checking for i686-pc-linux-gnu-pgf90... no
checking for i686-pc-linux-gnu-pghpf... no
checking for i686-pc-linux-gnu-epcf90... no
checking for i686-pc-linux-gnu-gfortran... i686-pc-linux-gnu-gfortran
checking whether we are using the GNU Fortran 77 compiler... yes
checking whether i686-pc-linux-gnu-gfortran accepts -g... yes
checking the maximum length of command line arguments... 98304
checking command to parse /usr/bin/nm -B output from i686-pc-linux-gnu-gcc object... ok
checking for objdir... .libs
checking for i686-pc-linux-gnu-ar... i686-pc-linux-gnu-ar
checking for i686-pc-linux-gnu-ranlib... i686-pc-linux-gnu-ranlib
checking for i686-pc-linux-gnu-strip... i686-pc-linux-gnu-strip
checking for correct ltmain.sh version... yes
checking if i686-pc-linux-gnu-gcc supports -fno-rtti -fno-exceptions... no
checking for i686-pc-linux-gnu-gcc option to produce PIC... -fPIC
checking if i686-pc-linux-gnu-gcc PIC flag -fPIC works... yes
checking if i686-pc-linux-gnu-gcc static flag -static works... yes
checking if i686-pc-linux-gnu-gcc supports -c -o file.o... yes
checking whether the i686-pc-linux-gnu-gcc linker (/usr/i686-pc-linux-gnu/bin/ld) supports shared libraries... yes
checking whether -lc should be explicitly linked in... no
checking dynamic linker characteristics... GNU/Linux ld.so
checking how to hardcode library paths into programs... immediate
checking whether stripping libraries is possible... yes
checking if libtool supports shared libraries... yes
checking whether to build shared libraries... yes
checking whether to build static libraries... yes
configure: creating libtool
appending configuration tag "CXX" to libtool
checking for ld used by i686-pc-linux-gnu-g++... /usr/i686-pc-linux-gnu/bin/ld
checking if the linker (/usr/i686-pc-linux-gnu/bin/ld) is GNU ld... yes
checking whether the i686-pc-linux-gnu-g++ linker (/usr/i686-pc-linux-gnu/bin/ld) supports shared libraries... yes
checking for i686-pc-linux-gnu-g++ option to produce PIC... -fPIC
checking if i686-pc-linux-gnu-g++ PIC flag -fPIC works... yes
checking if i686-pc-linux-gnu-g++ static flag -static works... yes
checking if i686-pc-linux-gnu-g++ supports -c -o file.o... yes
checking whether the i686-pc-linux-gnu-g++ linker (/usr/i686-pc-linux-gnu/bin/ld) supports shared libraries... yes
checking dynamic linker characteristics... GNU/Linux ld.so
checking how to hardcode library paths into programs... immediate
appending configuration tag "F77" to libtool
checking if libtool supports shared libraries... yes
checking whether to build shared libraries... yes
checking whether to build static libraries... yes
checking for i686-pc-linux-gnu-gfortran option to produce PIC... -fPIC
checking if i686-pc-linux-gnu-gfortran PIC flag -fPIC works... yes
checking if i686-pc-linux-gnu-gfortran static flag -static works... yes
checking if i686-pc-linux-gnu-gfortran supports -c -o file.o... yes
checking whether the i686-pc-linux-gnu-gfortran linker (/usr/i686-pc-linux-gnu/bin/ld) supports shared libraries... yes
checking dynamic linker characteristics... GNU/Linux ld.so
checking how to hardcode library paths into programs... immediate
checking for ANSI C header files... (cached) yes
checking for stdlib.h... (cached) yes
checking sys/time.h usability... yes
checking sys/time.h presence... yes
checking for sys/time.h... yes
checking for unistd.h... (cached) yes
checking for intltool >= 0.35.0... 0.35.5 found
checking for perl... /usr/bin/perl
checking for XML::Parser... ok
checking for iconv... /usr/bin/iconv
checking for msgfmt... /usr/bin/msgfmt
checking for msgmerge... /usr/bin/msgmerge
checking for xgettext... /usr/bin/xgettext
checking locale.h usability... yes
checking locale.h presence... yes
checking for locale.h... yes
checking for LC_MESSAGES... yes
checking libintl.h usability... yes
checking libintl.h presence... yes
checking for libintl.h... yes
checking for ngettext in libc... yes
checking for dgettext in libc... yes
checking for bind_textdomain_codeset... yes
checking for msgfmt... /usr/bin/msgfmt
checking for dcgettext... yes
checking if msgfmt accepts -c... yes
checking for gmsgfmt... /usr/bin/gmsgfmt
checking for xgettext... /usr/bin/xgettext
checking whether byte ordering is bigendian... no
configure: Using PKG_CONFIG_PATH=/usr/lib/pkgconfig:/usr/qt/3/lib/pkgconfig
checking for i686-pc-linux-gnu-pkg-config... no
checking for pkg-config... /usr/bin/pkg-config
checking pkg-config is at least version 0.9.0... yes
checking for COMPIZ... yes
checking for BCOP... yes
checking for GL_CFLAGS...
checking for GL_LIBS... -lGL
checking for SCALE... yes
checking for CAIRO... yes
checking for PANGO... yes
Using config source xml:merged:/etc/gconf/gconf.xml.defaults for schema installation
Using $(sysconfdir)/gconf/schemas as install directory for schema files
configure: creating ./config.status
config.status: creating compiz-text.pc
config.status: creating data/Makefile
config.status: creating data/filters/Makefile
config.status: creating Makefile
config.status: creating metadata/Makefile
config.status: creating include/Makefile
config.status: creating src/Makefile
config.status: creating src/animation/Makefile
config.status: creating src/colorfilter/Makefile
config.status: creating src/expo/Makefile
config.status: creating src/ezoom/Makefile
config.status: creating src/jpeg/Makefile
config.status: creating src/neg/Makefile
config.status: creating src/opacify/Makefile
config.status: creating src/put/Makefile
config.status: creating src/resizeinfo/Makefile
config.status: creating src/ring/Makefile
config.status: creating src/scaleaddon/Makefile
config.status: creating src/snap/Makefile
config.status: creating src/text/Makefile
config.status: creating src/thumbnail/Makefile
config.status: creating src/wall/Makefile
config.status: creating src/winrules/Makefile
config.status: creating src/workarounds/Makefile
config.status: creating src/vpswitch/Makefile
config.status: creating src/shift/Makefile
config.status: creating po/Makefile.in
config.status: creating config.h
config.status: executing depfiles commands
config.status: executing intltool commands
config.status: executing default-1 commands
config.status: executing po/stamp-it commands
make all-recursive
make[1]: Entering directory `/var/tmp/portage/x11-plugins/compiz-fusion-plugins-main-9999/work/plugins-main'
Making all in metadata
make[2]: Entering directory `/var/tmp/portage/x11-plugins/compiz-fusion-plugins-main-9999/work/plugins-main/metadata'
LC_ALL=C ../intltool-merge -x -u -c ../po/.intltool-merge-cache ../po animation.xml.in animation.xml
Generating and caching the translation database
Merging translations into animation.xml.
CREATED animation.xml
LC_ALL=C ../intltool-merge -x -u -c ../po/.intltool-merge-cache ../po colorfilter.xml.in colorfilter.xml
Found cached translation database
Merging translations into colorfilter.xml.
CREATED colorfilter.xml
LC_ALL=C ../intltool-merge -x -u -c ../po/.intltool-merge-cache ../po expo.xml.in expo.xml
Found cached translation database
Merging translations into expo.xml.
CREATED expo.xml
LC_ALL=C ../intltool-merge -x -u -c ../po/.intltool-merge-cache ../po ezoom.xml.in ezoom.xml
Found cached translation database
Merging translations into ezoom.xml.
CREATED ezoom.xml
LC_ALL=C ../intltool-merge -x -u -c ../po/.intltool-merge-cache ../po imgjpeg.xml.in imgjpeg.xml
Found cached translation database
Merging translations into imgjpeg.xml.
CREATED imgjpeg.xml
LC_ALL=C ../intltool-merge -x -u -c ../po/.intltool-merge-cache ../po neg.xml.in neg.xml
Found cached translation database
Merging translations into neg.xml.
CREATED neg.xml
LC_ALL=C ../intltool-merge -x -u -c ../po/.intltool-merge-cache ../po opacify.xml.in opacify.xml
Found cached translation database
Merging translations into opacify.xml.
CREATED opacify.xml
LC_ALL=C ../intltool-merge -x -u -c ../po/.intltool-merge-cache ../po put.xml.in put.xml
Found cached translation database
Merging translations into put.xml.
CREATED put.xml
LC_ALL=C ../intltool-merge -x -u -c ../po/.intltool-merge-cache ../po resizeinfo.xml.in resizeinfo.xml
Found cached translation database
Merging translations into resizeinfo.xml.
CREATED resizeinfo.xml
LC_ALL=C ../intltool-merge -x -u -c ../po/.intltool-merge-cache ../po ring.xml.in ring.xml
Found cached translation database
Merging translations into ring.xml.
CREATED ring.xml
LC_ALL=C ../intltool-merge -x -u -c ../po/.intltool-merge-cache ../po snap.xml.in snap.xml
Found cached translation database
Merging translations into snap.xml.
CREATED snap.xml
LC_ALL=C ../intltool-merge -x -u -c ../po/.intltool-merge-cache ../po text.xml.in text.xml
Found cached translation database
Merging translations into text.xml.
CREATED text.xml
LC_ALL=C ../intltool-merge -x -u -c ../po/.intltool-merge-cache ../po thumbnail.xml.in thumbnail.xml
Found cached translation database
Merging translations into thumbnail.xml.
CREATED thumbnail.xml
LC_ALL=C ../intltool-merge -x -u -c ../po/.intltool-merge-cache ../po wall.xml.in wall.xml
Found cached translation database
Merging translations into wall.xml.
CREATED wall.xml
LC_ALL=C ../intltool-merge -x -u -c ../po/.intltool-merge-cache ../po winrules.xml.in winrules.xml
Found cached translation database
Merging translations into winrules.xml.
CREATED winrules.xml
LC_ALL=C ../intltool-merge -x -u -c ../po/.intltool-merge-cache ../po workarounds.xml.in workarounds.xml
Found cached translation database
Merging translations into workarounds.xml.
CREATED workarounds.xml
LC_ALL=C ../intltool-merge -x -u -c ../po/.intltool-merge-cache ../po scaleaddon.xml.in scaleaddon.xml
Found cached translation database
Merging translations into scaleaddon.xml.
CREATED scaleaddon.xml
LC_ALL=C ../intltool-merge -x -u -c ../po/.intltool-merge-cache ../po vpswitch.xml.in vpswitch.xml
Found cached translation database
Merging translations into vpswitch.xml.
CREATED vpswitch.xml
LC_ALL=C ../intltool-merge -x -u -c ../po/.intltool-merge-cache ../po shift.xml.in shift.xml
Found cached translation database
Merging translations into shift.xml.
CREATED shift.xml
make[2]: Leaving directory `/var/tmp/portage/x11-plugins/compiz-fusion-plugins-main-9999/work/plugins-main/metadata'
Making all in src
make[2]: Entering directory `/var/tmp/portage/x11-plugins/compiz-fusion-plugins-main-9999/work/plugins-main/src'
Making all in animation
make[3]: Entering directory `/var/tmp/portage/x11-plugins/compiz-fusion-plugins-main-9999/work/plugins-main/src/animation'
/bin/sh ../../libtool --tag=CC --mode=compile i686-pc-linux-gnu-gcc -DHAVE_CONFIG_H -I. -I../.. -I../../include -DPNG_NO_MMX_CODE -I/usr/include/libpng12 -I/usr/include/libxml2 -I/usr/include/startup-notification-1.0 -I/usr/include/compiz -DDATADIR='"/usr/share/compiz"' -DLIBDIR='"/usr/lib"' -DLOCALEDIR="\"/usr/share/locale\"" -DIMAGEDIR='"/usr/share/compiz"' -march=prescott -O2 -pipe -fomit-frame-pointer -Wall -Wpointer-arith -Wstrict-prototypes -Wmissing-prototypes -Wmissing-declarations -Wnested-externs -fno-strict-aliasing -MT animation.lo -MD -MP -MF .deps/animation.Tpo -c -o animation.lo animation.c
mkdir .libs
i686-pc-linux-gnu-gcc -DHAVE_CONFIG_H -I. -I../.. -I../../include -DPNG_NO_MMX_CODE -I/usr/include/libpng12 -I/usr/include/libxml2 -I/usr/include/startup-notification-1.0 -I/usr/include/compiz -DDATADIR=\"/usr/share/compiz\" -DLIBDIR=\"/usr/lib\" -DLOCALEDIR=\"/usr/share/locale\" -DIMAGEDIR=\"/usr/share/compiz\" -march=prescott -O2 -pipe -fomit-frame-pointer -Wall -Wpointer-arith -Wstrict-prototypes -Wmissing-prototypes -Wmissing-declarations -Wnested-externs -fno-strict-aliasing -MT animation.lo -MD -MP -MF .deps/animation.Tpo -c animation.c -fPIC -DPIC -o .libs/animation.o
In file included from animation.c:89:
animation-internal.h:17:25: error: compiz-core.h: No such file or directory
In file included from animation.c:89:
animation-internal.h:112: error: expected specifier-qualifier-list before 'Box'
animation-internal.h:149: error: expected specifier-qualifier-list before 'Box'
animation-internal.h:175: error: expected specifier-qualifier-list before 'Bool'
animation-internal.h:278: error: expected specifier-qualifier-list before 'Bool'
animation-internal.h:379: error: expected specifier-qualifier-list before 'CompWindow'
animation-internal.h:386: error: expected specifier-qualifier-list before 'CompOptionValue'
animation-internal.h:402: error: expected '=', ',', ';', 'asm' or '__attribute__' before 'animMetadata'
animation-internal.h:407: error: expected specifier-qualifier-list before 'Atom'
animation-internal.h:529: error: expected specifier-qualifier-list before 'PreparePaintScreenProc'
animation-internal.h:587: error: expected specifier-qualifier-list before 'Region'
animation-internal.h:671: error: expected declaration specifiers or '...' before 'CompWindow'
animation-internal.h:672: error: expected declaration specifiers or '...' before 'WindowPaintAttrib'
animation-internal.h:673: error: expected ')' before '*' token
animation-internal.h:674: error: expected ';' before 'void'
animation-internal.h:760: error: expected ')' before '*' token
animation-internal.h:779: error: expected '=', ',', ';', 'asm' or '__attribute__' before 'polygonsAnimStep'
animation-internal.h:784: error: expected ')' before '*' token
animation-internal.h:789: error: expected '=', ',', ';', 'asm' or '__attribute__' before 'defaultAnimStep'
animation-internal.h:794: error: expected ')' before '*' token
animation-internal.h:799: error: expected declaration specifiers or '...' before 'CompWindow'
animation-internal.h:800: error: expected declaration specifiers or '...' before 'WindowPaintAttrib'
animation-internal.h:803: error: expected ')' before '*' token
animation-internal.h:808: error: expected '=', ',', ';', 'asm' or '__attribute__' before 'animZoomToIcon'
animation-internal.h:811: error: expected ')' before '*' token
animation-internal.h:814: error: expected '=', ',', ';', 'asm' or '__attribute__' before 'getMousePointerXY'
animation-internal.h:817: error: expected ')' before '*' token
animation-internal.h:820: error: expected ')' before '*' token
animation-internal.h:823: error: expected ')' before '*' token
animation-internal.h:827: error: expected ')' before '*' token
animation-internal.h:831: error: expected ')' before '*' token
animation-internal.h:835: error: expected ')' before '*' token
animation-internal.h:843: error: expected ')' before '*' token
animation-internal.h:847: error: expected '=', ',', ';', 'asm' or '__attribute__' before 'fxAirplane3DAnimStep'
animation-internal.h:852: error: expected ')' before '*' token
animation-internal.h:857: error: expected ')' before '*' token
animation-internal.h:868: error: expected declaration specifiers or '...' before 'CompWindow'
animation-internal.h:869: error: expected declaration specifiers or '...' before 'WindowPaintAttrib'
animation-internal.h:872: error: expected '=', ',', ';', 'asm' or '__attribute__' before 'fxBeamUpModelStep'
animation-internal.h:876: error: expected ')' before '*' token
animation-internal.h:883: error: expected '=', ',', ';', 'asm' or '__attribute__' before 'fxBurnModelStep'
animation-internal.h:887: error: expected ')' before '*' token
animation-internal.h:894: error: expected '=', ',', ';', 'asm' or '__attribute__' before 'fxCurvedFoldModelStep'
animation-internal.h:900: error: expected declaration specifiers or '...' before 'CompWindow'
animation-internal.h:901: error: expected declaration specifiers or '...' before 'WindowPaintAttrib'
animation-internal.h:906: error: expected ')' before '*' token
animation-internal.h:910: error: expected ')' before '*' token
animation-internal.h:915: error: expected '=', ',', ';', 'asm' or '__attribute__' before 'fxDodgeAnimStep'
animation-internal.h:920: error: expected ')' before '*' token
animation-internal.h:926: error: expected ')' before '*' token
animation-internal.h:933: error: expected ')' before '*' token
animation-internal.h:937: error: expected '=', ',', ';', 'asm' or '__attribute__' before 'fxDreamModelStep'
animation-internal.h:943: error: expected declaration specifiers or '...' before 'CompWindow'
animation-internal.h:944: error: expected declaration specifiers or '...' before 'WindowPaintAttrib'
animation-internal.h:950: error: expected ')' before '*' token
animation-internal.h:958: error: expected declaration specifiers or '...' before 'CompWindow'
animation-internal.h:959: error: expected declaration specifiers or '...' before 'WindowPaintAttrib'
animation-internal.h:966: error: expected declaration specifiers or '...' before 'CompWindow'
animation-internal.h:967: error: expected declaration specifiers or '...' before 'WindowPaintAttrib'
animation-internal.h:972: error: expected ')' before '*' token
animation-internal.h:975: error: expected ')' before '*' token
animation-internal.h:983: error: expected ')' before '*' token
animation-internal.h:988: error: expected declaration specifiers or '...' before 'CompWindow'
animation-internal.h:989: error: expected declaration specifiers or '...' before 'WindowPaintAttrib'
animation-internal.h:992: error: expected '=', ',', ';', 'asm' or '__attribute__' before 'fxGlideAnimStep'
animation-internal.h:1000: error: expected ')' before '*' token
animation-internal.h:1005: error: expected '=', ',', ';', 'asm' or '__attribute__' before 'fxGlideIsPolygonBased'
animation-internal.h:1008: error: expected '=', ',', ';', 'asm' or '__attribute__' before 'fxGlideLetOthersDrawGeoms'
animation-internal.h:1011: error: expected ')' before '*' token
animation-internal.h:1014: error: expected ')' before '*' token
animation-internal.h:1017: error: expected ')' before '*' token
animation-internal.h:1023: error: expected '=', ',', ';', 'asm' or '__attribute__' before 'fxHorizontalFoldsModelStep'
animation-internal.h:1037: error: expected ')' before '*' token
animation-internal.h:1056: error: expected ')' before '*' token
animation-internal.h:1060: error: expected '=', ',', ';', 'asm' or '__attribute__' before 'fxMagicLampModelStep'
animation-internal.h:1067: error: expected ')' before '*' token
animation-internal.h:1074: error: expected '=', ',', ';', 'asm' or '__attribute__' before '*' token
animation-internal.h:1080: error: expected '=', ',', ';', 'asm' or '__attribute__' before 'animGetB'
animation-internal.h:1111: error: expected ')' before '*' token
animation-internal.h:1123: error: expected ')' before '*' token
animation-internal.h:1127: error: expected ')' before '*' token
animation-internal.h:1133: error: expected '=', ',', ';', 'asm' or '__attribute__' before 'tessellateIntoRectangles'
animation-internal.h:1139: error: expected '=', ',', ';', 'asm' or '__attribute__' before 'tessellateIntoHexagons'
animation-internal.h:1145: error: expected ')' before '*' token
animation-internal.h:1151: error: expected ')' before '*' token
animation-internal.h:1155: error: expected ')' before '*' token
animation-internal.h:1159: error: expected ')' before '*' token
animation-internal.h:1169: error: expected ')' before '*' token
animation-internal.h:1173: error: expected ')' before '*' token
animation-internal.h:1177: error: expected ')' before '*' token
animation-internal.h:1183: error: expected '=', ',', ';', 'asm' or '__attribute__' before 'fxRollUpModelStep'
animation-internal.h:1192: error: expected ')' before '*' token
animation-internal.h:1197: error: expected ')' before '*' token
animation-internal.h:1200: error: expected ')' before '*' token
animation-internal.h:1207: error: expected '=', ',', ';', 'asm' or '__attribute__' before 'fxWaveModelStep'
animation-internal.h:1216: error: expected declaration specifiers or '...' before 'CompWindow'
animation-internal.h:1217: error: expected declaration specifiers or '...' before 'WindowPaintAttrib'
animation-internal.h:1220: error: expected ')' before '*' token
animation-internal.h:1229: error: expected declaration specifiers or '...' before 'Bool'
animation-internal.h:1232: error: expected ')' before '*' token
animation-internal.h:1236: error: expected ')' before '*' token
animation-internal.h:1240: error: expected '=', ',', ';', 'asm' or '__attribute__' before 'fxZoomAnimStep'
animation-internal.h:1245: error: expected ')' before '*' token
animation.c:92: error: expected '=', ',', ';', 'asm' or '__attribute__' before 'animMetadata'
animation.c:172: error: expected ')' before '*' token
animation.c:185: error: expected '=', ',', ';', 'asm' or '__attribute__' before 'animZoomToIcon'
animation.c:205: error: expected ')' before '*' token
animation.c:219: error: expected '=', ',', ';', 'asm' or '__attribute__' before 'defaultLetOthersDrawGeoms'
animation.c:225: error: expected ')' before '*' token
animation.c:266: error: expected ')' before '*' token
animation.c:350: error: expected declaration specifiers or '...' before 'Bool'
animation.c: In function 'animGetAnimEffect':
animation.c:352: error: 'allRandom' undeclared (first use in this function)
animation.c:352: error: (Each undeclared identifier is reported only once
animation.c:352: error: for each function it appears in.)
animation.c: At top level:
animation.c:369: error: expected ')' before '*' token
animation.c: In function 'defaultAnimProgress':
animation.c:422: error: 'AnimWindow' has no member named 'animRemainingTime'
animation.c:422: error: 'AnimWindow' has no member named 'animTotalTime'
animation.c:422: error: 'AnimWindow' has no member named 'timestep'
animation.c:423: warning: implicit declaration of function 'MIN'
animation.c:423: warning: nested extern declaration of 'MIN'
animation.c:424: warning: implicit declaration of function 'MAX'
animation.c:424: warning: nested extern declaration of 'MAX'
animation.c:426: error: 'AnimWindow' has no member named 'curWindowEvent'
animation.c:427: error: 'AnimWindow' has no member named 'curWindowEvent'
animation.c:428: error: 'AnimWindow' has no member named 'curWindowEvent'
animation.c:429: error: 'AnimWindow' has no member named 'curWindowEvent'
animation.c: In function 'sigmoidAnimProgress':
animation.c:438: error: 'AnimWindow' has no member named 'animRemainingTime'
animation.c:438: error: 'AnimWindow' has no member named 'animTotalTime'
animation.c:438: error: 'AnimWindow' has no member named 'timestep'
animation.c:447: error: 'AnimWindow' has no member named 'curWindowEvent'
animation.c:448: error: 'AnimWindow' has no member named 'curWindowEvent'
animation.c:449: error: 'AnimWindow' has no member named 'curWindowEvent'
animation.c:450: error: 'AnimWindow' has no member named 'curWindowEvent'
animation.c: At top level:
animation.c:476: error: expected '=', ',', ';', 'asm' or '__attribute__' before 'defaultAnimStep'
animation.c:511: error: expected declaration specifiers or '...' before 'CompWindow'
animation.c:512: error: expected declaration specifiers or '...' before 'WindowPaintAttrib'
animation.c: In function 'defaultMinimizeUpdateWindowAttrib':
animation.c:514: error: 'w' undeclared (first use in this function)
animation.c:516: warning: implicit declaration of function 'animZoomToIcon'
animation.c:516: warning: nested extern declaration of 'animZoomToIcon'
animation.c:517: error: 'wAttrib' undeclared (first use in this function)
animation.c:517: error: too many arguments to function 'fxZoomUpdateWindowAttrib'
animation.c: At top level:
animation.c:521: error: expected ')' before '*' token
animation.c: In function 'copyResetBB':
animation.c:535: error: 'AnimWindow' has no member named 'lastBB'
animation.c:535: error: 'AnimWindow' has no member named 'BB'
animation.c:535: error: 'Box' undeclared (first use in this function)
animation.c:536: error: 'AnimWindow' has no member named 'BB'
animation.c:536: error: 'AnimWindow' has no member named 'BB'
animation.c:536: error: 'MAXSHORT' undeclared (first use in this function)
animation.c:537: error: 'AnimWindow' has no member named 'BB'
animation.c:537: error: 'AnimWindow' has no member named 'BB'
animation.c:537: error: 'MINSHORT' undeclared (first use in this function)
animation.c: At top level:
animation.c:541: error: expected ')' before '*' token
animation.c:554: error: expected ')' before '*' token
animation.c:581: error: expected ')' before '*' token
animation.c:593: error: expected '=', ',', ';', 'asm' or '__attribute__' before 'expandBoxWithPoints3DTransform'
animation.c:631: error: expected ')' before '*' token
animation.c:669: error: expected ')' before '*' token
animation.c:679: error: expected ')' before '*' token
animation.c:690: error: expected ')' before '*' token
animation.c:705: error: expected ')' before '*' token
animation.c:730: error: expected ')' before '*' token
animation.c:755: warning: excess elements in struct initializer
animation.c:755: warning: (near initialization for 'animEffectProperties[0]')
animation.c:755: warning: excess elements in struct initializer
animation.c:755: warning: (near initialization for 'animEffectProperties[0]')
animation.c:755: warning: excess elements in struct initializer
animation.c:755: warning: (near initialization for 'animEffectProperties[0]')
animation.c:755: warning: excess elements in struct initializer
animation.c:755: warning: (near initialization for 'animEffectProperties[0]')
animation.c:755: warning: excess elements in struct initializer
animation.c:755: warning: (near initialization for 'animEffectProperties[0]')
animation.c:755: warning: excess elements in struct initializer
animation.c:755: warning: (near initialization for 'animEffectProperties[0]')
animation.c:755: warning: excess elements in struct initializer
animation.c:755: warning: (near initialization for 'animEffectProperties[0]')
animation.c:755: warning: excess elements in struct initializer
animation.c:755: warning: (near initialization for 'animEffectProperties[0]')
animation.c:755: warning: excess elements in struct initializer
animation.c:755: warning: (near initialization for 'animEffectProperties[0]')
animation.c:755: warning: excess elements in struct initializer
animation.c:755: warning: (near initialization for 'animEffectProperties[0]')
animation.c:755: warning: excess elements in struct initializer
animation.c:755: warning: (near initialization for 'animEffectProperties[0]')
animation.c:755: warning: excess elements in struct initializer
animation.c:755: warning: (near initialization for 'animEffectProperties[0]')
animation.c:755: warning: excess elements in struct initializer
animation.c:755: warning: (near initialization for 'animEffectProperties[0]')
animation.c:757: warning: excess elements in struct initializer
animation.c:757: warning: (near initialization for 'animEffectProperties[1]')
animation.c:757: warning: excess elements in struct initializer
animation.c:757: warning: (near initialization for 'animEffectProperties[1]')
animation.c:757: warning: excess elements in struct initializer
animation.c:757: warning: (near initialization for 'animEffectProperties[1]')
animation.c:757: warning: excess elements in struct initializer
animation.c:757: warning: (near initialization for 'animEffectProperties[1]')
animation.c:757: warning: excess elements in struct initializer
animation.c:757: warning: (near initialization for 'animEffectProperties[1]')
animation.c:757: warning: excess elements in struct initializer
animation.c:757: warning: (near initialization for 'animEffectProperties[1]')
animation.c:757: warning: excess elements in struct initializer
animation.c:757: warning: (near initialization for 'animEffectProperties[1]')
animation.c:757: warning: excess elements in struct initializer
animation.c:757: warning: (near initialization for 'animEffectProperties[1]')
animation.c:757: warning: excess elements in struct initializer
animation.c:757: warning: (near initialization for 'animEffectProperties[1]')
animation.c:757: warning: excess elements in struct initializer
animation.c:757: warning: (near initialization for 'animEffectProperties[1]')
animation.c:757: warning: excess elements in struct initializer
animation.c:757: warning: (near initialization for 'animEffectProperties[1]')
animation.c:757: warning: excess elements in struct initializer
animation.c:757: warning: (near initialization for 'animEffectProperties[1]')
animation.c:757: warning: excess elements in struct initializer
animation.c:757: warning: (near initialization for 'animEffectProperties[1]')
animation.c:759: error: 'polygonsPrePaintWindow' undeclared here (not in a function)
animation.c:759: warning: excess elements in struct initializer
animation.c:759: warning: (near initialization for 'animEffectProperties[2]')
animation.c:759: error: 'polygonsPostPaintWindow' undeclared here (not in a function)
animation.c:759: warning: excess elements in struct initializer
animation.c:759: warning: (near initialization for 'animEffectProperties[2]')
animation.c:759: error: 'fxAirplane3DAnimStep' undeclared here (not in a function)
animation.c:759: warning: excess elements in struct initializer
animation.c:759: warning: (near initialization for 'animEffectProperties[2]')
animation.c:760: error: 'fxAirplane3DInit' undeclared here (not in a function)
animation.c:760: warning: excess elements in struct initializer
animation.c:760: warning: (near initialization for 'animEffectProperties[2]')
animation.c:760: warning: excess elements in struct initializer
animation.c:760: warning: (near initialization for 'animEffectProperties[2]')
animation.c:760: error: 'polygonsStoreClips' undeclared here (not in a function)
animation.c:760: warning: excess elements in struct initializer
animation.c:760: warning: (near initialization for 'animEffectProperties[2]')
animation.c:760: error: 'polygonsDrawCustomGeometry' undeclared here (not in a function)
animation.c:760: warning: excess elements in struct initializer
animation.c:760: warning: (near initialization for 'animEffectProperties[2]')
animation.c:760: warning: excess elements in struct initializer
animation.c:760: warning: (near initialization for 'animEffectProperties[2]')
animation.c:761: error: 'fxAirplane3DLinearAnimStepPolygon' undeclared here (not in a function)
animation.c:761: warning: excess elements in struct initializer
animation.c:761: warning: (near initialization for 'animEffectProperties[2]')
animation.c:761: warning: excess elements in struct initializer
animation.c:761: warning: (near initialization for 'animEffectProperties[2]')
animation.c:761: warning: excess elements in struct initializer
animation.c:761: warning: (near initialization for 'animEffectProperties[2]')
animation.c:761: warning: excess elements in struct initializer
animation.c:761: warning: (near initialization for 'animEffectProperties[2]')
animation.c:761: error: 'updateBBScreen' undeclared here (not in a function)
animation.c:761: warning: excess elements in struct initializer
animation.c:761: warning: (near initialization for 'animEffectProperties[2]')
animation.c:763: warning: excess elements in struct initializer
animation.c:763: warning: (near initialization for 'animEffectProperties[3]')
animation.c:763: error: 'drawParticleSystems' undeclared here (not in a function)
animation.c:763: warning: excess elements in struct initializer
animation.c:763: warning: (near initialization for 'animEffectProperties[3]')
animation.c:763: error: 'fxBeamUpModelStep' undeclared here (not in a function)
animation.c:763: warning: excess elements in struct initializer
animation.c:763: warning: (near initialization for 'animEffectProperties[3]')
animation.c:764: error: 'fxBeamUpInit' undeclared here (not in a function)
animation.c:764: warning: excess elements in struct initializer
animation.c:764: warning: (near initialization for 'animEffectProperties[3]')
animation.c:764: warning: excess elements in struct initializer
animation.c:764: warning: (near initialization for 'animEffectProperties[3]')
animation.c:764: warning: excess elements in struct initializer
animation.c:764: warning: (near initialization for 'animEffectProperties[3]')
animation.c:764: warning: excess elements in struct initializer
animation.c:764: warning: (near initialization for 'animEffectProperties[3]')
animation.c:764: warning: excess elements in struct initializer
animation.c:764: warning: (near initialization for 'animEffectProperties[3]')
animation.c:764: warning: excess elements in struct initializer
animation.c:764: warning: (near initialization for 'animEffectProperties[3]')
animation.c:764: warning: excess elements in struct initializer
animation.c:764: warning: (near initialization for 'animEffectProperties[3]')
animation.c:764: warning: excess elements in struct initializer
animation.c:764: warning: (near initialization for 'animEffectProperties[3]')
animation.c:764: warning: excess elements in struct initializer
animation.c:764: warning: (near initialization for 'animEffectProperties[3]')
animation.c:764: error: 'particlesUpdateBB' undeclared here (not in a function)
animation.c:764: warning: excess elements in struct initializer
animation.c:764: warning: (near initialization for 'animEffectProperties[3]')
animation.c:766: warning: excess elements in struct initializer
animation.c:766: warning: (near initialization for 'animEffectProperties[4]')
animation.c:766: warning: excess elements in struct initializer
animation.c:766: warning: (near initialization for 'animEffectProperties[4]')
animation.c:766: error: 'fxBurnModelStep' undeclared here (not in a function)
animation.c:766: warning: excess elements in struct initializer
animation.c:766: warning: (near initialization for 'animEffectProperties[4]')
animation.c:766: error: 'fxBurnInit' undeclared here (not in a function)
animation.c:766: warning: excess elements in struct initializer
animation.c:766: warning: (near initialization for 'animEffectProperties[4]')
animation.c:766: warning: excess elements in struct initializer
animation.c:766: warning: (near initialization for 'animEffectProperties[4]')
animation.c:766: warning: excess elements in struct initializer
animation.c:766: warning: (near initialization for 'animEffectProperties[4]')
animation.c:766: warning: excess elements in struct initializer
animation.c:766: warning: (near initialization for 'animEffectProperties[4]')
animation.c:766: warning: excess elements in struct initializer
animation.c:766: warning: (near initialization for 'animEffectProperties[4]')
animation.c:766: warning: excess elements in struct initializer
animation.c:766: warning: (near initialization for 'animEffectProperties[4]')
animation.c:767: warning: excess elements in struct initializer
animation.c:767: warning: (near initialization for 'animEffectProperties[4]')
animation.c:767: warning: excess elements in struct initializer
animation.c:767: warning: (near initialization for 'animEffectProperties[4]')
animation.c:767: warning: excess elements in struct initializer
animation.c:767: warning: (near initialization for 'animEffectProperties[4]')
animation.c:767: warning: excess elements in struct initializer
animation.c:767: warning: (near initialization for 'animEffectProperties[4]')
animation.c:769: warning: excess elements in struct initializer
animation.c:769: warning: (near initialization for 'animEffectProperties[5]')
animation.c:769: warning: excess elements in struct initializer
animation.c:769: warning: (near initialization for 'animEffectProperties[5]')
animation.c:769: error: 'fxCurvedFoldModelStep' undeclared here (not in a function)
animation.c:769: warning: excess elements in struct initializer
animation.c:769: warning: (near initialization for 'animEffectProperties[5]')
animation.c:770: error: 'defaultMinimizeAnimInit' undeclared here (not in a function)
animation.c:770: warning: excess elements in struct initializer
animation.c:770: warning: (near initialization for 'animEffectProperties[5]')
animation.c:770: warning: excess elements in struct initializer
animation.c:770: warning: (near initialization for 'animEffectProperties[5]')
animation.c:770: warning: excess elements in struct initializer
animation.c:770: warning: (near initialization for 'animEffectProperties[5]')
animation.c:770: warning: excess elements in struct initializer
animation.c:770: warning: (near initialization for 'animEffectProperties[5]')
animation.c:770: warning: excess elements in struct initializer
animation.c:770: warning: (near initialization for 'animEffectProperties[5]')
animation.c:770: warning: excess elements in struct initializer
animation.c:770: warning: (near initialization for 'animEffectProperties[5]')
animation.c:770: warning: excess elements in struct initializer
animation.c:770: warning: (near initialization for 'animEffectProperties[5]')
animation.c:771: error: 'defaultMinimizeUpdateWindowTransform' undeclared here (not in a function)
animation.c:771: warning: excess elements in struct initializer
animation.c:771: warning: (near initialization for 'animEffectProperties[5]')
animation.c:771: warning: excess elements in struct initializer
animation.c:771: warning: (near initialization for 'animEffectProperties[5]')
animation.c:771: error: 'modelUpdateBB' undeclared here (not in a function)
animation.c:771: warning: excess elements in struct initializer
animation.c:771: warning: (near initialization for 'animEffectProperties[5]')
animation.c:773: warning: excess elements in struct initializer
animation.c:773: warning: (near initialization for 'animEffectProperties[6]')
animation.c:773: warning: excess elements in struct initializer
animation.c:773: warning: (near initialization for 'animEffectProperties[6]')
animation.c:773: error: 'fxDodgeAnimStep' undeclared here (not in a function)
animation.c:773: warning: excess elements in struct initializer
animation.c:773: warning: (near initialization for 'animEffectProperties[6]')
animation.c:773: error: 'defaultAnimInit' undeclared here (not in a function)
animation.c:773: warning: excess elements in struct initializer
animation.c:773: warning: (near initialization for 'animEffectProperties[6]')
animation.c:773: warning: excess elements in struct initializer
animation.c:773: warning: (near initialization for 'animEffectProperties[6]')
animation.c:773: warning: excess elements in struct initializer
animation.c:773: warning: (near initialization for 'animEffectProperties[6]')
animation.c:773: warning: excess elements in struct initializer
animation.c:773: warning: (near initialization for 'animEffectProperties[6]')
animation.c:773: warning: excess elements in struct initializer
animation.c:773: warning: (near initialization for 'animEffectProperties[6]')
animation.c:773: warning: excess elements in struct initializer
animation.c:773: warning: (near initialization for 'animEffectProperties[6]')
animation.c:774: error: 'defaultLetOthersDrawGeoms' undeclared here (not in a function)
animation.c:774: warning: excess elements in struct initializer
animation.c:774: warning: (near initialization for 'animEffectProperties[6]')
animation.c:775: error: 'fxDodgeUpdateWindowTransform' undeclared here (not in a function)
animation.c:775: warning: excess elements in struct initializer
animation.c:775: warning: (near initialization for 'animEffectProperties[6]')
animation.c:775: error: 'fxDodgePostPreparePaintScreen' undeclared here (not in a function)
animation.c:775: warning: excess elements in struct initializer
animation.c:775: warning: (near initialization for 'animEffectProperties[6]')
animation.c:776: error: 'fxDodgeUpdateBB' undeclared here (not in a function)
animation.c:776: warning: excess elements in struct initializer
animation.c:776: warning: (near initialization for 'animEffectProperties[6]')
animation.c:778: warning: excess elements in struct initializer
animation.c:778: warning: (near initialization for 'animEffectProperties[7]')
animation.c:778: warning: excess elements in struct initializer
animation.c:778: warning: (near initialization for 'animEffectProperties[7]')
animation.c:778: error: 'polygonsAnimStep' undeclared here (not in a function)
animation.c:778: warning: excess elements in struct initializer
animation.c:778: warning: (near initialization for 'animEffectProperties[7]')
animation.c:779: error: 'fxDomino3DInit' undeclared here (not in a function)
animation.c:779: warning: excess elements in struct initializer
animation.c:779: warning: (near initialization for 'animEffectProperties[7]')
animation.c:779: warning: excess elements in struct initializer
animation.c:779: warning: (near initialization for 'animEffectProperties[7]')
animation.c:779: warning: excess elements in struct initializer
animation.c:779: warning: (near initialization for 'animEffectProperties[7]')
animation.c:779: warning: excess elements in struct initializer
animation.c:779: warning: (near initialization for 'animEffectProperties[7]')
animation.c:779: warning: excess elements in struct initializer
animation.c:779: warning: (near initialization for 'animEffectProperties[7]')
animation.c:780: error: 'polygonsLinearAnimStepPolygon' undeclared here (not in a function)
animation.c:780: warning: excess elements in struct initializer
animation.c:780: warning: (near initialization for 'animEffectProperties[7]')
animation.c:780: warning: excess elements in struct initializer
animation.c:780: warning: (near initialization for 'animEffectProperties[7]')
animation.c:780: warning: excess elements in struct initializer
animation.c:780: warning: (near initialization for 'animEffectProperties[7]')
animation.c:780: warning: excess elements in struct initializer
animation.c:780: warning: (near initialization for 'animEffectProperties[7]')
animation.c:780: error: 'polygonsUpdateBB' undeclared here (not in a function)
animation.c:780: warning: excess elements in struct initializer
animation.c:780: warning: (near initialization for 'animEffectProperties[7]')
animation.c:782: warning: excess elements in struct initializer
animation.c:782: warning: (near initialization for 'animEffectProperties[8]')
animation.c:782: warning: excess elements in struct initializer
animation.c:782: warning: (near initialization for 'animEffectProperties[8]')
animation.c:782: error: 'fxDreamModelStep' undeclared here (not in a function)
animation.c:782: warning: excess elements in struct initializer
animation.c:782: warning: (near initialization for 'animEffectProperties[8]')
animation.c:782: error: 'fxDreamAnimInit' undeclared here (not in a function)
animation.c:782: warning: excess elements in struct initializer
animation.c:782: warning: (near initialization for 'animEffectProperties[8]')
animation.c:783: warning: excess elements in struct initializer
animation.c:783: warning: (near initialization for 'animEffectProperties[8]')
animation.c:783: warning: excess elements in struct initializer
animation.c:783: warning: (near initialization for 'animEffectProperties[8]')
animation.c:783: warning: excess elements in struct initializer
animation.c:783: warning: (near initialization for 'animEffectProperties[8]')
animation.c:783: warning: excess elements in struct initializer
animation.c:783: warning: (near initialization for 'animEffectProperties[8]')
animation.c:783: warning: excess elements in struct initializer
animation.c:783: warning: (near initialization for 'animEffectProperties[8]')
animation.c:783: warning: excess elements in struct initializer
animation.c:783: warning: (near initialization for 'animEffectProperties[8]')
animation.c:783: warning: excess elements in struct initializer
animation.c:783: warning: (near initialization for 'animEffectProperties[8]')
animation.c:784: warning: excess elements in struct initializer
animation.c:784: warning: (near initialization for 'animEffectProperties[8]')
animation.c:784: warning: excess elements in struct initializer
animation.c:784: warning: (near initialization for 'animEffectProperties[8]')
animation.c:786: warning: excess elements in struct initializer
animation.c:786: warning: (near initialization for 'animEffectProperties[9]')
animation.c:786: warning: excess elements in struct initializer
animation.c:786: warning: (near initialization for 'animEffectProperties[9]')
animation.c:786: warning: excess elements in struct initializer
animation.c:786: warning: (near initialization for 'animEffectProperties[9]')
animation.c:787: error: 'fxExplode3DInit' undeclared here (not in a function)
animation.c:787: warning: excess elements in struct initializer
animation.c:787: warning: (near initialization for 'animEffectProperties[9]')
animation.c:787: warning: excess elements in struct initializer
animation.c:787: warning: (near initialization for 'animEffectProperties[9]')
animation.c:787: warning: excess elements in struct initializer
animation.c:787: warning: (near initialization for 'animEffectProperties[9]')
animation.c:787: warning: excess elements in struct initializer
animation.c:787: warning: (near initialization for 'animEffectProperties[9]')
animation.c:787: warning: excess elements in struct initializer
animation.c:787: warning: (near initialization for 'animEffectProperties[9]')
animation.c:788: warning: excess elements in struct initializer
animation.c:788: warning: (near initialization for 'animEffectProperties[9]')
animation.c:788: warning: excess elements in struct initializer
animation.c:788: warning: (near initialization for 'animEffectProperties[9]')
animation.c:788: warning: excess elements in struct initializer
animation.c:788: warning: (near initialization for 'animEffectProperties[9]')
animation.c:788: warning: excess elements in struct initializer
animation.c:788: warning: (near initialization for 'animEffectProperties[9]')
animation.c:788: warning: excess elements in struct initializer
animation.c:788: warning: (near initialization for 'animEffectProperties[9]')
animation.c:790: warning: excess elements in struct initializer
animation.c:790: warning: (near initialization for 'animEffectProperties[10]')
animation.c:790: warning: excess elements in struct initializer
animation.c:790: warning: (near initialization for 'animEffectProperties[10]')
animation.c:790: error: 'defaultAnimStep' undeclared here (not in a function)
animation.c:790: warning: excess elements in struct initializer
animation.c:790: warning: (near initialization for 'animEffectProperties[10]')
animation.c:790: warning: excess elements in struct initializer
animation.c:790: warning: (near initialization for 'animEffectProperties[10]')
animation.c:790: warning: excess elements in struct initializer
animation.c:790: warning: (near initialization for 'animEffectProperties[10]')
animation.c:790: warning: excess elements in struct initializer
animation.c:790: warning: (near initialization for 'animEffectProperties[10]')
animation.c:791: warning: excess elements in struct initializer
animation.c:791: warning: (near initialization for 'animEffectProperties[10]')
animation.c:791: warning: excess elements in struct initializer
animation.c:791: warning: (near initialization for 'animEffectProperties[10]')
animation.c:791: warning: excess elements in struct initializer
animation.c:791: warning: (near initialization for 'animEffectProperties[10]')
animation.c:791: warning: excess elements in struct initializer
animation.c:791: warning: (near initialization for 'animEffectProperties[10]')
animation.c:791: warning: excess elements in struct initializer
animation.c:791: warning: (near initialization for 'animEffectProperties[10]')
animation.c:791: warning: excess elements in struct initializer
animation.c:791: warning: (near initialization for 'animEffectProperties[10]')
animation.c:791: error: 'updateBBWindow' undeclared here (not in a function)
animation.c:791: warning: excess elements in struct initializer
animation.c:791: warning: (near initialization for 'animEffectProperties[10]')
animation.c:793: warning: excess elements in struct initializer
animation.c:793: warning: (near initialization for 'animEffectProperties[11]')
animation.c:793: warning: excess elements in struct initializer
animation.c:793: warning: (near initialization for 'animEffectProperties[11]')
animation.c:793: warning: excess elements in struct initializer
animation.c:793: warning: (near initialization for 'animEffectProperties[11]')
animation.c:793: warning: excess elements in struct initializer
animation.c:793: warning: (near initialization for 'animEffectProperties[11]')
animation.c:794: warning: excess elements in struct initializer
animation.c:794: warning: (near initialization for 'animEffectProperties[11]')
animation.c:794: warning: excess elements in struct initializer
animation.c:794: warning: (near initialization for 'animEffectProperties[11]')
animation.c:794: warning: excess elements in struct initializer
animation.c:794: warning: (near initialization for 'animEffectProperties[11]')
animation.c:794: warning: excess elements in struct initializer
animation.c:794: warning: (near initialization for 'animEffectProperties[11]')
animation.c:794: warning: excess elements in struct initializer
animation.c:794: warning: (near initialization for 'animEffectProperties[11]')
animation.c:794: warning: excess elements in struct initializer
animation.c:794: warning: (near initialization for 'animEffectProperties[11]')
animation.c:794: warning: excess elements in struct initializer
animation.c:794: warning: (near initialization for 'animEffectProperties[11]')
animation.c:794: warning: excess elements in struct initializer
animation.c:794: warning: (near initialization for 'animEffectProperties[11]')
animation.c:794: warning: excess elements in struct initializer
animation.c:794: warning: (near initialization for 'animEffectProperties[11]')
animation.c:796: warning: excess elements in struct initializer
animation.c:796: warning: (near initialization for 'animEffectProperties[12]')
animation.c:796: warning: excess elements in struct initializer
animation.c:796: warning: (near initialization for 'animEffectProperties[12]')
animation.c:796: warning: excess elements in struct initializer
animation.c:796: warning: (near initialization for 'animEffectProperties[12]')
animation.c:797: error: 'fxFold3DInit' undeclared here (not in a function)
animation.c:797: warning: excess elements in struct initializer
animation.c:797: warning: (near initialization for 'animEffectProperties[12]')
animation.c:797: warning: excess elements in struct initializer
animation.c:797: warning: (near initialization for 'animEffectProperties[12]')
animation.c:797: warning: excess elements in struct initializer
animation.c:797: warning: (near initialization for 'animEffectProperties[12]')
animation.c:797: warning: excess elements in struct initializer
animation.c:797: warning: (near initialization for 'animEffectProperties[12]')
animation.c:797: warning: excess elements in struct initializer
animation.c:797: warning: (near initialization for 'animEffectProperties[12]')
animation.c:798: error: 'fxFold3dAnimStepPolygon' undeclared here (not in a function)
animation.c:798: warning: excess elements in struct initializer
animation.c:798: warning: (near initialization for 'animEffectProperties[12]')
animation.c:798: warning: excess elements in struct initializer
animation.c:798: warning: (near initialization for 'animEffectProperties[12]')
animation.c:798: warning: excess elements in struct initializer
animation.c:798: warning: (near initialization for 'animEffectProperties[12]')
animation.c:798: warning: excess elements in struct initializer
animation.c:798: warning: (near initialization for 'animEffectProperties[12]')
animation.c:798: warning: excess elements in struct initializer
animation.c:798: warning: (near initialization for 'animEffectProperties[12]')
animation.c:800: error: 'fxGlidePrePaintWindow' undeclared here (not in a function)
animation.c:800: warning: excess elements in struct initializer
animation.c:800: warning: (near initialization for 'animEffectProperties[13]')
animation.c:801: error: 'fxGlidePostPaintWindow' undeclared here (not in a function)
animation.c:801: warning: excess elements in struct initializer
animation.c:801: warning: (near initialization for 'animEffectProperties[13]')
animation.c:801: error: 'fxGlideAnimStep' undeclared here (not in a function)
animation.c:801: warning: excess elements in struct initializer
animation.c:801: warning: (near initialization for 'animEffectProperties[13]')
animation.c:802: error: 'fxGlideInit' undeclared here (not in a function)
animation.c:802: warning: excess elements in struct initializer
animation.c:802: warning: (near initialization for 'animEffectProperties[13]')
animation.c:802: warning: excess elements in struct initializer
animation.c:802: warning: (near initialization for 'animEffectProperties[13]')
animation.c:802: warning: excess elements in struct initializer
animation.c:802: warning: (near initialization for 'animEffectProperties[13]')
animation.c:802: warning: excess elements in struct initializer
animation.c:802: warning: (near initialization for 'animEffectProperties[13]')
animation.c:802: warning: excess elements in struct initializer
animation.c:802: warning: (near initialization for 'animEffectProperties[13]')
animation.c:803: error: 'polygonsDeceleratingAnimStepPolygon' undeclared here (not in a function)
animation.c:803: warning: excess elements in struct initializer
animation.c:803: warning: (near initialization for 'animEffectProperties[13]')
animation.c:804: error: 'fxGlideLetOthersDrawGeoms' undeclared here (not in a function)
animation.c:804: warning: excess elements in struct initializer
animation.c:804: warning: (near initialization for 'animEffectProperties[13]')
animation.c:804: error: 'fxGlideUpdateWindowTransform' undeclared here (not in a function)
animation.c:804: warning: excess elements in struct initializer
animation.c:804: warning: (near initialization for 'animEffectProperties[13]')
animation.c:804: warning: excess elements in struct initializer
animation.c:804: warning: (near initialization for 'animEffectProperties[13]')
animation.c:805: error: 'fxGlideUpdateBB' undeclared here (not in a function)
animation.c:805: warning: excess elements in struct initializer
animation.c:805: warning: (near initialization for 'animEffectProperties[13]')
animation.c:807: warning: excess elements in struct initializer
animation.c:807: warning: (near initialization for 'animEffectProperties[14]')
animation.c:808: warning: excess elements in struct initializer
animation.c:808: warning: (near initialization for 'animEffectProperties[14]')
animation.c:808: warning: excess elements in struct initializer
animation.c:808: warning: (near initialization for 'animEffectProperties[14]')
animation.c:809: warning: excess elements in struct initializer
animation.c:809: warning: (near initialization for 'animEffectProperties[14]')
animation.c:809: warning: excess elements in struct initializer
animation.c:809: warning: (near initialization for 'animEffectProperties[14]')
animation.c:809: warning: excess elements in struct initializer
animation.c:809: warning: (near initialization for 'animEffectProperties[14]')
animation.c:809: warning: excess elements in struct initializer
animation.c:809: warning: (near initialization for 'animEffectProperties[14]')
animation.c:809: warning: excess elements in struct initializer
animation.c:809: warning: (near initialization for 'animEffectProperties[14]')
animation.c:810: warning: excess elements in struct initializer
animation.c:810: warning: (near initialization for 'animEffectProperties[14]')
animation.c:811: warning: excess elements in struct initializer
animation.c:811: warning: (near initialization for 'animEffectProperties[14]')
animation.c:811: warning: excess elements in struct initializer
animation.c:811: warning: (near initialization for 'animEffectProperties[14]')
animation.c:811: warning: excess elements in struct initializer
animation.c:811: warning: (near initialization for 'animEffectProperties[14]')
animation.c:812: warning: excess elements in struct initializer
animation.c:812: warning: (near initialization for 'animEffectProperties[14]')
animation.c:814: warning: excess elements in struct initializer
animation.c:814: warning: (near initialization for 'animEffectProperties[15]')
animation.c:814: warning: excess elements in struct initializer
animation.c:814: warning: (near initialization for 'animEffectProperties[15]')
animation.c:814: error: 'fxHorizontalFoldsModelStep' undeclared here (not in a function)
animation.c:814: warning: excess elements in struct initializer
animation.c:814: warning: (near initialization for 'animEffectProperties[15]')
animation.c:815: warning: excess elements in struct initializer
animation.c:815: warning: (near initialization for 'animEffectProperties[15]')
animation.c:815: warning: excess elements in struct initializer
animation.c:815: warning: (near initialization for 'animEffectProperties[15]')
animation.c:815: warning: excess elements in struct initializer
animation.c:815: warning: (near initialization for 'animEffectProperties[15]')
animation.c:815: warning: excess elements in struct initializer
animation.c:815: warning: (near initialization for 'animEffectProperties[15]')
animation.c:815: warning: excess elements in struct initializer
animation.c:815: warning: (near initialization for 'animEffectProperties[15]')
animation.c:815: warning: excess elements in struct initializer
animation.c:815: warning: (near initialization for 'animEffectProperties[15]')
animation.c:815: warning: excess elements in struct initializer
animation.c:815: warning: (near initialization for 'animEffectProperties[15]')
animation.c:816: warning: excess elements in struct initializer
animation.c:816: warning: (near initialization for 'animEffectProperties[15]')
animation.c:816: warning: excess elements in struct initializer
animation.c:816: warning: (near initialization for 'animEffectProperties[15]')
animation.c:816: warning: excess elements in struct initializer
animation.c:816: warning: (near initialization for 'animEffectProperties[15]')
animation.c:818: warning: excess elements in struct initializer
animation.c:818: warning: (near initialization for 'animEffectProperties[16]')
animation.c:818: warning: excess elements in struct initializer
animation.c:818: warning: (near initialization for 'animEffectProperties[16]')
animation.c:818: warning: excess elements in struct initializer
animation.c:818: warning: (near initialization for 'animEffectProperties[16]')
animation.c:819: error: 'fxLeafSpread3DInit' undeclared here (not in a function)
animation.c:819: warning: excess elements in struct initializer
animation.c:819: warning: (near initialization for 'animEffectProperties[16]')
animation.c:819: warning: excess elements in struct initializer
animation.c:819: warning: (near initialization for 'animEffectProperties[16]')
animation.c:819: warning: excess elements in struct initializer
animation.c:819: warning: (near initialization for 'animEffectProperties[16]')
animation.c:819: warning: excess elements in struct initializer
animation.c:819: warning: (near initialization for 'animEffectProperties[16]')
animation.c:819: warning: excess elements in struct initializer
animation.c:819: warning: (near initialization for 'animEffectProperties[16]')
animation.c:820: warning: excess elements in struct initializer
animation.c:820: warning: (near initialization for 'animEffectProperties[16]')
animation.c:820: warning: excess elements in struct initializer
animation.c:820: warning: (near initialization for 'animEffectProperties[16]')
animation.c:820: warning: excess elements in struct initializer
animation.c:820: warning: (near initialization for 'animEffectProperties[16]')
animation.c:820: warning: excess elements in struct initializer
animation.c:820: warning: (near initialization for 'animEffectProperties[16]')
animation.c:820: warning: excess elements in struct initializer
animation.c:820: warning: (near initialization for 'animEffectProperties[16]')
animation.c:822: warning: excess elements in struct initializer
animation.c:822: warning: (near initialization for 'animEffectProperties[17]')
animation.c:822: warning: excess elements in struct initializer
animation.c:822: warning: (near initialization for 'animEffectProperties[17]')
animation.c:822: error: 'fxMagicLampModelStep' undeclared here (not in a function)
animation.c:822: warning: excess elements in struct initializer
animation.c:822: warning: (near initialization for 'animEffectProperties[17]')
animation.c:822: error: 'fxMagicLampInit' undeclared here (not in a function)
animation.c:822: warning: excess elements in struct initializer
animation.c:822: warning: (near initialization for 'animEffectProperties[17]')
animation.c:822: warning: excess elements in struct initializer
animation.c:822: warning: (near initialization for 'animEffectProperties[17]')
animation.c:823: warning: excess elements in struct initializer
animation.c:823: warning: (near initialization for 'animEffectProperties[17]')
animation.c:823: warning: excess elements in struct initializer
animation.c:823: warning: (near initialization for 'animEffectProperties[17]')
animation.c:823: warning: excess elements in struct initializer
animation.c:823: warning: (near initialization for 'animEffectProperties[17]')
animation.c:823: warning: excess elements in struct initializer
animation.c:823: warning: (near initialization for 'animEffectProperties[17]')
animation.c:823: warning: excess elements in struct initializer
animation.c:823: warning: (near initialization for 'animEffectProperties[17]')
animation.c:823: warning: excess elements in struct initializer
animation.c:823: warning: (near initialization for 'animEffectProperties[17]')
animation.c:823: warning: excess elements in struct initializer
animation.c:823: warning: (near initialization for 'animEffectProperties[17]')
animation.c:823: warning: excess elements in struct initializer
animation.c:823: warning: (near initialization for 'animEffectProperties[17]')
animation.c:825: warning: excess elements in struct initializer
animation.c:825: warning: (near initialization for 'animEffectProperties[18]')
animation.c:825: warning: excess elements in struct initializer
animation.c:825: warning: (near initialization for 'animEffectProperties[18]')
animation.c:825: warning: excess elements in struct initializer
animation.c:825: warning: (near initialization for 'animEffectProperties[18]')
animation.c:826: warning: excess elements in struct initializer
animation.c:826: warning: (near initialization for 'animEffectProperties[18]')
animation.c:826: warning: excess elements in struct initializer
animation.c:826: warning: (near initialization for 'animEffectProperties[18]')
animation.c:826: warning: excess elements in struct initializer
animation.c:826: warning: (near initialization for 'animEffectProperties[18]')
animation.c:826: warning: excess elements in struct initializer
animation.c:826: warning: (near initialization for 'animEffectProperties[18]')
animation.c:826: warning: excess elements in struct initializer
animation.c:826: warning: (near initialization for 'animEffectProperties[18]')
animation.c:827: warning: excess elements in struct initializer
animation.c:827: warning: (near initialization for 'animEffectProperties[18]')
animation.c:827: warning: excess elements in struct initializer
animation.c:827: warning: (near initialization for 'animEffectProperties[18]')
animation.c:827: warning: excess elements in struct initializer
animation.c:827: warning: (near initialization for 'animEffectProperties[18]')
animation.c:827: warning: excess elements in struct initializer
animation.c:827: warning: (near initialization for 'animEffectProperties[18]')
animation.c:827: warning: excess elements in struct initializer
animation.c:827: warning: (near initialization for 'animEffectProperties[18]')
animation.c:829: warning: excess elements in struct initializer
animation.c:829: warning: (near initialization for 'animEffectProperties[19]')
animation.c:829: warning: excess elements in struct initializer
animation.c:829: warning: (near initialization for 'animEffectProperties[19]')
animation.c:829: error: 'fxRollUpModelStep' undeclared here (not in a function)
animation.c:829: warning: excess elements in struct initializer
animation.c:829: warning: (near initialization for 'animEffectProperties[19]')
animation.c:829: error: 'fxRollUpAnimInit' undeclared here (not in a function)
animation.c:829: warning: excess elements in struct initializer
animation.c:829: warning: (near initialization for 'animEffectProperties[19]')
animation.c:829: warning: excess elements in struct initializer
animation.c:829: warning: (near initialization for 'animEffectProperties[19]')
animation.c:829: warning: excess elements in struct initializer
animation.c:829: warning: (near initialization for 'animEffectProperties[19]')
animation.c:829: warning: excess elements in struct initializer
animation.c:829: warning: (near initialization for 'animEffectProperties[19]')
animation.c:829: warning: excess elements in struct initializer
animation.c:829: warning: (near initialization for 'animEffectProperties[19]')
animation.c:830: warning: excess elements in struct initializer
animation.c:830: warning: (near initialization for 'animEffectProperties[19]')
animation.c:830: warning: excess elements in struct initializer
animation.c:830: warning: (near initialization for 'animEffectProperties[19]')
animation.c:830: warning: excess elements in struct initializer
animation.c:830: warning: (near initialization for 'animEffectProperties[19]')
animation.c:830: warning: excess elements in struct initializer
animation.c:830: warning: (near initialization for 'animEffectProperties[19]')
animation.c:830: warning: excess elements in struct initializer
animation.c:830: warning: (near initialization for 'animEffectProperties[19]')
animation.c:832: warning: excess elements in struct initializer
animation.c:832: warning: (near initialization for 'animEffectProperties[20]')
animation.c:832: warning: excess elements in struct initializer
animation.c:832: warning: (near initialization for 'animEffectProperties[20]')
animation.c:832: warning: excess elements in struct initializer
animation.c:832: warning: (near initialization for 'animEffectProperties[20]')
animation.c:832: error: 'fxSidekickInit' undeclared here (not in a function)
animation.c:832: warning: excess elements in struct initializer
animation.c:832: warning: (near initialization for 'animEffectProperties[20]')
animation.c:833: warning: excess elements in struct initializer
animation.c:833: warning: (near initialization for 'animEffectProperties[20]')
animation.c:833: warning: excess elements in struct initializer
animation.c:833: warning: (near initialization for 'animEffectProperties[20]')
animation.c:833: warning: excess elements in struct initializer
animation.c:833: warning: (near initialization for 'animEffectProperties[20]')
animation.c:833: warning: excess elements in struct initializer
animation.c:833: warning: (near initialization for 'animEffectProperties[20]')
animation.c:833: warning: excess elements in struct initializer
animation.c:833: warning: (near initialization for 'animEffectProperties[20]')
animation.c:833: warning: excess elements in struct initializer
animation.c:833: warning: (near initialization for 'animEffectProperties[20]')
animation.c:833: error: 'fxZoomUpdateWindowTransform' undeclared here (not in a function)
animation.c:833: warning: excess elements in struct initializer
animation.c:833: warning: (near initialization for 'animEffectProperties[20]')
animation.c:834: warning: excess elements in struct initializer
animation.c:834: warning: (near initialization for 'animEffectProperties[20]')
animation.c:834: error: 'compTransformUpdateBB' undeclared here (not in a function)
animation.c:834: warning: excess elements in struct initializer
animation.c:834: warning: (near initialization for 'animEffectProperties[20]')
animation.c:836: warning: excess elements in struct initializer
animation.c:836: warning: (near initialization for 'animEffectProperties[21]')
animation.c:836: warning: excess elements in struct initializer
animation.c:836: warning: (near initialization for 'animEffectProperties[21]')
animation.c:836: warning: excess elements in struct initializer
animation.c:836: warning: (near initialization for 'animEffectProperties[21]')
animation.c:837: error: 'fxSkewerInit' undeclared here (not in a function)
animation.c:837: warning: excess elements in struct initializer
animation.c:837: warning: (near initialization for 'animEffectProperties[21]')
animation.c:837: warning: excess elements in struct initializer
animation.c:837: warning: (near initialization for 'animEffectProperties[21]')
animation.c:837: warning: excess elements in struct initializer
animation.c:837: warning: (near initialization for 'animEffectProperties[21]')
animation.c:837: warning: excess elements in struct initializer
animation.c:837: warning: (near initialization for 'animEffectProperties[21]')
animation.c:837: warning: excess elements in struct initializer
animation.c:837: warning: (near initialization for 'animEffectProperties[21]')
animation.c:838: error: 'fxSkewerAnimStepPolygon' undeclared here (not in a function)
animation.c:838: warning: excess elements in struct initializer
animation.c:838: warning: (near initialization for 'animEffectProperties[21]')
animation.c:838: warning: excess elements in struct initializer
animation.c:838: warning: (near initialization for 'animEffectProperties[21]')
animation.c:838: warning: excess elements in struct initializer
animation.c:838: warning: (near initialization for 'animEffectProperties[21]')
animation.c:838: warning: excess elements in struct initializer
animation.c:838: warning: (near initialization for 'animEffectProperties[21]')
animation.c:838: warning: excess elements in struct initializer
animation.c:838: warning: (near initialization for 'animEffectProperties[21]')
animation.c:840: warning: excess elements in struct initializer
animation.c:840: warning: (near initialization for 'animEffectProperties[22]')
animation.c:840: warning: excess elements in struct initializer
animation.c:840: warning: (near initialization for 'animEffectProperties[22]')
animation.c:840: warning: excess elements in struct initializer
animation.c:840: warning: (near initialization for 'animEffectProperties[22]')
animation.c:840: warning: excess elements in struct initializer
animation.c:840: warning: (near initialization for 'animEffectProperties[22]')
animation.c:841: warning: excess elements in struct initializer
animation.c:841: warning: (near initialization for 'animEffectProperties[22]')
animation.c:841: warning: excess elements in struct initializer
animation.c:841: warning: (near initialization for 'animEffectProperties[22]')
animation.c:841: warning: excess elements in struct initializer
animation.c:841: warning: (near initialization for 'animEffectProperties[22]')
animation.c:841: warning: excess elements in struct initializer
animation.c:841: warning: (near initialization for 'animEffectProperties[22]')
animation.c:841: warning: excess elements in struct initializer
animation.c:841: warning: (near initialization for 'animEffectProperties[22]')
animation.c:841: warning: excess elements in struct initializer
animation.c:841: warning: (near initialization for 'animEffectProperties[22]')
animation.c:841: warning: excess elements in struct initializer
animation.c:841: warning: (near initialization for 'animEffectProperties[22]')
animation.c:841: warning: excess elements in struct initializer
animation.c:841: warning: (near initialization for 'animEffectProperties[22]')
animation.c:841: warning: excess elements in struct initializer
animation.c:841: warning: (near initialization for 'animEffectProperties[22]')
animation.c:843: warning: excess elements in struct initializer
animation.c:843: warning: (near initialization for 'animEffectProperties[23]')
animation.c:843: warning: excess elements in struct initializer
animation.c:843: warning: (near initialization for 'animEffectProperties[23]')
animation.c:843: error: 'fxWaveModelStep' undeclared here (not in a function)
animation.c:843: warning: excess elements in struct initializer
animation.c:843: warning: (near initialization for 'animEffectProperties[23]')
animation.c:843: warning: excess elements in struct initializer
animation.c:843: warning: (near initialization for 'animEffectProperties[23]')
animation.c:843: warning: excess elements in struct initializer
animation.c:843: warning: (near initialization for 'animEffectProperties[23]')
animation.c:843: warning: excess elements in struct initializer
animation.c:843: warning: (near initialization for 'animEffectProperties[23]')
animation.c:843: warning: excess elements in struct initializer
animation.c:843: warning: (near initialization for 'animEffectProperties[23]')
animation.c:843: warning: excess elements in struct initializer
animation.c:843: warning: (near initialization for 'animEffectProperties[23]')
animation.c:843: warning: excess elements in struct initializer
animation.c:843: warning: (near initialization for 'animEffectProperties[23]')
animation.c:843: warning: excess elements in struct initializer
animation.c:843: warning: (near initialization for 'animEffectProperties[23]')
animation.c:843: warning: excess elements in struct initializer
animation.c:843: warning: (near initialization for 'animEffectProperties[23]')
animation.c:843: warning: excess elements in struct initializer
animation.c:843: warning: (near initialization for 'animEffectProperties[23]')
animation.c:844: warning: excess elements in struct initializer
animation.c:844: warning: (near initialization for 'animEffectProperties[23]')
animation.c:846: warning: excess elements in struct initializer
animation.c:846: warning: (near initialization for 'animEffectProperties[24]')
animation.c:846: warning: excess elements in struct initializer
animation.c:846: warning: (near initialization for 'animEffectProperties[24]')
animation.c:846: warning: excess elements in struct initializer
animation.c:846: warning: (near initialization for 'animEffectProperties[24]')
animation.c:846: error: 'fxZoomInit' undeclared here (not in a function)
animation.c:846: warning: excess elements in struct initializer
animation.c:846: warning: (near initialization for 'animEffectProperties[24]')
animation.c:847: warning: excess elements in struct initializer
animation.c:847: warning: (near initialization for 'animEffectProperties[24]')
animation.c:847: warning: excess elements in struct initializer
animation.c:847: warning: (near initialization for 'animEffectProperties[24]')
animation.c:847: warning: excess elements in struct initializer
animation.c:847: warning: (near initialization for 'animEffectProperties[24]')
animation.c:847: warning: excess elements in struct initializer
animation.c:847: warning: (near initialization for 'animEffectProperties[24]')
animation.c:847: warning: excess elements in struct initializer
animation.c:847: warning: (near initialization for 'animEffectProperties[24]')
animation.c:847: warning: excess elements in struct initializer
animation.c:847: warning: (near initialization for 'animEffectProperties[24]')
animation.c:847: warning: excess elements in struct initializer
animation.c:847: warning: (near initialization for 'animEffectProperties[24]')
animation.c:848: warning: excess elements in struct initializer
animation.c:848: warning: (near initialization for 'animEffectProperties[24]')
animation.c:848: warning: excess elements in struct initializer
animation.c:848: warning: (near initialization for 'animEffectProperties[24]')
animation.c:852: error: expected '=', ',', ';', 'asm' or '__attribute__' before 'getMousePointerXY'
animation.c:868: error: expected ')' before '*' token
animation.c:895: error: expected '=', ',', ';', 'asm' or '__attribute__' before 'animSetScreenOptions'
animation.c:1010: error: expected '=', ',', ';', 'asm' or '__attribute__' before 'animScreenOptionInfo'
animation.c:1106: error: expected '=', ',', ';', 'asm' or '__attribute__' before '*' token
animation.c:1235: error: expected ')' before '*' token
animation.c:1304: error: expected '=', ',', ';', 'asm' or '__attribute__' before 'animEnsureModel'
animation.c:1344: error: expected '=', ',', ';', 'asm' or '__attribute__' before 'playingPolygonEffect'
animation.c: In function 'cleanUpParentChildChainItem':
animation.c:1359: error: 'AnimWindow' has no member named 'winThisIsPaintedBefore'
animation.c:1359: error: 'AnimWindow' has no member named 'winThisIsPaintedBefore'
animation.c:1362: error: 'AnimWindow' has no member named 'winThisIsPaintedBefore'
animation.c:1364: error: 'AnimWindow' has no member named 'winToBePaintedBeforeThis'
animation.c:1366: error: 'AnimWindow' has no member named 'winThisIsPaintedBefore'
animation.c:1367: error: 'AnimWindow' has no member named 'moreToBePaintedPrev'
animation.c:1368: error: 'AnimWindow' has no member named 'moreToBePaintedNext'
animation.c:1369: error: 'AnimWindow' has no member named 'isDodgeSubject'
animation.c:1369: error: 'FALSE' undeclared (first use in this function)
animation.c:1370: error: 'AnimWindow' has no member named 'skipPostPrepareScreen'
animation.c: At top level:
animation.c:1373: error: expected ')' before '*' token
animation.c:1543: error: expected ')' before '*' token
animation.c:1549: error: expected ')' before '*' token
animation.c:1575: error: expected '=', ',', ';', 'asm' or '__attribute__' before 'isWinVisible'
animation.c:1584: error: expected declaration specifiers or '...' before 'CompWindow'
animation.c:1585: error: expected declaration specifiers or '...' before 'CompWindow'
animation.c: In function 'getHostedOnWin':
animation.c:1587: error: 'w' undeclared (first use in this function)
animation.c:1588: error: 'wHost' undeclared (first use in this function)
animation.c:1589: error: 'AnimWindow' has no member named 'winToBePaintedBeforeThis'
animation.c:1590: error: 'AnimWindow' has no member named 'winThisIsPaintedBefore'
animation.c: At top level:
animation.c:1594: error: expected '=', ',', ';', 'asm' or '__attribute__' before 'otherPluginsActive'
animation.c:1604: error: expected ')' before '*' token
animation.c:1871: error: expected '=', ',', ';', 'asm' or '__attribute__' before 'relevantForFadeFocus'
animation.c:1889: error: expected '=', ',', ';', 'asm' or '__attribute__' before 'restackInfoStillGood'
animation.c:1911: error: expected ')' before '*' token
animation.c:2197: error: expected ')' before '*' token
animation.c:2210: error: expected ')' before '*' token
animation.c:2705: error: expected ')' before '*' token
animation.c:2724: error: expected ')' before '*' token
animation.c:2777: error: expected '=', ',', ';', 'asm' or '__attribute__' before 'animPaintWindow'
animation.c:2863: error: expected '=', ',', ';', 'asm' or '__attribute__' before '*' token
animation.c:2887: error: expected ')' before '*' token
animation.c:2897: error: expected '=', ',', ';', 'asm' or '__attribute__' before '*' token
animation.c:2905: error: expected '=', ',', ';', 'asm' or '__attribute__' before '*' token
animation.c:2914: error: expected '=', ',', ';', 'asm' or '__attribute__' before 'markNewCopy'
animation.c:2928: error: expected '=', ',', ';', 'asm' or '__attribute__' before '*' token
animation.c:2952: error: expected '=', ',', ';', 'asm' or '__attribute__' before '*' token
animation.c:2990: error: expected ')' before '*' token
animation.c:3008: error: expected '=', ',', ';', 'asm' or '__attribute__' before 'animGetWindowIconGeometry'
animation.c:3053: error: expected ')' before '*' token
animation.c:3090: error: expected ')' before '*' token
animation.c:3118: error: expected '=', ',', ';', 'asm' or '__attribute__' before 'windowHasUserTime'
animation.c:3125: error: expected ')' before '*' token
animation.c:3155: error: expected ')' before '*' token
animation.c:3711: error: expected '=', ',', ';', 'asm' or '__attribute__' before 'animDamageWindowRect'
animation.c:4011: error: expected ')' before '*' token
animation.c:4055: error: expected ')' before '*' token
animation.c:4113: error: expected ')' before '*' token
animation.c:4126: error: expected ')' before '*' token
animation.c:4139: error: expected '=', ',', ';', 'asm' or '__attribute__' before 'animPaintOutput'
animation.c:4201: error: expected '=', ',', ';', 'asm' or '__attribute__' before 'animInitDisplay'
animation.c:4231: error: expected ')' before '*' token
animation.c:4243: error: expected '=', ',', ';', 'asm' or '__attribute__' before 'animInitScreen'
animation.c:4353: error: expected ')' before '*' token
animation.c:4385: error: expected '=', ',', ';', 'asm' or '__attribute__' before 'animInitWindow'
animation.c:4439: error: expected ')' before '*' token
animation.c:4457: error: expected '=', ',', ';', 'asm' or '__attribute__' before 'animInitObject'
animation.c:4471: error: expected ')' before '*' token
animation.c:4484: error: expected '=', ',', ';', 'asm' or '__attribute__' before '*' token
animation.c:4500: error: expected '=', ',', ';', 'asm' or '__attribute__' before 'animSetObjectOption'
animation.c:4515: error: expected '=', ',', ';', 'asm' or '__attribute__' before 'animInit'
animation.c:4538: error: expected ')' before '*' token
animation.c:4544: error: expected '=', ',', ';', 'asm' or '__attribute__' before '*' token
animation.c:4550: error: expected '=', ',', ';', 'asm' or '__attribute__' before 'animVTable'
animation.c:4561: error: expected '=', ',', ';', 'asm' or '__attribute__' before '*' token
make[3]: *** [animation.lo] Error 1
make[3]: Leaving directory `/var/tmp/portage/x11-plugins/compiz-fusion-plugins-main-9999/work/plugins-main/src/animation'
make[2]: *** [all-recursive] Error 1
make[2]: Leaving directory `/var/tmp/portage/x11-plugins/compiz-fusion-plugins-main-9999/work/plugins-main/src'
make[1]: *** [all-recursive] Error 1
make[1]: Leaving directory `/var/tmp/portage/x11-plugins/compiz-fusion-plugins-main-9999/work/plugins-main'
make: *** [all] Error 2
*
* ERROR: x11-plugins/compiz-fusion-plugins-main-9999 failed.
* Call stack:
* ebuild.sh, line 1701: Called dyn_compile
* ebuild.sh, line 1039: Called qa_call 'src_compile'
* ebuild.sh, line 44: Called src_compile
* compiz-fusion-plugins-main-9999.ebuild, line 48: Called die
* The specific snippet of code:
* emake -j1 || die "make failed"
* The die message:
* make failed
*
* If you need support, post the topmost build error, and the call stack if relevant.
* A complete build log is located at '/var/tmp/portage/x11-plugins/compiz-fusion-plugins-main-9999/temp/build.log'.
* This ebuild is from an overlay: '/usr/local/portage/xeffects/'
*
* Messages for package x11-plugins/compiz-fusion-plugins-main-9999:
*
* ERROR: x11-plugins/compiz-fusion-plugins-main-9999 failed.
* Call stack:
* ebuild.sh, line 1701: Called dyn_compile
* ebuild.sh, line 1039: Called qa_call 'src_compile'
* ebuild.sh, line 44: Called src_compile
* compiz-fusion-plugins-main-9999.ebuild, line 48: Called die
* The specific snippet of code:
* emake -j1 || die "make failed"
* The die message:
* make failed
*
* If you need support, post the topmost build error, and the call stack if relevant.
* A complete build log is located at '/var/tmp/portage/x11-plugins/compiz-fusion-plugins-main-9999/temp/build.log'.
* This ebuild is from an overlay: '/usr/local/portage/xeffects/'
*
localhost / #