rendered paste body/usr/bin/cmake -E cmake_progress_report /home/thomas/kde/build/KDE/kdebase/CMakeFiles
[ 38%] Built target kscreensaver
/usr/bin/cmake -E cmake_progress_report /home/thomas/kde/build/KDE/kdebase/CMakeFiles
[ 38%] Building CXX object workspace/libs/plasma/CMakeFiles/plasma.dir/layouts/layoutanimator.o
/usr/bin/c++ -DMAKE_PLASMA_LIB -Wnon-virtual-dtor -Wno-long-long -ansi -Wundef -Wcast-align -Wchar-subscripts -Wall -W -Wpointer-arith -Wformat-security -fno-exceptions -fno-check-new -fno-common -Woverloaded-virtual -fvisibility=hidden -g3 -fno-inline -fPIC -I/home/thomas/kde/build/KDE/kdebase/workspace/libs/plasma -I/home/thomas/kde/src/KDE/kdebase/workspace/libs/plasma -I/home/thomas/kde/src/KDE/kdebase -I/home/thomas/kde/build/KDE/kdebase -I/home/thomas/kde/build/KDE/kdebase/workspace -I/home/thomas/kde/src/KDE/kdebase/workspace/kdm -I/home/thomas/kde/src/KDE/kdebase/workspace/libs -I/home/thomas/kde/src/KDE/kdebase/workspace/libs/kworkspace -I/usr/include/qt4 -I/usr/include/qt4/Qt -I/usr/share/qt4/mkspecs/default -I/usr/include/qt4/QtCore -I/usr/include/qt4/QtGui -I/usr/include/qt4/Qt3Support -I/usr/include/qt4/QtAssistant -I/usr/include/qt4/QtDesigner -I/usr/include/qt4/QtNetwork -I/usr/include/qt4/QtOpenGL -I/usr/include/qt4/QtSql -I/usr/include/qt4/QtXml -I/usr/include/qt4/QtSvg -I/usr/include/qt4/QtScript -I/usr/include/qt4/QtUiTools -I/usr/include/qt4/QtTest -I/usr/include/qt4/QtDBus -I/home/thomas/kde/include -I/home/thomas/kde/include/KDE -D_BSD_SOURCE -D_XOPEN_SOURCE=500 -D_BSD_SOURCE -D_GNU_SOURCE -DQT_NO_STL -DQT_NO_CAST_TO_ASCII -D_REENTRANT -DKDE_DEPRECATED_WARNINGS -DHAVE_CONFIG_H=1 -o workspace/libs/plasma/CMakeFiles/plasma.dir/layouts/layoutanimator.o -c /home/thomas/kde/src/KDE/kdebase/workspace/libs/plasma/layouts/layoutanimator.cpp
In file included from /home/thomas/kde/src/KDE/kdebase/workspace/libs/plasma/layouts/layout.cpp:29:
/home/thomas/kde/build/KDE/kdebase/workspace/libs/plasma/widgets/widget.h:30:39: error: plasma/widgets/layoutitem.h: No such file or directory
In file included from /home/thomas/kde/src/KDE/kdebase/workspace/libs/plasma/layouts/layoutanimator.cpp:31:
/home/thomas/kde/build/KDE/kdebase/workspace/libs/plasma/widgets/widget.h:30:39: error: plasma/widgets/layoutitem.h: No such file or directory
make[2]: *** [workspace/libs/plasma/CMakeFiles/plasma.dir/layouts/layout.o] Error 1
make[2]: *** Waiting for unfinished jobs....
make -f workspace/kscreensaver/krandom_screensaver/CMakeFiles/krandom.kss.dir/build.make workspace/kscreensaver/krandom_screensaver/CMakeFiles/krandom.kss.dir/depend
make[2]: Entering directory `/home/thomas/kde/build/KDE/kdebase'
/usr/bin/cmake -E cmake_progress_report /home/thomas/kde/build/KDE/kdebase/CMakeFiles
[ 38%] Generating krandom.kss_automoc.cpp
cd /home/thomas/kde/build/KDE/kdebase/workspace/kscreensaver/krandom_screensaver && /home/thomas/kde/bin/kde4automoc /home/thomas/kde/build/KDE/kdebase/workspace/kscreensaver/krandom_screensaver/krandom.kss_automoc.cpp /home/thomas/kde/src/KDE/kdebase/workspace/kscreensaver/krandom_screensaver /home/thomas/kde/build/KDE/kdebase/workspace/kscreensaver/krandom_screensaver /usr/bin/moc-qt4
make[2]: *** [workspace/libs/plasma/CMakeFiles/plasma.dir/layouts/layoutanimator.o] Error 1
make[2]: Leaving directory `/home/thomas/kde/build/KDE/kdebase'
make[1]: *** [workspace/libs/plasma/CMakeFiles/plasma.dir/all] Error 2
make[1]: *** Waiting for unfinished jobs....
Scanning dependencies of target krandom.kss
cd /home/thomas/kde/build/KDE/kdebase && /usr/bin/cmake -E cmake_depends "KDevelop3" /home/thomas/kde/src/KDE/kdebase /home/thomas/kde/src/KDE/kdebase/workspace/kscreensaver/krandom_screensaver /home/thomas/kde/build/KDE/kdebase /home/thomas/kde/build/KDE/kdebase/workspace/kscreensaver/krandom_screensaver /home/thomas/kde/build/KDE/kdebase/workspace/kscreensaver/krandom_screensaver/CMakeFiles/krandom.kss.dir/DependInfo.cmake
make[2]: Leaving directory `/home/thomas/kde/build/KDE/kdebase'
make -f workspace/kscreensaver/krandom_screensaver/CMakeFiles/krandom.kss.dir/build.make workspace/kscreensaver/krandom_screensaver/CMakeFiles/krandom.kss.dir/build
make[2]: Entering directory `/home/thomas/kde/build/KDE/kdebase'
/usr/bin/cmake -E cmake_progress_report /home/thomas/kde/build/KDE/kdebase/CMakeFiles
/usr/bin/cmake -E cmake_progress_report /home/thomas/kde/build/KDE/kdebase/CMakeFiles
[ 38%] [ 38%] Building CXX object workspace/kscreensaver/krandom_screensaver/CMakeFiles/krandom.kss.dir/krandom.kss_automoc.o
/usr/bin/c++ -Wnon-virtual-dtor -Wno-long-long -ansi -Wundef -Wcast-align -Wchar-subscripts -Wall -W -Wpointer-arith -Wformat-security -fno-exceptions -fno-check-new -fno-common -Woverloaded-virtual -fvisibility=hidden -g3 -fno-inline -I/home/thomas/kde/build/KDE/kdebase/workspace/kscreensaver/krandom_screensaver -I/home/thomas/kde/src/KDE/kdebase/workspace/kscreensaver/krandom_screensaver -I/home/thomas/kde/src/KDE/kdebase -I/home/thomas/kde/build/KDE/kdebase -I/home/thomas/kde/build/KDE/kdebase/workspace -I/home/thomas/kde/src/KDE/kdebase/workspace/kdm -I/home/thomas/kde/src/KDE/kdebase/workspace/libs -I/home/thomas/kde/src/KDE/kdebase/workspace/libs/kworkspace -I/home/thomas/kde/src/KDE/kdebase/workspace/kscreensaver/libkscreensaver -I/usr/include/qt4 -I/usr/include/qt4/Qt -I/usr/share/qt4/mkspecs/default -I/usr/include/qt4/QtCore -I/usr/include/qt4/QtGui -I/usr/include/qt4/Qt3Support -I/usr/include/qt4/QtAssistant -I/usr/include/qt4/QtDesigner -I/usr/include/qt4/QtNetwork -I/usr/include/qt4/QtOpenGL -I/usr/include/qt4/QtSql -I/usr/include/qt4/QtXml -I/usr/include/qt4/QtSvg -I/usr/include/qt4/QtScript -I/usr/include/qt4/QtUiTools -I/usr/include/qt4/QtTest -I/usr/include/qt4/QtDBus -I/home/thomas/kde/include -I/home/thomas/kde/include/KDE -D_BSD_SOURCE -D_XOPEN_SOURCE=500 -D_BSD_SOURCE -D_GNU_SOURCE -DQT_NO_STL -DQT_NO_CAST_TO_ASCII -D_REENTRANT -DKDE_DEPRECATED_WARNINGS -DHAVE_CONFIG_H=1 -o workspace/kscreensaver/krandom_screensaver/CMakeFiles/krandom.kss.dir/krandom.kss_automoc.o -c /home/thomas/kde/build/KDE/kdebase/workspace/kscreensaver/krandom_screensaver/krandom.kss_automoc.cpp
Building CXX object workspace/kscreensaver/krandom_screensaver/CMakeFiles/krandom.kss.dir/random.o
/usr/bin/c++ -Wnon-virtual-dtor -Wno-long-long -ansi -Wundef -Wcast-align -Wchar-subscripts -Wall -W -Wpointer-arith -Wformat-security -fno-exceptions -fno-check-new -fno-common -Woverloaded-virtual -fvisibility=hidden -g3 -fno-inline -I/home/thomas/kde/build/KDE/kdebase/workspace/kscreensaver/krandom_screensaver -I/home/thomas/kde/src/KDE/kdebase/workspace/kscreensaver/krandom_screensaver -I/home/thomas/kde/src/KDE/kdebase -I/home/thomas/kde/build/KDE/kdebase -I/home/thomas/kde/build/KDE/kdebase/workspace -I/home/thomas/kde/src/KDE/kdebase/workspace/kdm -I/home/thomas/kde/src/KDE/kdebase/workspace/libs -I/home/thomas/kde/src/KDE/kdebase/workspace/libs/kworkspace -I/home/thomas/kde/src/KDE/kdebase/workspace/kscreensaver/libkscreensaver -I/usr/include/qt4 -I/usr/include/qt4/Qt -I/usr/share/qt4/mkspecs/default -I/usr/include/qt4/QtCore -I/usr/include/qt4/QtGui -I/usr/include/qt4/Qt3Support -I/usr/include/qt4/QtAssistant -I/usr/include/qt4/QtDesigner -I/usr/include/qt4/QtNetwork -I/usr/include/qt4/QtOpenGL -I/usr/include/qt4/QtSql -I/usr/include/qt4/QtXml -I/usr/include/qt4/QtSvg -I/usr/include/qt4/QtScript -I/usr/include/qt4/QtUiTools -I/usr/include/qt4/QtTest -I/usr/include/qt4/QtDBus -I/home/thomas/kde/include -I/home/thomas/kde/include/KDE -D_BSD_SOURCE -D_XOPEN_SOURCE=500 -D_BSD_SOURCE -D_GNU_SOURCE -DQT_NO_STL -DQT_NO_CAST_TO_ASCII -D_REENTRANT -DKDE_DEPRECATED_WARNINGS -DHAVE_CONFIG_H=1 -o workspace/kscreensaver/krandom_screensaver/CMakeFiles/krandom.kss.dir/random.o -c /home/thomas/kde/src/KDE/kdebase/workspace/kscreensaver/krandom_screensaver/random.cpp
Linking CXX executable krandom.kss
cd /home/thomas/kde/build/KDE/kdebase/workspace/kscreensaver/krandom_screensaver && /usr/bin/cmake -P CMakeFiles/krandom.kss.dir/cmake_clean_target.cmake
cd /home/thomas/kde/build/KDE/kdebase/workspace/kscreensaver/krandom_screensaver && /usr/bin/c++ -Wnon-virtual-dtor -Wno-long-long -ansi -Wundef -Wcast-align -Wchar-subscripts -Wall -W -Wpointer-arith -Wformat-security -fno-exceptions -fno-check-new -fno-common -Woverloaded-virtual -fvisibility=hidden -g3 -fno-inline -fPIC "CMakeFiles/krandom.kss.dir/krandom.kss_automoc.o" "CMakeFiles/krandom.kss.dir/random.o" -o krandom.kss -rdynamic -L/home/thomas/kde/lib -lQtSvg -lQtCore -lpthread -lkdecore -lSM -lICE -lX11 -lXext -lXft -lXau -lXdmcp -lQtGui -lQtXml -lXcursor -lXfixes -lkdeui -lm -lQtCore -lpthread -lQtNetwork -lQtDBus -lz -lbz2 -lresolv -Wl,-rpath,/home/thomas/kde/lib:/home/thomas/kde/lib
cd /home/thomas/kde/build/KDE/kdebase/workspace/kscreensaver/krandom_screensaver && /usr/bin/cmake -D_filename=/home/thomas/kde/build/KDE/kdebase/workspace/kscreensaver/krandom_screensaver/krandom.kss.shell -D_library_path_variable=LD_LIBRARY_PATH -D_ld_library_path="/home/thomas/kde/build/KDE/kdebase/lib/./:/home/thomas/kde/lib:/home/thomas/kde/lib:/usr/lib" -D_executable=/home/thomas/kde/build/KDE/kdebase/workspace/kscreensaver/krandom_screensaver/krandom.kss -P /home/thomas/kde/share/apps/cmake/modules/kde4_exec_via_sh.cmake
make[2]: Leaving directory `/home/thomas/kde/build/KDE/kdebase'
/usr/bin/cmake -E cmake_progress_report /home/thomas/kde/build/KDE/kdebase/CMakeFiles
[ 38%] Built target krandom.kss
make[1]: Leaving directory `/home/thomas/kde/build/KDE/kdebase'
make: *** [all] Error 2