All pastes #793604 Raw Edit

Miscellany

public text v1 · immutable
·published 2007-11-22 12:46 UTC
rendered paste body
| if /bin/sh ../arm-angstrom-linux-gnueabi-libtool --tag=CC --mode=compile ccache arm-angstrom-linux-gnueabi-gcc -march=armv4t -mtune=arm920t -DHAVE_CONFIG_H -I. -I. -I../include -I../include -I../include -I../include -I../include -I../include -I../include -I../include   -isystem/builder/newBuild/build/tmp/staging/arm-angstrom-linux-gnueabi/include -DHAVE_DIX_CONFIG_H -D_BSD_SOURCE -DHAS_FCHOWN -DHAS_STICKY_DIR_BIT -I/builder/newBuild/build/tmp/staging/arm-angstrom-linux-gnueabi/include -I/builder/newBuild/build/tmp/staging/arm-angstrom-linux-gnueabi/include/X11/Xtrans -I/builder/newBuild/build/tmp/staging/arm-angstrom-linux-gnueabi/include/freetype2   -I../include -I../include -I../Xext -I../composite -I../damageext -I../xfixes -I../Xi -I../mi -I../miext/shadow  -I../miext/damage -I../render -I../randr -I../fb -isystem/builder/newBuild/build/tmp/staging/arm-angstrom-linux-gnueabi/include -O -g -MT renderedge.lo -MD -MP -MF ".deps/renderedge.Tpo" -c -o renderedge.lo renderedge.c; \
|       then mv -f ".deps/renderedge.Tpo" ".deps/renderedge.Plo"; else rm -f ".deps/renderedge.Tpo"; exit 1; fi
|  ccache arm-angstrom-linux-gnueabi-gcc -march=armv4t -mtune=arm920t -DHAVE_CONFIG_H -I. -I. -I../include -I../include -I../include -I../include -I../include -I../include -I../include -I../include -isystem/builder/newBuild/build/tmp/staging/arm-angstrom-linux-gnueabi/include -DHAVE_DIX_CONFIG_H -D_BSD_SOURCE -DHAS_FCHOWN -DHAS_STICKY_DIR_BIT -I/builder/newBuild/build/tmp/staging/arm-angstrom-linux-gnueabi/include -I/builder/newBuild/build/tmp/staging/arm-angstrom-linux-gnueabi/include/X11/Xtrans -I/builder/newBuild/build/tmp/staging/arm-angstrom-linux-gnueabi/include/freetype2 -I../include -I../include -I../Xext -I../composite -I../damageext -I../xfixes -I../Xi -I../mi -I../miext/shadow -I../miext/damage -I../render -I../randr -I../fb -isystem/builder/newBuild/build/tmp/staging/arm-angstrom-linux-gnueabi/include -O -g -MT renderedge.lo -MD -MP -MF .deps/renderedge.Tpo -c renderedge.c  -fPIC -DPIC -o .libs/renderedge.o
| In file included from /builder/newBuild/build/tmp/staging/arm-angstrom-linux-gnueabi/include/X11/extensions/renderproto.h:30,
|                  from glyphstr.h:28,
|                  from picturestr.h:29,
|                  from renderedge.h:28,
|                  from renderedge.c:29:
| /builder/newBuild/build/tmp/staging/arm-angstrom-linux-gnueabi/include/X11/extensions/render.h:29: error: expected '=', ',', ';', 'asm' or '__attribute__' before 'Glyph'
| /builder/newBuild/build/tmp/staging/arm-angstrom-linux-gnueabi/include/X11/extensions/render.h:30: error: expected '=', ',', ';', 'asm' or '__attribute__' before 'GlyphSet'
| /builder/newBuild/build/tmp/staging/arm-angstrom-linux-gnueabi/include/X11/extensions/render.h:31: error: expected '=', ',', ';', 'asm' or '__attribute__' before 'Picture'
| /builder/newBuild/build/tmp/staging/arm-angstrom-linux-gnueabi/include/X11/extensions/render.h:32: error: expected '=', ',', ';', 'asm' or '__attribute__' before 'PictFormat'
| In file included from picturestr.h:29,
|                  from renderedge.h:28,
|                  from renderedge.c:29:
| glyphstr.h:141: error: expected declaration specifiers or '...' before 'Glyph'
| glyphstr.h:144: error: expected declaration specifiers or '...' before 'Glyph'
| glyphstr.h:147: error: expected declaration specifiers or '...' before 'Glyph'
| In file included from renderedge.h:28,
|                  from renderedge.c:29:
| picturestr.h:499: error: expected ')' before 'pid'
| picturestr.h:643: error: expected ')' before 'pid'
| picturestr.h:648: error: expected ')' before 'pid'
| picturestr.h:657: error: expected ')' before 'pid'
| picturestr.h:668: error: expected ')' before 'pid'
| make[2]: *** [renderedge.lo] Error 1
| make[2]: Leaving directory `/builder/newBuild/build/tmp/work/armv4t-angstrom-linux-gnueabi/xserver-kdrive-1_1.3.0.0-r21/xorg-server-1.3.0.0/render'
| make[1]: *** [all-recursive] Error 1
| make[1]: Leaving directory `/builder/newBuild/build/tmp/work/armv4t-angstrom-linux-gnueabi/xserver-kdrive-1_1.3.0.0-r21/xorg-server-1.3.0.0'
| FATAL: oe_runmake failed
NOTE: Task failed: /builder/newBuild/build/tmp/work/armv4t-angstrom-linux-gnueabi/xserver-kdrive-1_1.3.0.0-r21/temp/log.do_compile.15028
NOTE: package xserver-kdrive-1_1.3.0.0-r21: task do_compile: failed
ERROR: TaskFailed event exception, aborting
NOTE: package xserver-kdrive-1.3.0.0: failed
ERROR: Build of /home/moko/newBuild/openembedded/packages/xorg-xserver/xserver-kdrive_1.3.0.0.bb do_compile failed
ERROR: Task 438 (/home/moko/newBuild/openembedded/packages/xorg-xserver/xserver-kdrive_1.3.0.0.bb, do_compile) failed
NOTE: Tasks Summary: Attempted 3613 tasks of which 3608 didn't need to be rerun and 1 failed.
ERROR: '/home/moko/newBuild/openembedded/packages/xorg-xserver/xserver-kdrive_1.3.0.0.bb' failed
make: *** [openmoko-devel-image] Error 1