>>> Unpacking source...
>>> Unpacking transmission-0.91.tar.bz2 to /var/tmp/portage/net-p2p/transmission-0.91/work
>>> Source unpacked.
>>> Compiling source in /var/tmp/portage/net-p2p/transmission-0.91/work/transmission-0.91 ...
* econf: updating transmission-0.91/third-party/libevent/config.guess with /usr/share/gnuconfig/config.guess
* econf: updating transmission-0.91/third-party/libevent/config.sub with /usr/share/gnuconfig/config.sub
* econf: updating transmission-0.91/config.guess with /usr/share/gnuconfig/config.guess
* econf: updating transmission-0.91/config.sub with /usr/share/gnuconfig/config.sub
./configure --prefix=/usr --host=i586-pc-linux-gnu --mandir=/usr/share/man --infodir=/usr/share/info --datadir=/usr/share --sysconfdir=/etc --localstatedir=/var/lib --with-gtk --with-wx --build=i586-pc-linux-gnu
checking for a BSD-compatible install... /usr/bin/install -c
checking whether build environment is sane... yes
checking for a thread-safe mkdir -p... /bin/mkdir -p
checking for gawk... gawk
checking whether make sets $(MAKE)... yes
checking how to create a ustar tar archive... gnutar
checking build system type... i586-pc-linux-gnu
checking host system type... i586-pc-linux-gnu
checking for style of include used by make... GNU
checking for i586-pc-linux-gnu-gcc... i586-pc-linux-gnu-gcc
checking for C compiler default output file name... a.out
checking whether the C compiler works... yes
checking whether we are cross compiling... no
checking for suffix of executables...
checking for suffix of object files... o
checking whether we are using the GNU C compiler... yes
checking whether i586-pc-linux-gnu-gcc accepts -g... yes
checking for i586-pc-linux-gnu-gcc option to accept ISO C89... none needed
checking dependency style of i586-pc-linux-gnu-gcc... gcc3
checking for a sed that does not truncate output... /bin/sed
checking for grep that handles long lines and -e... /bin/grep
checking for egrep... /bin/grep -E
checking for ld used by i586-pc-linux-gnu-gcc... /usr/i586-pc-linux-gnu/bin/ld
checking if the linker (/usr/i586-pc-linux-gnu/bin/ld) is GNU ld... yes
checking for /usr/i586-pc-linux-gnu/bin/ld option to reload object files... -r
checking for BSD-compatible nm... /usr/bin/nm -B
checking whether ln -s works... yes
checking how to recognise dependent libraries... pass_all
checking how to run the C preprocessor... i586-pc-linux-gnu-gcc -E
checking for ANSI C header files... yes
checking for sys/types.h... yes
checking for sys/stat.h... yes
checking for stdlib.h... yes
checking for string.h... yes
checking for memory.h... yes
checking for strings.h... yes
checking for inttypes.h... yes
checking for stdint.h... yes
checking for unistd.h... yes
checking dlfcn.h usability... yes
checking dlfcn.h presence... yes
checking for dlfcn.h... yes
checking for i586-pc-linux-gnu-g++... i586-pc-linux-gnu-g++
checking whether we are using the GNU C++ compiler... yes
checking whether i586-pc-linux-gnu-g++ accepts -g... yes
checking dependency style of i586-pc-linux-gnu-g++... gcc3
checking how to run the C++ preprocessor... i586-pc-linux-gnu-g++ -E
checking for i586-pc-linux-gnu-g77... no
checking for i586-pc-linux-gnu-xlf... no
checking for i586-pc-linux-gnu-f77... no
checking for i586-pc-linux-gnu-frt... no
checking for i586-pc-linux-gnu-pgf77... no
checking for i586-pc-linux-gnu-cf77... no
checking for i586-pc-linux-gnu-fort77... no
checking for i586-pc-linux-gnu-fl32... no
checking for i586-pc-linux-gnu-af77... no
checking for i586-pc-linux-gnu-xlf90... no
checking for i586-pc-linux-gnu-f90... no
checking for i586-pc-linux-gnu-pgf90... no
checking for i586-pc-linux-gnu-pghpf... no
checking for i586-pc-linux-gnu-epcf90... no
checking for i586-pc-linux-gnu-gfortran... i586-pc-linux-gnu-gfortran
checking whether we are using the GNU Fortran 77 compiler... yes
checking whether i586-pc-linux-gnu-gfortran accepts -g... yes
checking the maximum length of command line arguments... 32768
checking command to parse /usr/bin/nm -B output from i586-pc-linux-gnu-gcc object... ok
checking for objdir... .libs
checking for i586-pc-linux-gnu-ar... i586-pc-linux-gnu-ar
checking for i586-pc-linux-gnu-ranlib... i586-pc-linux-gnu-ranlib
checking for i586-pc-linux-gnu-strip... i586-pc-linux-gnu-strip
checking if i586-pc-linux-gnu-gcc supports -fno-rtti -fno-exceptions... no
checking for i586-pc-linux-gnu-gcc option to produce PIC... -fPIC
checking if i586-pc-linux-gnu-gcc PIC flag -fPIC works... yes
checking if i586-pc-linux-gnu-gcc static flag -static works... yes
checking if i586-pc-linux-gnu-gcc supports -c -o file.o... yes
checking whether the i586-pc-linux-gnu-gcc linker (/usr/i586-pc-linux-gnu/bin/ld) supports shared libraries... yes
checking whether -lc should be explicitly linked in... no
checking dynamic linker characteristics... GNU/Linux ld.so
checking how to hardcode library paths into programs... immediate
checking whether stripping libraries is possible... yes
checking if libtool supports shared libraries... yes
checking whether to build shared libraries... yes
checking whether to build static libraries... yes
configure: creating libtool
appending configuration tag "CXX" to libtool
checking for ld used by i586-pc-linux-gnu-g++... /usr/i586-pc-linux-gnu/bin/ld
checking if the linker (/usr/i586-pc-linux-gnu/bin/ld) is GNU ld... yes
checking whether the i586-pc-linux-gnu-g++ linker (/usr/i586-pc-linux-gnu/bin/ld) supports shared libraries... yes
checking for i586-pc-linux-gnu-g++ option to produce PIC... -fPIC
checking if i586-pc-linux-gnu-g++ PIC flag -fPIC works... yes
checking if i586-pc-linux-gnu-g++ static flag -static works... yes
checking if i586-pc-linux-gnu-g++ supports -c -o file.o... yes
checking whether the i586-pc-linux-gnu-g++ linker (/usr/i586-pc-linux-gnu/bin/ld) supports shared libraries... yes
checking dynamic linker characteristics... GNU/Linux ld.so
checking how to hardcode library paths into programs... immediate
appending configuration tag "F77" to libtool
checking if libtool supports shared libraries... yes
checking whether to build shared libraries... yes
checking whether to build static libraries... yes
checking for i586-pc-linux-gnu-gfortran option to produce PIC... -fPIC
checking if i586-pc-linux-gnu-gfortran PIC flag -fPIC works... yes
checking if i586-pc-linux-gnu-gfortran static flag -static works... yes
checking if i586-pc-linux-gnu-gfortran supports -c -o file.o... yes
checking whether the i586-pc-linux-gnu-gfortran linker (/usr/i586-pc-linux-gnu/bin/ld) supports shared libraries... yes
checking dynamic linker characteristics... GNU/Linux ld.so
checking how to hardcode library paths into programs... immediate
checking for i586-pc-linux-gnu-gcc... (cached) i586-pc-linux-gnu-gcc
checking whether we are using the GNU C compiler... (cached) yes
checking whether i586-pc-linux-gnu-gcc accepts -g... (cached) yes
checking for i586-pc-linux-gnu-gcc option to accept ISO C89... (cached) none needed
checking dependency style of i586-pc-linux-gnu-gcc... (cached) gcc3
checking whether we are using the GNU C++ compiler... (cached) yes
checking whether i586-pc-linux-gnu-g++ accepts -g... (cached) yes
checking dependency style of i586-pc-linux-gnu-g++... (cached) gcc3
checking for ANSI C header files... (cached) yes
checking whether time.h and sys/time.h may both be included... yes
checking for lrintf... no
checking for strlcpy... no
checking for strlcat... no
checking for daemon... yes
checking for dirname... yes
checking for basename... yes
checking for a BSD-compatible install... /usr/bin/install -c
checking whether make sets $(MAKE)... (cached) yes
checking for i586-pc-linux-gnu-ranlib... (cached) i586-pc-linux-gnu-ranlib
checking for the pthreads library -lpthreads... no
checking whether pthreads work without any flags... no
checking whether pthreads work with -Kthread... no
checking whether pthreads work with -kthread... no
checking for the pthreads library -llthread... no
checking whether pthreads work with -pthread... yes
checking for joinable pthread attribute... PTHREAD_CREATE_JOINABLE
checking if more special flags are required for pthreads... no
checking for library containing socket... none required
checking for library containing gethostbyname... none required
checking for i586-pc-linux-gnu-pkg-config... no
checking for pkg-config... /usr/bin/pkg-config
checking pkg-config is at least version 0.9.0... yes
checking for OPENSSL... yes
checking how to copy va_list... va_copy
configure: invoking libevent's configure script
checking for GTK... yes
checking for intltool >= 0.23... 0.35.5 found
checking for perl... /usr/bin/perl
checking for iconv... /usr/bin/iconv
checking for msgfmt... /usr/bin/msgfmt
checking for msgmerge... /usr/bin/msgmerge
checking for xgettext... /usr/bin/xgettext
checking locale.h usability... yes
checking locale.h presence... yes
checking for locale.h... yes
checking for LC_MESSAGES... yes
checking libintl.h usability... yes
checking libintl.h presence... yes
checking for libintl.h... yes
checking for ngettext in libc... yes
checking for dgettext in libc... yes
checking for bind_textdomain_codeset... yes
checking for msgfmt... /usr/bin/msgfmt
checking for dcgettext... yes
checking for gmsgfmt... /usr/bin/gmsgfmt
checking for xgettext... /usr/bin/xgettext
checking for wx-config... /usr/bin/wx-config
checking for wxWidgets version >= 2.6.0... yes (version 2.8.4)
checking for wxWidgets static library... no
checking host system type... (cached) i586-pc-linux-gnu
configure: creating ./config.status
config.status: creating Makefile
config.status: creating transmission.spec
config.status: creating beos/Makefile
config.status: creating cli/Makefile
config.status: creating daemon/Makefile
config.status: creating libtransmission/Makefile
config.status: creating third-party/Makefile
config.status: creating macosx/Makefile
config.status: creating wx/Makefile
config.status: creating wx/images/Makefile
config.status: creating gtk/Makefile
config.status: creating po/Makefile.in
config.status: executing depfiles commands
config.status: executing intltool commands
config.status: executing default-1 commands
config.status: executing po/stamp-it commands
=== configuring in third-party/libevent (/var/tmp/portage/net-p2p/transmission-0.91/work/transmission-0.91/third-party/libevent)
configure: running /bin/sh ./configure '--prefix=/usr' '--host=i586-pc-linux-gnu' '--mandir=/usr/share/man' '--infodir=/usr/share/info' '--datadir=/usr/share' '--sysconfdir=/etc' '--localstatedir=/var/lib' '--with-gtk' '--with-wx' '--build=i586-pc-linux-gnu' 'build_alias=i586-pc-linux-gnu' 'host_alias=i586-pc-linux-gnu' 'CFLAGS=-Os -march=i586 -mno-tls-direct-seg-refs -mmmx -m32' 'LDFLAGS=-Wl,-O1 -Wl,--enable-new-dtags -Wl,--sort-common -s' 'CXXFLAGS=-Os -march=i586 -mno-tls-direct-seg-refs -mmmx -m32' '--enable-static' '--disable-shared' '-q' --cache-file=/dev/null --srcdir=.
appending configuration tag "CXX" to libtool
appending configuration tag "F77" to libtool
Configuration:
Source code location: .
Compiler: i586-pc-linux-gnu-g++
Build libtransmission: yes
Build Daemon: yes
Build BeOS client: no
Build GTK+ client: yes
Build OS X client: no
Build wxWidgets client: yes
Making all in third-party
Making all in libevent
Making all in .
i586-pc-linux-gnu-gcc -DHAVE_CONFIG_H -I. -I./compat -Os -march=i586 -mno-tls-direct-seg-refs -mmmx -m32 -Wall -c buffer.c -o buffer.o
i586-pc-linux-gnu-gcc -DHAVE_CONFIG_H -I. -I./compat -Os -march=i586 -mno-tls-direct-seg-refs -mmmx -m32 -Wall -c event.c -o event.o
i586-pc-linux-gnu-gcc -DHAVE_CONFIG_H -I. -I./compat -Os -march=i586 -mno-tls-direct-seg-refs -mmmx -m32 -Wall -c evbuffer.c -o evbuffer.o
i586-pc-linux-gnu-gcc -DHAVE_CONFIG_H -I. -I./compat -Os -march=i586 -mno-tls-direct-seg-refs -mmmx -m32 -Wall -c log.c -o log.o
i586-pc-linux-gnu-gcc -DHAVE_CONFIG_H -I. -I./compat -Os -march=i586 -mno-tls-direct-seg-refs -mmmx -m32 -Wall -c event_tagging.c -o event_tagging.o
i586-pc-linux-gnu-gcc -DHAVE_CONFIG_H -I. -I./compat -Os -march=i586 -mno-tls-direct-seg-refs -mmmx -m32 -Wall -c http.c -o http.o
i586-pc-linux-gnu-gcc -DHAVE_CONFIG_H -I. -I./compat -Os -march=i586 -mno-tls-direct-seg-refs -mmmx -m32 -Wall -c evdns.c -o evdns.o
i586-pc-linux-gnu-gcc -DHAVE_CONFIG_H -I. -I./compat -Os -march=i586 -mno-tls-direct-seg-refs -mmmx -m32 -Wall -c evrpc.c -o evrpc.o
i586-pc-linux-gnu-gcc -DHAVE_CONFIG_H -I. -I./compat -Os -march=i586 -mno-tls-direct-seg-refs -mmmx -m32 -Wall -c evutil.c -o evutil.o
i586-pc-linux-gnu-gcc -DHAVE_CONFIG_H -I. -I./compat -Os -march=i586 -mno-tls-direct-seg-refs -mmmx -m32 -Wall -c strlcpy.c -o strlcpy.o
i586-pc-linux-gnu-gcc -DHAVE_CONFIG_H -I. -I./compat -Os -march=i586 -mno-tls-direct-seg-refs -mmmx -m32 -Wall -c select.c -o select.o
i586-pc-linux-gnu-gcc -DHAVE_CONFIG_H -I. -I./compat -Os -march=i586 -mno-tls-direct-seg-refs -mmmx -m32 -Wall -c poll.c -o poll.o
i586-pc-linux-gnu-gcc -DHAVE_CONFIG_H -I. -I./compat -Os -march=i586 -mno-tls-direct-seg-refs -mmmx -m32 -Wall -c epoll.c -o epoll.o
i586-pc-linux-gnu-gcc -DHAVE_CONFIG_H -I. -I./compat -Os -march=i586 -mno-tls-direct-seg-refs -mmmx -m32 -Wall -c signal.c -o signal.o
mkdir .libs
i586-pc-linux-gnu-ar cru .libs/libevent.a event.o buffer.o evbuffer.o log.o event_tagging.o http.o evdns.o evrpc.o evutil.o strlcpy.o select.o poll.o epoll.o signal.o
i586-pc-linux-gnu-ranlib .libs/libevent.a
creating libevent.la
(cd .libs && rm -f libevent.la && ln -s ../libevent.la libevent.la)
Making all in sample
mkdir .libs
i586-pc-linux-gnu-gcc -I../compat -Os -march=i586 -mno-tls-direct-seg-refs -mmmx -m32 -Wall -Wl,-O1 -Wl,--enable-new-dtags -Wl,--sort-common -s -o event-test event-test.o ../.libs/libevent.a -lnsl -lrt -lresolv
i586-pc-linux-gnu-gcc -I../compat -Os -march=i586 -mno-tls-direct-seg-refs -mmmx -m32 -Wall -Wl,-O1 -Wl,--enable-new-dtags -Wl,--sort-common -s -o time-test time-test.o ../.libs/libevent.a -lnsl -lrt -lresolv
i586-pc-linux-gnu-gcc -I../compat -Os -march=i586 -mno-tls-direct-seg-refs -mmmx -m32 -Wall -Wl,-O1 -Wl,--enable-new-dtags -Wl,--sort-common -s -o signal-test signal-test.o ../.libs/libevent.a -lnsl -lrt -lresolv
Making all in test
mkdir .libs
i586-pc-linux-gnu-gcc -Os -march=i586 -mno-tls-direct-seg-refs -mmmx -m32 -Wall -Wl,-O1 -Wl,--enable-new-dtags -Wl,--sort-common -s -o test-init test-init.o ../.libs/libevent.a -lnsl -lrt -lresolv
i586-pc-linux-gnu-gcc -Os -march=i586 -mno-tls-direct-seg-refs -mmmx -m32 -Wall -Wl,-O1 -Wl,--enable-new-dtags -Wl,--sort-common -s -o test-eof test-eof.o ../.libs/libevent.a -lnsl -lrt -lresolv
i586-pc-linux-gnu-gcc -Os -march=i586 -mno-tls-direct-seg-refs -mmmx -m32 -Wall -Wl,-O1 -Wl,--enable-new-dtags -Wl,--sort-common -s -o test-weof test-weof.o ../.libs/libevent.a -lnsl -lrt -lresolv
i586-pc-linux-gnu-gcc -Os -march=i586 -mno-tls-direct-seg-refs -mmmx -m32 -Wall -Wl,-O1 -Wl,--enable-new-dtags -Wl,--sort-common -s -o test-time test-time.o ../.libs/libevent.a -lnsl -lrt -lresolv
i586-pc-linux-gnu-gcc -Os -march=i586 -mno-tls-direct-seg-refs -mmmx -m32 -Wall -Wl,-O1 -Wl,--enable-new-dtags -Wl,--sort-common -s -o regress regress.o regress_http.o regress_dns.o regress_rpc.o regress.gen.o ../.libs/libevent.a -lnsl -lrt -lresolv
i586-pc-linux-gnu-gcc -Os -march=i586 -mno-tls-direct-seg-refs -mmmx -m32 -Wall -Wl,-O1 -Wl,--enable-new-dtags -Wl,--sort-common -s -o bench bench.o ../.libs/libevent.a -lnsl -lrt -lresolv
Making all in libtransmission
trevent.c:180: warning: logFunc defined but not used
Making all in daemon
mkdir .libs
i586-pc-linux-gnu-gcc -pthread -g -Wall -W -O3 -funroll-loops -Wl,-O1 -Wl,--enable-new-dtags -Wl,--sort-common -s -o transmission-daemon daemon.o server.o torrents.o ./libdaemon.a ../libtransmission/libtransmission.a ../third-party/libevent/.libs/libevent.a -lnsl -lrt -lresolv -lssl -lcrypto -ldl -lm
i586-pc-linux-gnu-gcc -pthread -g -Wall -W -O3 -funroll-loops -Wl,-O1 -Wl,--enable-new-dtags -Wl,--sort-common -s -o transmission-proxy proxy.o ./libdaemon.a ../libtransmission/libtransmission.a ../third-party/libevent/.libs/libevent.a -lnsl -lrt -lresolv -lssl -lcrypto -ldl -lm
i586-pc-linux-gnu-gcc -pthread -g -Wall -W -O3 -funroll-loops -Wl,-O1 -Wl,--enable-new-dtags -Wl,--sort-common -s -o transmission-remote client.o remote.o ./libdaemon.a ../libtransmission/libtransmission.a ../third-party/libevent/.libs/libevent.a -lnsl -lrt -lresolv -lssl -lcrypto -ldl -lm
Making all in cli
mkdir .libs
i586-pc-linux-gnu-gcc -pthread -g -Wall -W -O3 -funroll-loops -Wl,-O1 -Wl,--enable-new-dtags -Wl,--sort-common -s -o transmission-cli transmissioncli.o ../libtransmission/libtransmission.a ../third-party/libevent/.libs/libevent.a -lnsl -lrt -lresolv -lssl -lcrypto -ldl -lm
Making all in gtk
Generating and caching the translation database
Merging translations into transmission.desktop.
mkdir .libs
i586-pc-linux-gnu-gcc -pthread -I/usr/include/gtk-2.0 -I/usr/lib/gtk-2.0/include -I/usr/include/atk-1.0 -I/usr/include/cairo -I/usr/include/pango-1.0 -I/usr/include/glib-2.0 -I/usr/lib/glib-2.0/include -I/usr/include/freetype2 -I/usr/include/libpng12 -pthread -g -Wall -W -O3 -funroll-loops -Wl,-O1 -Wl,--enable-new-dtags -Wl,--sort-common -s -o transmission actions.o conf.o dialogs.o hig.o io.o ipc.o main.o makemeta-ui.o msgwin.o torrent-inspector.o tr_cell_renderer_progress.o tr_core.o tr_icon.o tr_prefs.o tr_torrent.o tr_window.o util.o -Wl,--export-dynamic -pthread ../libtransmission/libtransmission.a ../third-party/libevent/.libs/libevent.a -lnsl -lresolv /usr/lib/libgtk-x11-2.0.so /usr/lib/libgdk-x11-2.0.so /usr/lib/libatk-1.0.so /usr/lib/libgdk_pixbuf-2.0.so /usr/lib/libpangocairo-1.0.so /usr/lib/libpangoft2-1.0.so /usr/lib/libpango-1.0.so /usr/lib/libcairo.so /usr/lib/libfreetype.so /usr/lib/libfontconfig.so /usr/lib/libxml2.so /usr/lib/libglitz.so /usr/lib/libpng12.so -lz /usr/lib/libXrender.so /usr/lib/libX11.so /usr/lib/libXau.so /usr/lib/libXdmcp.so /usr/lib/libgobject-2.0.so /usr/lib/libgmodule-2.0.so /usr/lib/libgthread-2.0.so -lpthread -lrt /usr/lib/libglib-2.0.so -lssl -lcrypto -ldl -lm
Making all in po
Making all in wx
Making all in images
filter.cc:21:21: error: foreach.h: No such file or directory
filter.cc:22:20: error: filter.h: No such file or directory
filter.cc:25: error: TorrentFilter has not been declared
filter.cc:25: error: expected , or ... before * token
filter.cc:25: error: ISO C++ forbids declaration of tr_torrent with no type
filter.cc: In function int GetFlags(int):
filter.cc:28: error: expected initializer before * token
filter.cc:30: error: s was not declared in this scope
filter.cc:32: error: TR_STATUS_DOWNLOAD was not declared in this scope
filter.cc:33: error: FLAG_LEECHING was not declared in this scope
filter.cc:36: error: TR_STATUS_DONE was not declared in this scope
filter.cc:37: error: TR_STATUS_SEED was not declared in this scope
filter.cc:38: error: FLAG_SEEDING was not declared in this scope
filter.cc:41: error: TR_STATUS_STOPPING was not declared in this scope
filter.cc:42: error: TR_STATUS_STOPPED was not declared in this scope
filter.cc:43: error: TR_STATUS_CHECK was not declared in this scope
filter.cc:44: error: TR_STATUS_CHECK_WAIT was not declared in this scope
filter.cc:48: error: s was not declared in this scope
filter.cc:49: error: FLAG_ACTIVE was not declared in this scope
filter.cc:50: error: FLAG_IDLE was not declared in this scope
filter.cc:53: error: FLAG_INCOMPLETE was not declared in this scope
filter.cc:54: error: FLAG_COMPLETE was not declared in this scope
filter.cc:56: error: FLAG_ALL was not declared in this scope
filter.cc: At global scope:
filter.cc:25: warning: unused parameter tr_torrent
filter.cc:62: error: TorrentFilter has not been declared
filter.cc:62: error: expected , or ... before & token
filter.cc:63: error: ISO C++ forbids declaration of torrents_v with no type
filter.cc: In function void CountHits(int):
filter.cc:65: error: counts was not declared in this scope
filter.cc:65: error: N_FILTERS was not declared in this scope
filter.cc:65: error: memset was not declared in this scope
filter.cc:66: error: torrents was not declared in this scope
filter.cc:66: error: it was not declared in this scope
filter.cc:66: error: foreach_const was not declared in this scope
filter.cc:66: error: expected `;' before { token
filter.cc: At global scope:
filter.cc:78: error: wxString does not name a type
filter.cc:100: error: TorrentFilter has not been declared
filter.cc:101: error: torrents_v has not been declared
filter.cc: In function void RemoveFailures(int, int&):
filter.cc:103: error: torrents_v was not declared in this scope
filter.cc:103: error: expected `;' before tmp
filter.cc:105: error: it was not declared in this scope
filter.cc:105: error: foreach_const was not declared in this scope
filter.cc:105: error: expected `;' before { token
filter.cc:117: error: request for member swap in torrents, which is of non-class type int
filter.cc:117: error: tmp was not declared in this scope
filter.cc: At global scope:
filter.cc:101: warning: unused parameter show
make[2]: *** [filter.o] Error 1
make[2]: *** Waiting for unfinished jobs....
speed-stats.cc:28:21: error: foreach.h: No such file or directory
speed-stats.cc:29:25: error: speed-stats.h: No such file or directory
/usr/include/wx-2.8/wx/hashmap.h: In member function wxLongToLongHashMap_wxImplementation_HashTable::Node** wxLongToLongHashMap_wxImplementation_HashTable::GetNodePtr(const long int&) const:
/usr/include/wx-2.8/wx/hashmap.h:714: warning: dereferencing type-punned pointer will break strict-aliasing rules
/usr/include/wx-2.8/wx/gdicmn.h: In member function wxStringToColourHashMap_wxImplementation_HashTable::Node** wxStringToColourHashMap_wxImplementation_HashTable::GetNodePtr(const wxString&) const:
/usr/include/wx-2.8/wx/gdicmn.h:544: warning: dereferencing type-punned pointer will break strict-aliasing rules
/usr/include/wx-2.8/wx/clntdata.h: In member function wxShadowObjectMethods_wxImplementation_HashTable::Node** wxShadowObjectMethods_wxImplementation_HashTable::GetNodePtr(const wxString&) const:
/usr/include/wx-2.8/wx/clntdata.h:20: warning: dereferencing type-punned pointer will break strict-aliasing rules
/usr/include/wx-2.8/wx/clntdata.h: In member function wxShadowObjectFields_wxImplementation_HashTable::Node** wxShadowObjectFields_wxImplementation_HashTable::GetNodePtr(const wxString&) const:
/usr/include/wx-2.8/wx/clntdata.h:25: warning: dereferencing type-punned pointer will break strict-aliasing rules
speed-stats.cc: At global scope:
speed-stats.cc:33: error: SpeedStats has not been declared
speed-stats.cc:33: error: wxPanel has not been declared
speed-stats.cc:33: error: SpeedStats has not been declared
speed-stats.cc:33: error: SpeedStats has not been declared
speed-stats.cc:33: error: non-member function const wxEventTable* GetEventTable() cannot have cv-qualifier
speed-stats.cc: In function const wxEventTable* GetEventTable():
speed-stats.cc:33: error: SpeedStats has not been declared
speed-stats.cc: At global scope:
speed-stats.cc:33: error: SpeedStats has not been declared
speed-stats.cc:33: error: SpeedStats has not been declared
speed-stats.cc:33: error: SpeedStats has not been declared
speed-stats.cc:33: error: non-member function wxEventHashTable& GetEventHashTable() cannot have cv-qualifier
speed-stats.cc: In function wxEventHashTable& GetEventHashTable():
speed-stats.cc:33: error: SpeedStats has not been declared
speed-stats.cc: At global scope:
speed-stats.cc:33: error: SpeedStats has not been declared
speed-stats.cc:34: error: SpeedStats was not declared in this scope
speed-stats.cc:34: error: expected primary-expression before ( token
speed-stats.cc:34: error: SpeedStats was not declared in this scope
speed-stats.cc:34: error: expected primary-expression before ) token
speed-stats.cc:34: error: expected primary-expression before ) token
speed-stats.cc:35: error: SpeedStats was not declared in this scope
speed-stats.cc:35: error: expected primary-expression before ( token
speed-stats.cc:35: error: SpeedStats was not declared in this scope
speed-stats.cc:35: error: expected primary-expression before ) token
speed-stats.cc:35: error: expected primary-expression before ) token
speed-stats.cc:38: error: SpeedStats has not been declared
speed-stats.cc:43: error: ISO C++ forbids declaration of SpeedStats with no type
speed-stats.cc: In function int SpeedStats(wxWindow*, wxWindowID, const wxPoint&, const wxSize&, long int, const wxString&):
speed-stats.cc:43: error: only constructors take base initializers
speed-stats.cc:50: error: myColors was not declared in this scope
speed-stats.cc:50: error: BACKGROUND was not declared in this scope
speed-stats.cc:51: error: FRAME was not declared in this scope
speed-stats.cc:52: error: ALL_UP was not declared in this scope
speed-stats.cc:53: error: TORRENT_UP was not declared in this scope
speed-stats.cc:55: error: ALL_DOWN was not declared in this scope
speed-stats.cc:56: error: TORRENT_DOWN was not declared in this scope
speed-stats.cc:57: warning: no return statement in function returning non-void
speed-stats.cc: At global scope:
speed-stats.cc:59: error: expected constructor, destructor, or type conversion before :: token
speed-stats.cc:69: error: SpeedStats is not a class or namespace
speed-stats.cc: In function void SetColor(int, const wxColour&):
speed-stats.cc:71: error: N_COLORS was not declared in this scope
speed-stats.cc:73: error: myColors was not declared in this scope
speed-stats.cc: At global scope:
speed-stats.cc:77: error: SpeedStats is not a class or namespace
speed-stats.cc: In function wxString GetColorName(int):
speed-stats.cc:79: error: N_COLORS was not declared in this scope
speed-stats.cc:86: error: xstr was not declared in this scope
speed-stats.cc: At global scope:
speed-stats.cc:95: error: SpeedStats is not a class or namespace
speed-stats.cc: In function void OnSize(wxSizeEvent&):
speed-stats.cc:97: error: myBitmap was not declared in this scope
speed-stats.cc:101: error: myHistory was not declared in this scope
speed-stats.cc: At global scope:
speed-stats.cc:105: error: SpeedStats is not a class or namespace
speed-stats.cc: In function void OnPaint(wxPaintEvent&):
speed-stats.cc:107: error: myBitmap was not declared in this scope
speed-stats.cc:110: error: myMaxSpeed was not declared in this scope
speed-stats.cc:118: error: myColors was not declared in this scope
speed-stats.cc:118: error: BACKGROUND was not declared in this scope
speed-stats.cc:123: error: FRAME was not declared in this scope
speed-stats.cc:147: error: myStats was not declared in this scope
speed-stats.cc:161: error: TORRENT_UP was not declared in this scope
speed-stats.cc:168: error: TORRENT_DOWN was not declared in this scope
speed-stats.cc:175: error: ALL_UP was not declared in this scope
speed-stats.cc:182: error: ALL_DOWN was not declared in this scope
speed-stats.cc:189: error: invalid use of this in non-member function
speed-stats.cc: At global scope:
speed-stats.cc:195: error: SpeedStats is not a class or namespace
speed-stats.cc: In function void SetTorrent(tr_torrent*):
speed-stats.cc:197: error: myTorrent was not declared in this scope
speed-stats.cc:201: error: myMaxSpeed was not declared in this scope
speed-stats.cc:202: error: stats_t was not declared in this scope
speed-stats.cc:202: error: myStats was not declared in this scope
speed-stats.cc:202: error: it was not declared in this scope
speed-stats.cc:202: error: foreach was not declared in this scope
speed-stats.cc:203: error: expected `;' before { token
speed-stats.cc: At global scope:
speed-stats.cc:213: error: SpeedStats is not a class or namespace
speed-stats.cc: In function void Pulse(tr_handle*):
speed-stats.cc:218: error: Speed was not declared in this scope
speed-stats.cc:218: error: expected `;' before s
speed-stats.cc:219: error: s was not declared in this scope
speed-stats.cc:222: error: myTorrent was not declared in this scope
speed-stats.cc:227: error: myStats was not declared in this scope
speed-stats.cc:230: error: myHistory was not declared in this scope
speed-stats.cc:236: error: myMaxSpeed was not declared in this scope
speed-stats.cc:241: error: Refresh was not declared in this scope
speed-stats.cc: At global scope:
speed-stats.cc:33: warning: sm_eventTableEntries defined but not used
make[2]: *** [speed-stats.o] Error 1
make[1]: *** [all-recursive] Error 1
make: *** [all-recursive] Error 1
[31;01m*[0m
[31;01m*[0m ERROR: net-p2p/transmission-0.91 failed.
[31;01m*[0m Call stack:
[31;01m*[0m ebuild.sh, line 1701: Called dyn_compile
[31;01m*[0m ebuild.sh, line 1039: Called qa_call 'src_compile'
[31;01m*[0m ebuild.sh, line 44: Called src_compile
[31;01m*[0m transmission-0.91.ebuild, line 38: Called die
[31;01m*[0m The specific snippet of code:
[31;01m*[0m emake || die "build failed"
[31;01m*[0m The die message:
[31;01m*[0m build failed
[31;01m*[0m
[31;01m*[0m If you need support, post the topmost build error, and the call stack if relevant.
[31;01m*[0m A complete build log is located at '/var/tmp/portage/net-p2p/transmission-0.91/temp/build.log'.
[31;01m*[0m