This file contains any messages produced by compilers while
running configure, to aid debugging if configure makes a mistake.
configure:938: checking host system type
configure:959: checking target system type
configure:977: checking build system type
configure:1051: checking for mawk
configure:1051: checking for gawk
configure:1051: checking for nawk
configure:1149: checking for nsinstall
configure:2114: checking for gcc
configure:2227: checking whether the C compiler (gcc ) works
configure:2243: gcc -o conftest conftest.c 1>&5
configure:2269: checking whether the C compiler (gcc ) is a cross-compiler
configure:2274: checking whether we are using GNU C
configure:2283: gcc -E conftest.c
configure:2302: checking whether gcc accepts -g
configure:2338: checking for c++
configure:2370: checking whether the C++ compiler (c++ ) works
configure:2386: c++ -o conftest conftest.C 1>&5
ld32: WARNING 84 : /usr/freeware/lib/gcc-lib/mips-sgi-irix6.5/3.3/libstdc++.a is not used for resolving any symbol.
ld32: WARNING 84 : /usr/lib32/libm.so is not used for resolving any symbol.
configure:2412: checking whether the C++ compiler (c++ ) is a cross-compiler
configure:2417: checking whether we are using GNU C++
configure:2426: c++ -E conftest.C
configure:2445: checking whether c++ accepts -g
configure:2479: checking for ranlib
configure:2511: checking for as
configure:2552: checking for ar
configure:2587: checking for ld
configure:2622: checking for strip
configure:2657: checking for windres
configure:3079: checking whether gcc and cc understand -c and -o together
configure:3094: gcc -c conftest.c -o conftest.o 1>&5
configure:3095: gcc -c conftest.c -o conftest.o 1>&5
configure:3100: cc -c conftest.c 1>&5
cc-3604 cc: WARNING File = conftest.c, Line = 1
missing return statement at end of non-void function "foo"
foo(){}
^
configure:3102: cc -c conftest.c -o conftest.o 1>&5
cc-3604 cc: WARNING File = conftest.c, Line = 1
missing return statement at end of non-void function "foo"
foo(){}
^
configure:3103: cc -c conftest.c -o conftest.o 1>&5
cc-3604 cc: WARNING File = conftest.c, Line = 1
missing return statement at end of non-void function "foo"
foo(){}
^
configure:3139: checking how to run the C preprocessor
configure:3160: gcc -E conftest.c >/dev/null 2>conftest.out
configure:3219: checking how to run the C++ preprocessor
configure:3237: c++ -E conftest.C >/dev/null 2>conftest.out
configure:3284: checking for a BSD compatible install
configure:3337: checking whether ln -s works
configure:3362: checking for perl5
configure:3402: checking for minimum required perl version >= 5.004
configure:3412: checking for full perl installation
configure:3425: checking for doxygen
configure:3461: checking for whoami
configure:3497: checking for autoconf
configure:3533: checking for unzip
configure:3571: checking for zip
configure:3612: checking for makedepend
configure:3647: checking for xargs
configure:3941: checking for gmake
configure:4009: checking for X
configure:4076: gcc -E conftest.c >/dev/null 2>conftest.out
configure:4152: gcc -o conftest conftest.c -lXt 1>&5
configure:4323: checking for dnet_ntoa in -ldnet
configure:4345: gcc -o conftest conftest.c -ldnet 1>&5
ld32: FATAL 9 : I/O error (-ldnet): No such file or directory
collect2: ld returned 32 exit status
configure: failed program was:
#line 4331 "configure"
#include "confdefs.h"
/* Override any gcc2 internal prototype to avoid an error. */
#ifdef __cplusplus
extern "C"
#endif
/* We use char because int might match the return type of a gcc2
builtin and then its argument prototype would still apply. */
char dnet_ntoa();
int main() {
dnet_ntoa()
; return 0; }
configure:4367: checking for dnet_ntoa in -ldnet_stub
configure:4389: gcc -o conftest conftest.c -ldnet_stub 1>&5
ld32: FATAL 9 : I/O error (-ldnet_stub): No such file or directory
collect2: ld returned 32 exit status
configure: failed program was:
#line 4375 "configure"
#include "confdefs.h"
/* Override any gcc2 internal prototype to avoid an error. */
#ifdef __cplusplus
extern "C"
#endif
/* We use char because int might match the return type of a gcc2
builtin and then its argument prototype would still apply. */
char dnet_ntoa();
int main() {
dnet_ntoa()
; return 0; }
configure:4418: checking for gethostbyname
configure:4449: gcc -o conftest conftest.c 1>&5
configure:4522: checking for connect
configure:4553: gcc -o conftest conftest.c 1>&5
configure:4620: checking for remove
configure:4651: gcc -o conftest conftest.c 1>&5
configure:4718: checking for shmat
configure:4749: gcc -o conftest conftest.c 1>&5
configure:4825: checking for IceConnectionNumber in -lICE
configure:4847: gcc -o conftest conftest.c -lICE 1>&5
configure:5271: checking whether ld has archive extraction flags
configure:5295: gcc -o conftest -Wl,--whole-archive conftest.c -Wl,--no-whole-archive 1>&5
(null): WARNING 1 : Unknown option: -whole-archive (ignored).
(null): WARNING 1 : Unknown option: -no-whole-archive (ignored).
configure:5330: checking for 64-bit OS
configure:5340: gcc -o conftest conftest.c 1>&5
configure: failed program was:
#line 5335 "configure"
#include "confdefs.h"
int main () {
if (sizeof(long) == 8) { return 0; } return 1; }
configure:6749: checking for ANSI C header files
configure:6762: gcc -E conftest.c >/dev/null 2>conftest.out
configure:6829: gcc -o conftest conftest.c 1>&5
configure:6853: checking for working const
configure:6907: gcc -c conftest.c 1>&5
configure:6928: checking for mode_t
configure:6961: checking for off_t
configure:6994: checking for pid_t
configure:7027: checking for size_t
configure:7060: checking for uid_t in sys/types.h
configure:7094: checking for st_blksize in struct stat
configure:7107: gcc -c conftest.c 1>&5
configure:7128: checking for siginfo_t
configure:7141: gcc -c conftest.c 1>&5
configure:7175: checking for int16_t
configure:7188: gcc -c conftest.c 1>&5
configure:7210: checking for int32_t
configure:7223: gcc -c conftest.c 1>&5
configure:7245: checking for int64_t
configure:7258: gcc -c conftest.c 1>&5
configure:7280: checking for int64
configure:7293: gcc -c conftest.c 1>&5
configure: In function `main':
configure:7289: error: `int64' undeclared (first use in this function)
configure:7289: error: (Each undeclared identifier is reported only once
configure:7289: error: for each function it appears in.)
configure:7289: error: parse error before "foo"
configure: failed program was:
#line 7285 "configure"
#include "confdefs.h"
#include <stdio.h>
#include <sys/types.h>
int main() {
int64 foo = 0;
; return 0; }
configure:7315: checking for uint
configure:7328: gcc -c conftest.c 1>&5
configure:7350: checking for uint_t
configure:7363: gcc -c conftest.c 1>&5
configure:7385: checking for uint16_t
configure:7398: gcc -c conftest.c 1>&5
configure:7429: checking for uname.domainname
configure:7442: c++ -c -D_LANGUAGE_C_PLUS_PLUS conftest.C 1>&5
configure: In function `int main()':
configure:7438: error: 'struct utsname' has no member named 'domainname'
configure: failed program was:
#line 7434 "configure"
#include "confdefs.h"
#include <sys/utsname.h>
int main() {
struct utsname *res; char *domain;
(void)uname(res); if (res != 0) { domain = res->domainname; }
; return 0; }
configure:7466: checking for uname.__domainname
configure:7479: c++ -c -D_LANGUAGE_C_PLUS_PLUS conftest.C 1>&5
configure: In function `int main()':
configure:7475: error: 'struct utsname' has no member named '__domainname'
configure: failed program was:
#line 7471 "configure"
#include "confdefs.h"
#include <sys/utsname.h>
int main() {
struct utsname *res; char *domain;
(void)uname(res); if (res != 0) { domain = res->__domainname; }
; return 0; }
configure:7512: checking for usable wchar_t (2 bytes, unsigned)
configure:7527: gcc -o conftest conftest.c 1>&5
configure: failed program was:
#line 7520 "configure"
#include "confdefs.h"
#include <stddef.h>
int main () {
return (sizeof(wchar_t) != 2) ||
(wchar_t)-1 < (wchar_t) 0 ; }
configure:7562: checking for compiler -fshort-wchar option
configure:7580: c++ -o conftest -D_LANGUAGE_C_PLUS_PLUS -fshort-wchar conftest.C 1>&5
ld32: WARNING 84 : /usr/freeware/lib/gcc-lib/mips-sgi-irix6.5/3.3/libstdc++.a is not used for resolving any symbol.
ld32: WARNING 84 : /usr/lib32/libm.so is not used for resolving any symbol.
configure:7616: checking for visibility(hidden) attribute
configure:7682: checking for dirent.h that defines DIR
configure:7695: gcc -c conftest.c 1>&5
configure:7720: checking for opendir in -ldir
configure:7739: gcc -o conftest conftest.c -ldir 1>&5
ld32: FATAL 9 : I/O error (-ldir): No such file or directory
collect2: ld returned 32 exit status
configure: failed program was:
#line 7728 "configure"
#include "confdefs.h"
/* Override any gcc2 internal prototype to avoid an error. */
/* We use char because int might match the return type of a gcc2
builtin and then its argument prototype would still apply. */
char opendir();
int main() {
opendir()
; return 0; }
configure:7812: checking for sys/byteorder.h
configure:7822: gcc -E conftest.c >/dev/null 2>conftest.out
configure:7818:27: sys/byteorder.h: No such file or directory
configure: failed program was:
#line 7817 "configure"
#include "confdefs.h"
#include <sys/byteorder.h>
configure:7812: checking for compat.h
configure:7822: gcc -E conftest.c >/dev/null 2>conftest.out
configure:7818:20: compat.h: No such file or directory
configure: failed program was:
#line 7817 "configure"
#include "confdefs.h"
#include <compat.h>
configure:7812: checking for getopt.h
configure:7822: gcc -E conftest.c >/dev/null 2>conftest.out
configure:7852: checking for sys/bitypes.h
configure:7862: gcc -E conftest.c >/dev/null 2>conftest.out
configure:7858:25: sys/bitypes.h: No such file or directory
configure: failed program was:
#line 7857 "configure"
#include "confdefs.h"
#include <sys/bitypes.h>
configure:7852: checking for memory.h
configure:7862: gcc -E conftest.c >/dev/null 2>conftest.out
configure:7852: checking for unistd.h
configure:7862: gcc -E conftest.c >/dev/null 2>conftest.out
configure:7892: checking for gnu/libc-version.h
configure:7902: gcc -E conftest.c >/dev/null 2>conftest.out
configure:7898:30: gnu/libc-version.h: No such file or directory
configure: failed program was:
#line 7897 "configure"
#include "confdefs.h"
#include <gnu/libc-version.h>
configure:7892: checking for nl_types.h
configure:7902: gcc -E conftest.c >/dev/null 2>conftest.out
configure:7932: checking for malloc.h
configure:7942: gcc -E conftest.c >/dev/null 2>conftest.out
configure:7972: checking for X11/XKBlib.h
configure:7982: gcc -E conftest.c >/dev/null 2>conftest.out
configure:8013: checking for sys/statvfs.h
configure:8023: gcc -E conftest.c >/dev/null 2>conftest.out
configure:8013: checking for sys/statfs.h
configure:8023: gcc -E conftest.c >/dev/null 2>conftest.out
configure:8013: checking for sys/vfs.h
configure:8023: gcc -E conftest.c >/dev/null 2>conftest.out
configure:8013: checking for sys/mount.h
configure:8023: gcc -E conftest.c >/dev/null 2>conftest.out
configure:8054: checking for mmintrin.h
configure:8064: gcc -E conftest.c >/dev/null 2>conftest.out
configure:8060:22: mmintrin.h: No such file or directory
configure: failed program was:
#line 8059 "configure"
#include "confdefs.h"
#include <mmintrin.h>
configure:8101: checking for new
configure:8111: c++ -E conftest.C >/dev/null 2>conftest.out
configure:8152: checking for sys/cdefs.h
configure:8162: gcc -E conftest.c >/dev/null 2>conftest.out
configure:8196: checking for gethostbyname_r in -lc_r
configure:8215: gcc -o conftest conftest.c -lc_r 1>&5
ld32: FATAL 9 : I/O error (-lc_r): No such file or directory
collect2: ld returned 32 exit status
configure: failed program was:
#line 8204 "configure"
#include "confdefs.h"
/* Override any gcc2 internal prototype to avoid an error. */
/* We use char because int might match the return type of a gcc2
builtin and then its argument prototype would still apply. */
char gethostbyname_r();
int main() {
gethostbyname_r()
; return 0; }
configure:8245: checking for atan in -lm
configure:8264: gcc -o conftest conftest.c -lm 1>&5
configure:8298: checking for dlopen in -ldl
configure:8317: gcc -o conftest conftest.c -ldl -lm 1>&5
ld32: WARNING 84 : /usr/lib32/libdl.so is not used for resolving any symbol.
ld32: WARNING 84 : /usr/lib32/libm.so is not used for resolving any symbol.
configure:8334: checking for dlfcn.h
configure:8344: gcc -E conftest.c >/dev/null 2>conftest.out
configure:8479: checking for socket in -lsocket
configure:8498: gcc -o conftest conftest.c -lsocket -ldl -lm 1>&5
ld32: WARNING 84 : /usr/lib32/libsocket.so is not used for resolving any symbol.
ld32: WARNING 84 : /usr/lib32/libdl.so is not used for resolving any symbol.
ld32: WARNING 84 : /usr/lib32/libm.so is not used for resolving any symbol.
configure:8543: checking for XDrawLines in -lX11
configure:8562: gcc -o conftest conftest.c -lX11 -lX11 -lsocket -ldl -lm 1>&5
ld32: WARNING 84 : /usr/lib32/libsocket.so is not used for resolving any symbol.
ld32: WARNING 84 : /usr/lib32/libdl.so is not used for resolving any symbol.
ld32: WARNING 84 : /usr/lib32/libm.so is not used for resolving any symbol.
configure:8584: checking for XextAddDisplay in -lXext
configure:8603: gcc -o conftest conftest.c -lXext -lX11 -lsocket -ldl -lm 1>&5
ld32: WARNING 84 : /usr/lib32/libsocket.so is not used for resolving any symbol.
ld32: WARNING 84 : /usr/lib32/libdl.so is not used for resolving any symbol.
ld32: WARNING 84 : /usr/lib32/libm.so is not used for resolving any symbol.
configure:8627: checking for XtFree in -lXt
configure:8646: gcc -o conftest conftest.c -lXt -lsocket -ldl -lm 1>&5
ld32: WARNING 84 : /usr/lib32/libsocket.so is not used for resolving any symbol.
ld32: WARNING 84 : /usr/lib32/libdl.so is not used for resolving any symbol.
ld32: WARNING 84 : /usr/lib32/libm.so is not used for resolving any symbol.
configure:8800: checking for XineramaIsActive in -lXinerama
configure:8819: gcc -o conftest conftest.c -lXinerama -lX11 -lXext -lsocket -ldl -lm 1>&5
ld32: FATAL 9 : I/O error (-lXinerama): No such file or directory
collect2: ld returned 32 exit status
configure: failed program was:
#line 8808 "configure"
#include "confdefs.h"
/* Override any gcc2 internal prototype to avoid an error. */
/* We use char because int might match the return type of a gcc2
builtin and then its argument prototype would still apply. */
char XineramaIsActive();
int main() {
XineramaIsActive()
; return 0; }
configure:8841: checking for X11/extensions/Xinerama.h
configure:8851: gcc -E conftest.c >/dev/null 2>conftest.out
configure:8874: checking for XShmCreateImage in -lXext
configure:8893: gcc -o conftest conftest.c -lXext -lX11 -lXext -lsocket -ldl -lm 1>&5
ld32: WARNING 84 : /usr/lib32/libsocket.so is not used for resolving any symbol.
ld32: WARNING 84 : /usr/lib32/libdl.so is not used for resolving any symbol.
ld32: WARNING 84 : /usr/lib32/libm.so is not used for resolving any symbol.
configure:8915: checking for X11/extensions/XShm.h
configure:8925: gcc -E conftest.c >/dev/null 2>conftest.out
configure:8955: checking for XieFloGeometry in -lXIE
configure:8974: gcc -o conftest conftest.c -lXIE -lX11 -lXext -lsocket -ldl -lm 1>&5
ld32: FATAL 9 : I/O error (-lXIE): No such file or directory
collect2: ld returned 32 exit status
configure: failed program was:
#line 8963 "configure"
#include "confdefs.h"
/* Override any gcc2 internal prototype to avoid an error. */
/* We use char because int might match the return type of a gcc2
builtin and then its argument prototype would still apply. */
char XieFloGeometry();
int main() {
XieFloGeometry()
; return 0; }
configure:8996: checking for X11/extensions/XIElib.h
configure:9006: gcc -E conftest.c >/dev/null 2>conftest.out
configure:9002:35: X11/extensions/XIElib.h: No such file or directory
configure: failed program was:
#line 9001 "configure"
#include "confdefs.h"
#include <X11/extensions/XIElib.h>
configure:9080: checking for freetype-config
configure:9116: checking for FreeType - version >= 6.1.0
configure:9242: checking for pthread_create in -lpthreads
gcc -o dummy dummy.c -lpthreads -lsocket -ldl -lm
ld32: FATAL 9 : I/O error (-lpthreads): No such file or directory
collect2: ld returned 32 exit status
configure:9264: checking for pthread_create in -lpthread
gcc -o dummy dummy.c -lpthread -lsocket -ldl -lm
ld32: WARNING 84 : /usr/lib32/libsocket.so is not used for resolving any symbol.
ld32: WARNING 84 : /usr/lib32/libdl.so is not used for resolving any symbol.
ld32: WARNING 84 : /usr/lib32/libm.so is not used for resolving any symbol.
configure:9364: checking whether gcc accepts -pthread
configure:9387: checking whether gcc accepts -pthreads
configure:9509: checking whether mmap() sees write()s
configure:9552: gcc -o conftest conftest.c -lsocket -ldl -lm 1>&5
ld32: WARNING 84 : /usr/lib32/libsocket.so is not used for resolving any symbol.
ld32: WARNING 84 : /usr/lib32/libdl.so is not used for resolving any symbol.
ld32: WARNING 84 : /usr/lib32/libm.so is not used for resolving any symbol.
configure:9577: checking whether gcc needs -traditional
configure:9623: checking for 8-bit clean memcmp
configure:9641: gcc -o conftest conftest.c -lsocket -ldl -lm 1>&5
ld32: WARNING 84 : /usr/lib32/libsocket.so is not used for resolving any symbol.
ld32: WARNING 84 : /usr/lib32/libdl.so is not used for resolving any symbol.
ld32: WARNING 84 : /usr/lib32/libm.so is not used for resolving any symbol.
configure:9661: checking for random
configure:9689: gcc -o conftest conftest.c -lsocket -ldl -lm 1>&5
ld32: WARNING 84 : /usr/lib32/libsocket.so is not used for resolving any symbol.
ld32: WARNING 84 : /usr/lib32/libdl.so is not used for resolving any symbol.
ld32: WARNING 84 : /usr/lib32/libm.so is not used for resolving any symbol.
configure:9661: checking for strerror
configure:9689: gcc -o conftest conftest.c -lsocket -ldl -lm 1>&5
ld32: WARNING 84 : /usr/lib32/libsocket.so is not used for resolving any symbol.
ld32: WARNING 84 : /usr/lib32/libdl.so is not used for resolving any symbol.
ld32: WARNING 84 : /usr/lib32/libm.so is not used for resolving any symbol.
configure:9661: checking for lchown
configure:9689: gcc -o conftest conftest.c -lsocket -ldl -lm 1>&5
ld32: WARNING 84 : /usr/lib32/libsocket.so is not used for resolving any symbol.
ld32: WARNING 84 : /usr/lib32/libdl.so is not used for resolving any symbol.
ld32: WARNING 84 : /usr/lib32/libm.so is not used for resolving any symbol.
configure:9661: checking for fchmod
configure:9689: gcc -o conftest conftest.c -lsocket -ldl -lm 1>&5
ld32: WARNING 84 : /usr/lib32/libsocket.so is not used for resolving any symbol.
ld32: WARNING 84 : /usr/lib32/libdl.so is not used for resolving any symbol.
ld32: WARNING 84 : /usr/lib32/libm.so is not used for resolving any symbol.
configure:9661: checking for snprintf
configure:9689: gcc -o conftest conftest.c -lsocket -ldl -lm 1>&5
configure:9673: warning: conflicting types for built-in function `snprintf'
ld32: WARNING 84 : /usr/lib32/libsocket.so is not used for resolving any symbol.
ld32: WARNING 84 : /usr/lib32/libdl.so is not used for resolving any symbol.
ld32: WARNING 84 : /usr/lib32/libm.so is not used for resolving any symbol.
configure:9661: checking for statvfs
configure:9689: gcc -o conftest conftest.c -lsocket -ldl -lm 1>&5
ld32: WARNING 84 : /usr/lib32/libsocket.so is not used for resolving any symbol.
ld32: WARNING 84 : /usr/lib32/libdl.so is not used for resolving any symbol.
ld32: WARNING 84 : /usr/lib32/libm.so is not used for resolving any symbol.
configure:9661: checking for memmove
configure:9689: gcc -o conftest conftest.c -lsocket -ldl -lm 1>&5
ld32: WARNING 84 : /usr/lib32/libsocket.so is not used for resolving any symbol.
ld32: WARNING 84 : /usr/lib32/libdl.so is not used for resolving any symbol.
ld32: WARNING 84 : /usr/lib32/libm.so is not used for resolving any symbol.
configure:9661: checking for rint
configure:9689: gcc -o conftest conftest.c -lsocket -ldl -lm 1>&5
ld32: WARNING 84 : /usr/lib32/libsocket.so is not used for resolving any symbol.
ld32: WARNING 84 : /usr/lib32/libdl.so is not used for resolving any symbol.
configure:9661: checking for stat64
configure:9689: gcc -o conftest conftest.c -lsocket -ldl -lm 1>&5
ld32: WARNING 84 : /usr/lib32/libsocket.so is not used for resolving any symbol.
ld32: WARNING 84 : /usr/lib32/libdl.so is not used for resolving any symbol.
ld32: WARNING 84 : /usr/lib32/libm.so is not used for resolving any symbol.
configure:9661: checking for lstat64
configure:9689: gcc -o conftest conftest.c -lsocket -ldl -lm 1>&5
ld32: WARNING 84 : /usr/lib32/libsocket.so is not used for resolving any symbol.
ld32: WARNING 84 : /usr/lib32/libdl.so is not used for resolving any symbol.
ld32: WARNING 84 : /usr/lib32/libm.so is not used for resolving any symbol.
configure:9716: checking for flockfile
configure:9744: gcc -o conftest conftest.c -lsocket -ldl -lm 1>&5
ld32: WARNING 84 : /usr/lib32/libsocket.so is not used for resolving any symbol.
ld32: WARNING 84 : /usr/lib32/libdl.so is not used for resolving any symbol.
ld32: WARNING 84 : /usr/lib32/libm.so is not used for resolving any symbol.
configure:9716: checking for getpagesize
configure:9744: gcc -o conftest conftest.c -lsocket -ldl -lm 1>&5
ld32: WARNING 84 : /usr/lib32/libsocket.so is not used for resolving any symbol.
ld32: WARNING 84 : /usr/lib32/libdl.so is not used for resolving any symbol.
ld32: WARNING 84 : /usr/lib32/libm.so is not used for resolving any symbol.
configure:9773: checking for localtime_r
configure:9801: gcc -o conftest conftest.c -lsocket -ldl -lm 1>&5
ld32: WARNING 84 : /usr/lib32/libsocket.so is not used for resolving any symbol.
ld32: WARNING 84 : /usr/lib32/libdl.so is not used for resolving any symbol.
ld32: WARNING 84 : /usr/lib32/libm.so is not used for resolving any symbol.
configure:9773: checking for strtok_r
configure:9801: gcc -o conftest conftest.c -lsocket -ldl -lm 1>&5
ld32: WARNING 84 : /usr/lib32/libsocket.so is not used for resolving any symbol.
ld32: WARNING 84 : /usr/lib32/libdl.so is not used for resolving any symbol.
ld32: WARNING 84 : /usr/lib32/libm.so is not used for resolving any symbol.
configure:9837: checking for wcrtomb
configure:9849: c++ -o conftest -D_LANGUAGE_C_PLUS_PLUS -fshort-wchar conftest.C -lsocket -ldl -lm 1>&5
ld32: WARNING 84 : /usr/lib32/libsocket.so is not used for resolving any symbol.
ld32: WARNING 84 : /usr/lib32/libdl.so is not used for resolving any symbol.
ld32: WARNING 84 : /usr/freeware/lib/gcc-lib/mips-sgi-irix6.5/3.3/libstdc++.a is not used for resolving any symbol.
ld32: WARNING 84 : /usr/lib32/libm.so is not used for resolving any symbol.
configure:9869: checking for mbrtowc
configure:9881: c++ -o conftest -D_LANGUAGE_C_PLUS_PLUS -fshort-wchar conftest.C -lsocket -ldl -lm 1>&5
ld32: WARNING 84 : /usr/lib32/libsocket.so is not used for resolving any symbol.
ld32: WARNING 84 : /usr/lib32/libdl.so is not used for resolving any symbol.
ld32: WARNING 84 : /usr/freeware/lib/gcc-lib/mips-sgi-irix6.5/3.3/libstdc++.a is not used for resolving any symbol.
ld32: WARNING 84 : /usr/lib32/libm.so is not used for resolving any symbol.
configure:9910: checking for res_ninit()
configure:9927: gcc -o conftest conftest.c -lsocket -ldl -lm 1>&5
In file included from configure:9920:
/usr/include/resolv.h:111: error: field `nsaddr_list' has incomplete type
/usr/include/resolv.h:121: error: field `addr' has incomplete type
configure: failed program was:
#line 9915 "configure"
#include "confdefs.h"
#ifdef linux
#define _BSD_SOURCE 1
#endif
#include <resolv.h>
int main() {
int foo = res_ninit(&_res);
; return 0; }
configure:9957: checking for gnu_get_libc_version()
configure:9973: c++ -o conftest -D_LANGUAGE_C_PLUS_PLUS -fshort-wchar conftest.C -lsocket -ldl -lm 1>&5
configure: In function `int main()':
configure:9969: error: `gnu_get_libc_version' undeclared (first use this
function)
configure:9969: error: (Each undeclared identifier is reported only once for
each function it appears in.)
configure: failed program was:
#line 9962 "configure"
#include "confdefs.h"
#ifdef HAVE_GNU_LIBC_VERSION_H
#include <gnu/libc-version.h>
#endif
int main() {
const char *glibc_version = gnu_get_libc_version();
; return 0; }
configure:10002: checking for iconv in -lc
configure:10024: c++ -o conftest -D_LANGUAGE_C_PLUS_PLUS -fshort-wchar conftest.C -lc -lsocket -ldl -lm 1>&5
ld32: WARNING 84 : /usr/lib32/libsocket.so is not used for resolving any symbol.
ld32: WARNING 84 : /usr/lib32/libdl.so is not used for resolving any symbol.
ld32: WARNING 84 : /usr/lib32/libm.so is not used for resolving any symbol.
ld32: WARNING 127: Two shared objects with the same soname, /usr/lib32/mips3/libc.so and /usr/lib32/libc.so,
have been been linked. This is probably due to a missing -L specification. Ignoring the latter.
configure:10133: checking for iconv()
configure:10152: c++ -o conftest -D_LANGUAGE_C_PLUS_PLUS -fshort-wchar conftest.C -lsocket -ldl -lm 1>&5
ld32: WARNING 84 : /usr/lib32/libsocket.so is not used for resolving any symbol.
ld32: WARNING 84 : /usr/lib32/libdl.so is not used for resolving any symbol.
ld32: WARNING 84 : /usr/lib32/libm.so is not used for resolving any symbol.
configure:10176: checking for iconv() with const input
configure:10196: c++ -c -D_LANGUAGE_C_PLUS_PLUS -fshort-wchar conftest.C 1>&5
configure: In function `int main()':
configure:10190: error: invalid conversion from `const char**' to `char**'
configure: failed program was:
#line 10181 "configure"
#include "confdefs.h"
#include <stdlib.h>
#include <iconv.h>
int main() {
const char *input = "testing";
iconv_t h = iconv_open("", "");
iconv(h, &input, NULL, NULL, NULL);
iconv_close(h);
; return 0; }
configure:10225: checking for nl_langinfo and CODESET
configure:10237: c++ -o conftest -D_LANGUAGE_C_PLUS_PLUS -fshort-wchar conftest.C -lsocket -ldl -lm 1>&5
ld32: WARNING 84 : /usr/lib32/libsocket.so is not used for resolving any symbol.
ld32: WARNING 84 : /usr/lib32/libdl.so is not used for resolving any symbol.
ld32: WARNING 84 : /usr/lib32/libm.so is not used for resolving any symbol.
configure:10269: checking for an implementation of va_copy()
configure:10293: gcc -o conftest conftest.c -lsocket -ldl -lm 1>&5
ld32: WARNING 84 : /usr/lib32/libsocket.so is not used for resolving any symbol.
ld32: WARNING 84 : /usr/lib32/libdl.so is not used for resolving any symbol.
ld32: WARNING 84 : /usr/lib32/libm.so is not used for resolving any symbol.
configure:10310: checking for an implementation of __va_copy()
configure:10334: gcc -o conftest conftest.c -lsocket -ldl -lm 1>&5
ld32: WARNING 84 : /usr/lib32/libsocket.so is not used for resolving any symbol.
ld32: WARNING 84 : /usr/lib32/libdl.so is not used for resolving any symbol.
ld32: WARNING 84 : /usr/lib32/libm.so is not used for resolving any symbol.
configure:10351: checking whether va_lists can be copied by value
configure:10375: gcc -o conftest conftest.c -lsocket -ldl -lm 1>&5
ld32: WARNING 84 : /usr/lib32/libsocket.so is not used for resolving any symbol.
ld32: WARNING 84 : /usr/lib32/libdl.so is not used for resolving any symbol.
ld32: WARNING 84 : /usr/lib32/libm.so is not used for resolving any symbol.
configure:10474: checking for C++ exceptions flag
configure:10509: checking for gcc 3.0 ABI
configure:10527: c++ -c -D_LANGUAGE_C_PLUS_PLUS -fshort-wchar conftest.C 1>&5
configure:10551: checking for C++ "explicit" keyword
configure:10566: c++ -c -D_LANGUAGE_C_PLUS_PLUS -fshort-wchar conftest.C 1>&5
configure:10587: checking for C++ "typename" keyword
configure:10611: c++ -c -D_LANGUAGE_C_PLUS_PLUS -fshort-wchar conftest.C 1>&5
configure:10632: checking for modern C++ template specialization syntax support
configure:10647: c++ -c -D_LANGUAGE_C_PLUS_PLUS -fshort-wchar conftest.C 1>&5
configure:10669: checking whether partial template specialization works
configure:10682: c++ -c -D_LANGUAGE_C_PLUS_PLUS -fshort-wchar conftest.C 1>&5
configure:10703: checking whether operators must be re-defined for templates derived from templates
configure:10720: c++ -c -D_LANGUAGE_C_PLUS_PLUS -fshort-wchar conftest.C 1>&5
configure:10742: checking whether we need to cast a derived template to pass as its base class
configure:10756: c++ -c -D_LANGUAGE_C_PLUS_PLUS -fshort-wchar conftest.C 1>&5
configure:10777: checking whether the compiler can resolve const ambiguities for templates
configure:10803: c++ -c -D_LANGUAGE_C_PLUS_PLUS -fshort-wchar conftest.C 1>&5
configure:10825: checking whether the C++ "using" keyword can change access
configure:10838: c++ -c -D_LANGUAGE_C_PLUS_PLUS -fshort-wchar conftest.C 1>&5
configure:10849: c++ -c -D_LANGUAGE_C_PLUS_PLUS -fshort-wchar conftest.C 1>&5
configure:10877: checking whether the C++ "using" keyword resolves ambiguity
configure:10898: c++ -c -D_LANGUAGE_C_PLUS_PLUS -fshort-wchar conftest.C 1>&5
configure:10919: checking for "std::" namespace
configure:10931: c++ -c -D_LANGUAGE_C_PLUS_PLUS -fshort-wchar conftest.C 1>&5
configure:10952: checking whether standard template operator!=() is ambiguous
configure:10967: c++ -c -D_LANGUAGE_C_PLUS_PLUS -fshort-wchar conftest.C 1>&5
configure:10989: checking for C++ reinterpret_cast
configure:11002: c++ -c -D_LANGUAGE_C_PLUS_PLUS -fshort-wchar conftest.C 1>&5
configure:11023: checking for C++ dynamic_cast to void*
configure:11050: c++ -o conftest -D_LANGUAGE_C_PLUS_PLUS -fshort-wchar conftest.C -lsocket -ldl -lm 1>&5
ld32: WARNING 84 : /usr/lib32/libsocket.so is not used for resolving any symbol.
ld32: WARNING 84 : /usr/lib32/libdl.so is not used for resolving any symbol.
ld32: WARNING 84 : /usr/lib32/libm.so is not used for resolving any symbol.
configure:11074: checking whether C++ requires implementation of unused virtual methods
configure:11086: c++ -o conftest -D_LANGUAGE_C_PLUS_PLUS -fshort-wchar conftest.C -lsocket -ldl -lm 1>&5
configure:11080: warning: all member functions in class `X' are private
ld32: WARNING 84 : /usr/lib32/libsocket.so is not used for resolving any symbol.
ld32: WARNING 84 : /usr/lib32/libdl.so is not used for resolving any symbol.
ld32: WARNING 84 : /usr/freeware/lib/gcc-lib/mips-sgi-irix6.5/3.3/libstdc++.a is not used for resolving any symbol.
ld32: WARNING 84 : /usr/lib32/libm.so is not used for resolving any symbol.
ld32: ERROR 33 : Unresolved text symbol "vtable for X" -- 1st referenced by /var/tmp//ccxYdobd.o.
Use linker option -v to see when and which objects, archives and dsos are loaded.
ld32: INFO 152: Output file removed because of error.
collect2: ld returned 2 exit status
configure: failed program was:
#line 11079 "configure"
#include "confdefs.h"
class X {private: virtual void never_called();};
int main() {
X x;
; return 0; }
configure:11109: checking for trouble comparing to zero near std::operator!=()
configure:11125: c++ -c -D_LANGUAGE_C_PLUS_PLUS -fshort-wchar conftest.C 1>&5
configure:11157: checking for LC_MESSAGES
configure:11169: gcc -c conftest.c 1>&5
configure:11899: checking for gtk-config
configure:11934: checking for GTK - version >= 1.2.0
configure:12035: gcc -o conftest -I/usr/freeware/include/gtk-1.2 -I/usr/freeware/include/glib-1.2 -I/usr/freeware/lib32/glib/include conftest.c -lsocket -ldl -lm -L/usr/freeware/lib32 -lgtk -lgdk -lgmodule -lglib -lintl -lXi -lXext -lX11 -lm 1>&5
ld32: WARNING 84 : /usr/lib32/libsocket.so is not used for resolving any symbol.
ld32: WARNING 84 : /usr/lib32/libdl.so is not used for resolving any symbol.
ld32: WARNING 84 : /usr/lib32/libm.so is not used for resolving any symbol.
ld32: WARNING 127: Two shared objects with the same soname, /usr/lib32/mips3/libm.so and /usr/lib32/libm.so,
have been been linked. This is probably due to a missing -L specification. Ignoring the latter.
ld32: WARNING 127: Two shared objects with the same soname, /usr/lib32/mips3/libm.so and /usr/lib32/libm.so,
have been been linked. This is probably due to a missing -L specification. Ignoring the latter.
configure:13250: checking for XpGetPrinterList in -lXp
configure:13269: gcc -o conftest conftest.c -lXp -lXext -lX11 -lsocket -ldl -lm 1>&5
ld32: FATAL 9 : I/O error (-lXp): No such file or directory
collect2: ld returned 32 exit status
configure: failed program was:
#line 13258 "configure"
#include "confdefs.h"
/* Override any gcc2 internal prototype to avoid an error. */
/* We use char because int might match the return type of a gcc2
builtin and then its argument prototype would still apply. */
char XpGetPrinterList();
int main() {
XpGetPrinterList()
; return 0; }
configure:14859: checking for valid optimization flags
configure:14870: gcc -c -O conftest.c 1>&5
configure:15481: checking for __cxa_demangle
configure:15512: c++ -o conftest -D_LANGUAGE_C_PLUS_PLUS -fshort-wchar conftest.C -lsocket -ldl -lm 1>&5
ld32: WARNING 84 : /usr/lib32/libsocket.so is not used for resolving any symbol.
ld32: WARNING 84 : /usr/lib32/libdl.so is not used for resolving any symbol.
ld32: WARNING 84 : /usr/lib32/libm.so is not used for resolving any symbol.
configure:15650: checking for gcc -pipe support
configure:15714: checking whether compiler supports -Wno-long-long
configure:15723: gcc -c -Wno-long-long conftest.c 1>&5
configure:15744: checking whether C compiler supports -fprofile-generate
configure:15753: gcc -c -fprofile-generate conftest.c 1>&5
cc1: error: unrecognized option `-fprofile-generate'
configure: failed program was:
#line 15746 "configure"
#include "confdefs.h"
int main() {
return 0;
; return 0; }
configure:15771: checking whether C compiler supports -fprofile-arcs
configure:15780: gcc -c -fprofile-arcs conftest.c 1>&5
configure:15826: checking whether C++ compiler has -pedantic long long bug
configure:15840: c++ -o conftest -D_LANGUAGE_C_PLUS_PLUS -fshort-wchar -Wall -Wno-long-long -pedantic conftest.C -lsocket -ldl -lm 1>&5
ld32: WARNING 84 : /usr/lib32/libsocket.so is not used for resolving any symbol.
ld32: WARNING 84 : /usr/lib32/libdl.so is not used for resolving any symbol.
ld32: WARNING 84 : /usr/freeware/lib/gcc-lib/mips-sgi-irix6.5/3.3/libstdc++.a is not used for resolving any symbol.
ld32: WARNING 84 : /usr/lib32/libm.so is not used for resolving any symbol.
configure:15870: checking for correct temporary object destruction order
configure:15898: c++ -o conftest -D_LANGUAGE_C_PLUS_PLUS -fshort-wchar conftest.C -lsocket -ldl -lm 1>&5
ld32: WARNING 84 : /usr/lib32/libsocket.so is not used for resolving any symbol.
ld32: WARNING 84 : /usr/lib32/libdl.so is not used for resolving any symbol.
ld32: WARNING 84 : /usr/freeware/lib/gcc-lib/mips-sgi-irix6.5/3.3/libstdc++.a is not used for resolving any symbol.
ld32: WARNING 84 : /usr/lib32/libm.so is not used for resolving any symbol.
configure:15919: checking for correct overload resolution with const and templates
configure:15954: c++ -c -D_LANGUAGE_C_PLUS_PLUS -fshort-wchar -Wall -Wno-long-long -pedantic conftest.C 1>&5
configure:16398: checking for glib-config
configure:16433: checking for GLIB - version >= 1.2.0
configure:16532: gcc -o conftest -I/usr/freeware/include/glib-1.2 -I/usr/freeware/lib32/glib/include conftest.c -L/usr/freeware/lib32 -lglib -lsocket -ldl -lm 1>&5
ld32: WARNING 84 : /usr/lib32/libsocket.so is not used for resolving any symbol.
ld32: WARNING 84 : /usr/lib32/libdl.so is not used for resolving any symbol.
ld32: WARNING 84 : /usr/lib32/libm.so is not used for resolving any symbol.
configure:16620: checking for libIDL-config
configure:16655: checking for libIDL - version >= 0.6.3
configure:16768: gcc -o conftest -I/usr/freeware/include/glib-1.2 -I/usr/freeware/lib32/glib/include -I/usr/freeware/include/libIDL-1.0 -I/usr/freeware/include/glib-1.2 -I/usr/freeware/lib32/glib/include conftest.c -L/usr/freeware/lib32 -lglib -L/usr/freeware/lib32 -lIDL -lglib -lsocket -ldl -lm 1>&5
ld32: WARNING 84 : /usr/lib32/libsocket.so is not used for resolving any symbol.
ld32: WARNING 84 : /usr/lib32/libdl.so is not used for resolving any symbol.
ld32: WARNING 84 : /usr/lib32/libm.so is not used for resolving any symbol.
configure:19061: gcc -c -Wall -Wno-long-long -pedantic conftest.c 1>&5
configure: In function `main':
configure:19055: warning: implicit declaration of function `exit'