All pastes #79138 Raw Edit

Miscellany

public text v1 · immutable
·published 2006-07-04 23:35 UTC
rendered paste body
/usr/src/modules/nvidia-kernel/nv/nv-linux.h:241:5: warning: "NV_ENABLE_MEM_TRACKING" is not defined 
/usr/src/modules/nvidia-kernel/nv/nv-linux.h:269:5: warning: "NV_ENABLE_MEM_TRACKING" is not defined
/usr/src/modules/nvidia-kernel/nv/nv-linux.h:691:2: warning: #warning "conftest.sh failed, assuming remap_page_range(4)!"
CC [M]  /usr/src/modules/nvidia-kernel/nv/os-agp.o
In file included from include/linux/list.h:7,
              from include/linux/wait.h:23,
              from include/asm/semaphore.h:41,
              from include/linux/sched.h:20,
              from include/linux/module.h:10,
              from /usr/src/modules/nvidia-kernel/nv/nv-linux.h:46,
              from /usr/src/modules/nvidia-kernel/nv/os-agp.c:24:
include/linux/prefetch.h: In function `prefetch_range':
include/linux/prefetch.h:62: warning: pointer of type `void *' used in arithmetic
In file included from include/linux/dmapool.h:14,
              from include/linux/pci.h:522,
              from /usr/src/modules/nvidia-kernel/nv/nv-linux.h:69,
              from /usr/src/modules/nvidia-kernel/nv/os-agp.c:24:
include/asm/io.h: In function `check_signature': 
include/asm/io.h:258: warning: wrong type argument to increment
In file included from /usr/src/modules/nvidia-kernel/nv/os-agp.c:24:
/usr/src/modules/nvidia-kernel/nv/nv-linux.h:241:5: warning: "NV_ENABLE_MEM_TRACKING" is not defined
/usr/src/modules/nvidia-kernel/nv/nv-linux.h:269:5: warning: #warning "NV_ENABLE_MEM_TRACKING" is not defined
/usr/src/modules/nvidia-kernel/nv/nv-linux.h:691:2: warning: #warning "conftest.sh failed, assuming remap_page_range(4)!" 
CC [M]  /usr/src/modules/nvidia-kernel/nv/os-interface.o
In file included from include/linux/list.h:7,
              from include/linux/wait.h:23,
              from include/asm/semaphore.h:41,
              from include/linux/sched.h:20,
              from include/linux/module.h:10,
              from /usr/src/modules/nvidia-kernel/nv/nv-linux.h:46,
              from /usr/src/modules/nvidia-kernel/nv/os-interface.c:26: 

include/linux/prefetch.h: In function `prefetch_range':
include/linux/prefetch.h:62: warning: pointer of type `void *' used in arithmetic 

In file included from include/linux/dmapool.h:14,                          #
              from include/linux/pci.h:522,
              from /usr/src/modules/nvidia-kernel/nv/nv-linux.h:69, 
/usr/src/modules/nvidia-kernel/nv/os-interface.c:26:
include/asm/io.h: In function `check_signature': 
include/asm/io.h:258: warning: wrong type argument to increment 
In file included from
/usr/src/modules/nvidia-kernel/nv/os-interface.c:26:
/usr/src/modules/nvidia-kernel/nv/nv-linux.h:241:5: warning:
"NV_ENABLE_MEM_TRACKING" is not defined
/usr/src/modules/nvidia-kernel/nv/nv-linux.h:269:5: warning:
"NV_ENABLE_MEM_TRACKING" is not defined 
/usr/src/modules/nvidia-kernel/nv/nv-linux.h:691:2: warning: #warning
"conftest.sh failed, assuming remap_page_range(4)!"
/usr/src/modules/nvidia-kernel/nv/os-interface.c:667:5: warning: "DEBUG" is not defined
/usr/src/modules/nvidia-kernel/nv/os-interface.c:679:5: warning: "DEBUG" is not defined
/usr/src/modules/nvidia-kernel/nv/os-interface.c: In function 
`os_set_mlock_capability':
/usr/src/modules/nvidia-kernel/nv/os-interface.c:1262: error: structure
has no member named `rlim'
make[4]: *** [/usr/src/modules/nvidia-kernel/nv/os-interface.o] Error 1
make[3]: *** [_module_/usr/src/modules/nvidia-kernel/nv] Error 2
make[3]: Leaving directory `/usr/src/linux-headers-2.6.16-2-686-smp'
NVIDIA: left KBUILD.                                                       
nvidia.ko failed to build!                        
make[2]: *** [module] Error 1                     
make[2]: Leaving directory `/usr/src/modules/nvidia-kernel/nv'
make[1]: *** [build-stamp] Error 2
make[1]: Leaving directory `/usr/src/modules/nvidia-kernel'
make: *** [kdist_image] Error 2