cmdline.o cmdline.c; \
then mv -f ".deps/cmdline.Tpo" ".deps/cmdline.Po"; else rm -f ".deps/cmdline.Tpo"; exit 1; fi
cc1: Fehler: /usr/lib/libxml++-1.0/include: Ist kein Verzeichnis
make[2]: *** [cmdline.o] Error 1
make[2]: Leaving directory `/var/cache/portage/portage/dev-libs/libofx-0.8.3/work/libofx-0.8.3/ofxconnect'
make[1]: *** [all-recursive] Error 1
make[1]: Leaving directory `/var/cache/portage/portage/dev-libs/libofx-0.8.3/work/libofx-0.8.3'
make: *** [all] Error 2
*
* ERROR: dev-libs/libofx-0.8.3 failed.
* Call stack:
* ebuild.sh, line 1701: Called dyn_compile
* ebuild.sh, line 1039: Called qa_call 'src_compile'
* ebuild.sh, line 44: Called src_compile
* ebuild.sh, line 711: Called die
* The specific snippet of code:
* emake || die "emake failed"
* The die message:
* emake failed
*
* If you need support, post the topmost build error, and the call stack if relevant.
* A complete build log is located at '/var/cache/portage/portage/dev-libs/libofx-0.8.3/temp/build.log'.
*
* Messages for package dev-libs/libofx-0.8.3:
*
* ERROR: dev-libs/libofx-0.8.3 failed.
* Call stack:
* ebuild.sh, line 1701: Called dyn_compile
* ebuild.sh, line 1039: Called qa_call 'src_compile'
* ebuild.sh, line 44: Called src_compile
* ebuild.sh, line 711: Called die
* The specific snippet of code:
* emake || die "emake failed"
* The die message:
* emake failed
*
* If you need support, post the topmost build error, and the call stack if relevant.
* A complete build log is located at '/var/cache/portage/portage/dev-libs/libofx-0.8.3/temp/build.log'.
*