All pastes #78997 Raw Edit

Unnamed

public text v1 · immutable
·published 2006-07-04 19:50 UTC
rendered paste body
./include/X11/Intrinsic.h:56:22: X11/Xlib.h: No such file or directory
../include/X11/Intrinsic.h:57:23: X11/Xutil.h: No such file or directory
../include/X11/Intrinsic.h:58:27: X11/Xresource.h: No such file or directory
In file included from ../include/X11/IntrinsicP.h:54,
                 from ../include/X11/IntrinsicI.h:55,
                 from ActionHook.c:72:
../include/X11/Intrinsic.h:185: error: syntax error before "XEvent"
../include/X11/Intrinsic.h:218: error: syntax error before "XrmValue"
../include/X11/Intrinsic.h:236: error: syntax error before '*' token
../include/X11/Intrinsic.h:243: error: syntax error before '*' token
../include/X11/Intrinsic.h:253: error: syntax error before "XrmValue"
../include/X11/Intrinsic.h:267: error: syntax error before "XEvent"
../include/X11/Intrinsic.h:279: error: syntax error before '*' token
../include/X11/Intrinsic.h:287: error: syntax error before '*' token
../include/X11/Intrinsic.h:296: error: syntax error before "XEvent"
../include/X11/Intrinsic.h:376: error: syntax error before "XrmValue"
../include/X11/Intrinsic.h:380: error: syntax error before '*' token
../include/X11/Intrinsic.h:419: error: syntax error before "Atom"
../include/X11/Intrinsic.h:429: error: syntax error before "Atom"
../include/X11/Intrinsic.h:434: error: syntax error before "Atom"
../include/X11/Intrinsic.h:441: error: syntax error before "Atom"
../include/X11/Intrinsic.h:450: error: syntax error before "Atom"
../include/X11/Intrinsic.h:456: error: syntax error before "Atom"
../include/X11/Intrinsic.h:464: error: syntax error before "Atom"
../include/X11/Intrinsic.h:477: error: syntax error before "Atom"
../include/X11/Intrinsic.h:484: error: syntax error before '*' token
../include/X11/Intrinsic.h:506: error: syntax error before "XrmValue"
../include/X11/Intrinsic.h:512: error: syntax error before '*' token
../include/X11/Intrinsic.h:522: error: syntax error before '*' token
../include/X11/Intrinsic.h:527: error: syntax error before "Time"
../include/X11/Intrinsic.h:531: error: syntax error before '*' token
../include/X11/Intrinsic.h:536: error: syntax error before "XEvent"
../include/X11/Intrinsic.h:574: error: syntax error before "Atom"
../include/X11/Intrinsic.h:583: error: syntax error before "Atom"
../include/X11/Intrinsic.h:608: error: syntax error before '*' token
../include/X11/Intrinsic.h:609: error: syntax error before '*' token
../include/X11/Intrinsic.h:612: warning: data definition has no type or storage class
../include/X11/Intrinsic.h:615: error: syntax error before '*' token
../include/X11/Intrinsic.h:627: error: syntax error before '*' token
../include/X11/Intrinsic.h:676: error: syntax error before "XrmValue"
../include/X11/Intrinsic.h:683: error: syntax error before "XrmValuePtr"
../include/X11/Intrinsic.h:757: error: syntax error before "XEvent"
../include/X11/Intrinsic.h:771: error: syntax error before '*' token
../include/X11/Intrinsic.h:776: error: syntax error before '*' token
../include/X11/Intrinsic.h:779: error: syntax error before "XtGetActionKeysym"
../include/X11/Intrinsic.h:780: error: syntax error before '*' token
../include/X11/Intrinsic.h:782: warning: data definition has no type or storage class
../include/X11/Intrinsic.h:791: error: syntax error before '*' token
../include/X11/Intrinsic.h:799: error: syntax error before '*' token
../include/X11/Intrinsic.h:807: error: syntax error before '*' token
../include/X11/Intrinsic.h:812: error: syntax error before '*' token
../include/X11/Intrinsic.h:819: error: syntax error before '*' token
../include/X11/Intrinsic.h:887: error: syntax error before '*' token
../include/X11/Intrinsic.h:894: error: syntax error before "XEvent"
../include/X11/Intrinsic.h:919: error: syntax error before '*' token
../include/X11/Intrinsic.h:954: error: syntax error before '*' token
../include/X11/Intrinsic.h:967: error: syntax error before '*' token
../include/X11/Intrinsic.h:968: error: syntax error before '*' token
../include/X11/Intrinsic.h:969: warning: data definition has no type or storage class
../include/X11/Intrinsic.h:971: error: syntax error before "XtLastTimestampProcessed"
../include/X11/Intrinsic.h:972: error: syntax error before '*' token
../include/X11/Intrinsic.h:973: warning: data definition has no type or storage class
../include/X11/Intrinsic.h:1036: error: syntax error before '*' token
../include/X11/Intrinsic.h:1041: error: syntax error before "XEvent"
../include/X11/Intrinsic.h:1141: error: syntax error before '*' token
../include/X11/Intrinsic.h:1148: error: syntax error before "XrmQuark"
../include/X11/Intrinsic.h:1193: error: syntax error before '*' token
../include/X11/Intrinsic.h:1195: warning: data definition has no type or storage class
../include/X11/Intrinsic.h:1197: error: syntax error before '*' token
../include/X11/Intrinsic.h:1199: warning: data definition has no type or storage class
../include/X11/Intrinsic.h:1201: error: syntax error before '*' token
../include/X11/Intrinsic.h:1203: warning: data definition has no type or storage class
../include/X11/Intrinsic.h:1205: error: syntax error before '*' token
../include/X11/Intrinsic.h:1207: warning: data definition has no type or storage class
../include/X11/Intrinsic.h:1209: error: syntax error before "XtWindow"
../include/X11/Intrinsic.h:1211: warning: data definition has no type or storage class
../include/X11/Intrinsic.h:1213: error: syntax error before "XtWindowOfObject"
../include/X11/Intrinsic.h:1215: warning: data definition has no type or storage class
../include/X11/Intrinsic.h:1366: error: syntax error before "XEvent"
../include/X11/Intrinsic.h:1412: error: syntax error before "Display"
../include/X11/Intrinsic.h:1421: error: syntax error before "Display"
../include/X11/Intrinsic.h:1443: error: syntax error before "Display"
../include/X11/Intrinsic.h:1455: error: syntax error before "XrmOptionDescList"
../include/X11/Intrinsic.h:1468: error: syntax error before "XrmOptionDescList"
../include/X11/Intrinsic.h:1480: error: syntax error before "XrmOptionDescList"
../include/X11/Intrinsic.h:1492: error: syntax error before "XrmOptionDescList"
../include/X11/Intrinsic.h:1503: error: syntax error before "XrmOptionDescRec"
../include/X11/Intrinsic.h:1509: error: syntax error before '*' token
../include/X11/Intrinsic.h:1514: error: syntax error before "XrmOptionDescRec"
../include/X11/Intrinsic.h:1518: warning: data definition has no type or storage class
../include/X11/Intrinsic.h:1542: error: syntax error before '*' token
../include/X11/Intrinsic.h:1545: error: syntax error before "XtDatabase"
../include/X11/Intrinsic.h:1546: error: syntax error before '*' token
../include/X11/Intrinsic.h:1547: warning: data definition has no type or storage class
../include/X11/Intrinsic.h:1549: error: syntax error before "XtScreenDatabase"
../include/X11/Intrinsic.h:1550: error: syntax error before '*' token
../include/X11/Intrinsic.h:1551: warning: data definition has no type or storage class
../include/X11/Intrinsic.h:1554: error: syntax error before '*' token
../include/X11/Intrinsic.h:1809: error: syntax error before '*' token
../include/X11/Intrinsic.h:1811: warning: data definition has no type or storage class
../include/X11/Intrinsic.h:1813: error: syntax error before '*' token
../include/X11/Intrinsic.h:1815: warning: data definition has no type or storage class
../include/X11/Intrinsic.h:1825: error: syntax error before "XrmDatabase"
../include/X11/Intrinsic.h:1928: error: syntax error before "XtGetGC"
../include/X11/Intrinsic.h:1931: error: syntax error before "XGCValues"
../include/X11/Intrinsic.h:1932: warning: data definition has no type or storage class
../include/X11/Intrinsic.h:1934: error: syntax error before "XtAllocateGC"
../include/X11/Intrinsic.h:1938: error: syntax error before "XGCValues"
../include/X11/Intrinsic.h:1941: warning: data definition has no type or storage class
../include/X11/Intrinsic.h:1949: warning: parameter names (without types) in function declaration
../include/X11/Intrinsic.h:1953: error: syntax error before "GC"
../include/X11/Intrinsic.h:1989: error: syntax error before '*' token
../include/X11/Intrinsic.h:2009: error: syntax error before "Atom"
../include/X11/Intrinsic.h:2015: error: syntax error before "Atom"
../include/X11/Intrinsic.h:2024: error: syntax error before "Atom"
../include/X11/Intrinsic.h:2049: error: syntax error before '*' token
../include/X11/Intrinsic.h:2051: error: syntax error before "Atom"
../include/X11/Intrinsic.h:2053: warning: data definition has no type or storage class
../include/X11/Intrinsic.h:2057: error: syntax error before "Atom"
../include/X11/Intrinsic.h:2066: error: syntax error before "Atom"
../include/X11/Intrinsic.h:2076: error: syntax error before "Atom"
../include/X11/Intrinsic.h:2085: error: syntax error before "Atom"
../include/X11/Intrinsic.h:2095: error: syntax error before "Atom"
../include/X11/Intrinsic.h:2100: error: syntax error before "Atom"
../include/X11/Intrinsic.h:2106: error: syntax error before "Atom"
../include/X11/Intrinsic.h:2109: error: syntax error before "XtReservePropertyAtom"
../include/X11/Intrinsic.h:2111: warning: data definition has no type or storage class
../include/X11/Intrinsic.h:2115: error: syntax error before "Atom"
../include/X11/Intrinsic.h:2120: error: syntax error before "KeyCode"
../include/X11/Intrinsic.h:2129: error: syntax error before "KeyCode"
../include/X11/Intrinsic.h:2138: error: syntax error before "Time"
../include/X11/Intrinsic.h:2143: error: syntax error before "Time"
../include/X11/Intrinsic.h:2154: error: syntax error before "Window"
../include/X11/Intrinsic.h:2170: error: syntax error before "Window"
../include/X11/Intrinsic.h:2177: error: syntax error before "Time"
../include/X11/Intrinsic.h:2181: error: syntax error before '*' token
../include/X11/Intrinsic.h:2187: error: syntax error before '*' token
../include/X11/Intrinsic.h:2193: error: syntax error before '*' token
../include/X11/Intrinsic.h:2198: error: syntax error before '*' token
../include/X11/Intrinsic.h:2225: error: syntax error before "XWindowChanges"
../include/X11/Intrinsic.h:2225: warning: no semicolon at end of struct or union
../include/X11/Intrinsic.h:2226: warning: data definition has no type or storage class
../include/X11/Intrinsic.h:2243: error: syntax error before "Display"
../include/X11/Intrinsic.h:2275: error: syntax error before '*' token
../include/X11/Intrinsic.h:2284: error: syntax error before '*' token
../include/X11/Intrinsic.h:2293: error: syntax error before '*' token
../include/X11/Intrinsic.h:2302: error: syntax error before '*' token
../include/X11/Intrinsic.h:2311: error: syntax error before '*' token
../include/X11/Intrinsic.h:2320: error: syntax error before '*' token
../include/X11/Intrinsic.h:2329: error: syntax error before '*' token
../include/X11/Intrinsic.h:2338: error: syntax error before '*' token
../include/X11/Intrinsic.h:2347: error: syntax error before '*' token
../include/X11/Intrinsic.h:2356: error: syntax error before '*' token
../include/X11/Intrinsic.h:2365: error: syntax error before '*' token
../include/X11/Intrinsic.h:2374: error: syntax error before '*' token
../include/X11/Intrinsic.h:2383: error: syntax error before '*' token
../include/X11/Intrinsic.h:2392: error: syntax error before '*' token
../include/X11/Intrinsic.h:2401: error: syntax error before '*' token
../include/X11/Intrinsic.h:2410: error: syntax error before '*' token
../include/X11/Intrinsic.h:2419: error: syntax error before '*' token
../include/X11/Intrinsic.h:2428: error: syntax error before '*' token
../include/X11/Intrinsic.h:2439: error: syntax error before '*' token
../include/X11/Intrinsic.h:2448: error: syntax error before '*' token
../include/X11/Intrinsic.h:2457: error: syntax error before '*' token
../include/X11/Intrinsic.h:2466: error: syntax error before '*' token
../include/X11/Intrinsic.h:2475: error: syntax error before '*' token
../include/X11/Intrinsic.h:2486: error: syntax error before '*' token
../include/X11/Intrinsic.h:2495: error: syntax error before '*' token
../include/X11/Intrinsic.h:2504: error: syntax error before '*' token
../include/X11/Intrinsic.h:2515: error: syntax error before '*' token
../include/X11/Intrinsic.h:2524: error: syntax error before '*' token
../include/X11/Intrinsic.h:2533: error: syntax error before '*' token
../include/X11/Intrinsic.h:2542: error: syntax error before '*' token
../include/X11/Intrinsic.h:2553: error: syntax error before '*' token
../include/X11/Intrinsic.h:2562: error: syntax error before '*' token
../include/X11/Intrinsic.h:2573: error: syntax error before '*' token
In file included from ../include/X11/IntrinsicI.h:55,
                 from ActionHook.c:72:
../include/X11/IntrinsicP.h:94: error: syntax error before "Time"
../include/X11/IntrinsicP.h:133: error: syntax error before "XEvent"
../include/X11/IntrinsicP.h:152: error: syntax error before "XSetWindowAttributes"
In file included from ../include/X11/IntrinsicP.h:199,
                 from ../include/X11/IntrinsicI.h:55,
                 from ActionHook.c:72:
../include/X11/CoreP.h:79: error: syntax error before "XrmName"
../include/X11/CoreP.h:79: warning: no semicolon at end of struct or union
../include/X11/CoreP.h:93: error: syntax error before "border_pixmap"
../include/X11/CoreP.h:93: warning: data definition has no type or storage class
../include/X11/CoreP.h:97: error: syntax error before '*' token
../include/X11/CoreP.h:97: warning: data definition has no type or storage class
../include/X11/CoreP.h:98: error: syntax error before "colormap"
../include/X11/CoreP.h:98: warning: data definition has no type or storage class
../include/X11/CoreP.h:99: error: syntax error before "window"
../include/X11/CoreP.h:99: warning: data definition has no type or storage class
../include/X11/CoreP.h:102: error: syntax error before "background_pixmap"
../include/X11/CoreP.h:102: warning: data definition has no type or storage class
../include/X11/CoreP.h:105: error: syntax error before '}' token
../include/X11/CoreP.h:105: warning: data definition has no type or storage class
../include/X11/CoreP.h:108: error: syntax error before "CorePart"
../include/X11/CoreP.h:108: warning: no semicolon at end of struct or union
../include/X11/CoreP.h:109: warning: data definition has no type or storage class
../include/X11/CoreP.h:142: error: syntax error before "XrmClass"
../include/X11/CoreP.h:142: warning: no semicolon at end of struct or union
../include/X11/CoreP.h:161: error: syntax error before '}' token
../include/X11/CoreP.h:161: warning: data definition has no type or storage class
../include/X11/CoreP.h:164: error: syntax error before "CoreClassPart"
../include/X11/CoreP.h:164: warning: no semicolon at end of struct or union
../include/X11/CoreP.h:165: warning: data definition has no type or storage class
../include/X11/CoreP.h:167: error: syntax error before "widgetClassRec"
../include/X11/CoreP.h:167: warning: data definition has no type or storage class
In file included from ../include/X11/IntrinsicP.h:200,
                 from ../include/X11/IntrinsicI.h:55,
                 from ActionHook.c:72:
../include/X11/CompositeP.h:69: error: syntax error before "CorePart"
../include/X11/CompositeP.h:69: warning: no semicolon at end of struct or union
../include/X11/CompositeP.h:71: error: syntax error before '}' token
../include/X11/CompositeP.h:71: warning: data definition has no type or storage class
../include/X11/CompositeP.h:89: error: syntax error before "XrmQuark"
../include/X11/CompositeP.h:89: warning: no semicolon at end of struct or union
../include/X11/CompositeP.h:90: error: conflicting types for 'version'
../include/X11/CoreP.h:155: error: previous declaration of 'version' was here
../include/X11/CompositeP.h:94: error: syntax error before '}' token
../include/X11/CompositeP.h:94: warning: data definition has no type or storage class
../include/X11/CompositeP.h:98: error: syntax error before "CoreClassPart"
../include/X11/CompositeP.h:98: warning: no semicolon at end of struct or union
../include/X11/CompositeP.h:100: error: syntax error before '}' token
../include/X11/CompositeP.h:100: warning: data definition has no type or storage class
../include/X11/CompositeP.h:102: error: syntax error before "compositeClassRec"
../include/X11/CompositeP.h:102: warning: data definition has no type or storage class
In file included from ../include/X11/IntrinsicP.h:201,
                 from ../include/X11/IntrinsicI.h:55,
                 from ActionHook.c:72:
../include/X11/ConstrainP.h:60: error: syntax error before "CorePart"
../include/X11/ConstrainP.h:60: warning: no semicolon at end of struct or union
../include/X11/ConstrainP.h:63: error: syntax error before '}' token
../include/X11/ConstrainP.h:63: warning: data definition has no type or storage class
../include/X11/ConstrainP.h:77: error: syntax error before "XrmQuark"
../include/X11/ConstrainP.h:77: warning: no semicolon at end of struct or union
../include/X11/ConstrainP.h:81: error: syntax error before '}' token
../include/X11/ConstrainP.h:81: warning: data definition has no type or storage class
../include/X11/ConstrainP.h:84: error: syntax error before "CoreClassPart"
../include/X11/ConstrainP.h:84: warning: no semicolon at end of struct or union
../include/X11/ConstrainP.h:87: error: syntax error before '}' token
../include/X11/ConstrainP.h:87: warning: data definition has no type or storage class
../include/X11/ConstrainP.h:89: error: syntax error before "constraintClassRec"
../include/X11/ConstrainP.h:89: warning: data definition has no type or storage class
In file included from ../include/X11/IntrinsicP.h:202,
                 from ../include/X11/IntrinsicI.h:55,
                 from ActionHook.c:72:
../include/X11/ObjectP.h:65: error: syntax error before "XrmName"
../include/X11/ObjectP.h:65: warning: no semicolon at end of struct or union
../include/X11/ObjectP.h:69: error: syntax error before '}' token
../include/X11/ObjectP.h:69: warning: data definition has no type or storage class
../include/X11/ObjectP.h:72: error: syntax error before "ObjectPart"
../include/X11/ObjectP.h:72: warning: no semicolon at end of struct or union
../include/X11/ObjectP.h:73: warning: data definition has no type or storage class
../include/X11/ObjectP.h:99: error: syntax error before "XrmClass"
../include/X11/ObjectP.h:99: warning: no semicolon at end of struct or union
../include/X11/ObjectP.h:112: error: conflicting types for 'version'
../include/X11/ConstrainP.h:78: error: previous declaration of 'version' was here
../include/X11/ObjectP.h:112: error: conflicting types for 'version'
../include/X11/ConstrainP.h:78: error: previous declaration of 'version' was here
../include/X11/ObjectP.h:118: error: syntax error before '}' token
../include/X11/ObjectP.h:118: warning: data definition has no type or storage class
../include/X11/ObjectP.h:122: error: syntax error before "XrmQuark"
../include/X11/ObjectP.h:122: warning: no semicolon at end of struct or union
../include/X11/ObjectP.h:123: error: conflicting types for 'version'
../include/X11/ObjectP.h:112: error: previous declaration of 'version' was here
../include/X11/ObjectP.h:127: error: syntax error before '}' token
../include/X11/ObjectP.h:127: warning: data definition has no type or storage class
../include/X11/ObjectP.h:130: error: syntax error before "ObjectClassPart"
../include/X11/ObjectP.h:130: warning: no semicolon at end of struct or union
../include/X11/ObjectP.h:131: warning: data definition has no type or storage class
../include/X11/ObjectP.h:133: error: syntax error before "objectClassRec"
../include/X11/ObjectP.h:133: warning: data definition has no type or storage class
In file included from ../include/X11/IntrinsicP.h:203,
                 from ../include/X11/IntrinsicI.h:55,
                 from ActionHook.c:72:
../include/X11/RectObjP.h:72: error: syntax error before "ObjectPart"
../include/X11/RectObjP.h:72: warning: no semicolon at end of struct or union
../include/X11/RectObjP.h:74: error: syntax error before '}' token
../include/X11/RectObjP.h:74: warning: data definition has no type or storage class
../include/X11/RectObjP.h:102: error: syntax error before "XrmClass"
../include/X11/RectObjP.h:102: warning: no semicolon at end of struct or union
../include/X11/RectObjP.h:115: error: conflicting types for 'version'
../include/X11/ObjectP.h:123: error: previous declaration of 'version' was here
../include/X11/RectObjP.h:115: error: conflicting types for 'version'
../include/X11/ObjectP.h:123: error: previous declaration of 'version' was here
../include/X11/RectObjP.h:121: error: syntax error before '}' token
../include/X11/RectObjP.h:121: warning: data definition has no type or storage class
../include/X11/RectObjP.h:124: error: syntax error before "RectObjClassPart"
../include/X11/RectObjP.h:124: warning: no semicolon at end of struct or union
../include/X11/RectObjP.h:125: warning: data definition has no type or storage class
../include/X11/RectObjP.h:127: error: syntax error before "rectObjClassRec"
../include/X11/RectObjP.h:127: warning: data definition has no type or storage class
In file included from ../include/X11/IntrinsicI.h:55,
                 from ActionHook.c:72:
../include/X11/IntrinsicP.h:279: error: syntax error before "XEvent"
../include/X11/IntrinsicP.h:285: error: syntax error before "Visual"
In file included from ../include/X11/IntrinsicI.h:66,
                 from ActionHook.c:72:
../include/X11/ConvertI.h:53: error: syntax error before "_XtQString"
../include/X11/ConvertI.h:53: warning: data definition has no type or storage class
../include/X11/ConvertI.h:75: error: syntax error before "XrmRepresentation"
../include/X11/ConvertI.h:88: error: syntax error before "XrmRepresentation"
In file included from ../include/X11/IntrinsicI.h:67,
                 from ActionHook.c:72:
../include/X11/TranslateI.h:92: error: syntax error before "KeySym"
../include/X11/TranslateI.h:92: warning: no semicolon at end of struct or union
../include/X11/TranslateI.h:93: warning: data definition has no type or storage class
../include/X11/TranslateI.h:129: error: syntax error before "LateBindingsPtr"
../include/X11/TranslateI.h:129: warning: no semicolon at end of struct or union
../include/X11/TranslateI.h:131: error: syntax error before '}' token
../include/X11/TranslateI.h:131: warning: data definition has no type or storage class
../include/X11/TranslateI.h:161: error: syntax error before "XrmQuark"
../include/X11/TranslateI.h:161: warning: no semicolon at end of struct or union
../include/X11/TranslateI.h:162: warning: data definition has no type or storage class
../include/X11/TranslateI.h:176: error: syntax error before "XrmQuark"
../include/X11/TranslateI.h:176: warning: no semicolon at end of struct or union
../include/X11/TranslateI.h:178: error: syntax error before '}' token
../include/X11/TranslateI.h:178: warning: data definition has no type or storage class
../include/X11/TranslateI.h:195: error: syntax error before "XrmQuark"
../include/X11/TranslateI.h:195: warning: no semicolon at end of struct or union
../include/X11/TranslateI.h:201: error: syntax error before '}' token
../include/X11/TranslateI.h:201: warning: data definition has no type or storage class
../include/X11/TranslateI.h:204: error: syntax error before "TMSimpleStateTreeRec"
../include/X11/TranslateI.h:204: warning: no semicolon at end of struct or union
../include/X11/TranslateI.h:205: warning: data definition has no type or storage class
../include/X11/TranslateI.h:206: error: syntax error before "complex"
../include/X11/TranslateI.h:206: warning: data definition has no type or storage class
../include/X11/TranslateI.h:207: warning: data definition has no type or storage class
../include/X11/TranslateI.h:241: error: syntax error before "TMStateTree"
../include/X11/TranslateI.h:241: warning: no semicolon at end of struct or union
../include/X11/TranslateI.h:242: warning: data definition has no type or storage class
../include/X11/TranslateI.h:271: error: syntax error before "LateBindingsPtr"
../include/X11/TranslateI.h:271: warning: no semicolon at end of struct or union
../include/X11/TranslateI.h:277: error: syntax error before '}' token
../include/X11/TranslateI.h:277: warning: data definition has no type or storage class
../include/X11/TranslateI.h:281: error: syntax error before "Event"
../include/X11/TranslateI.h:281: warning: no semicolon at end of struct or union
../include/X11/TranslateI.h:285: error: syntax error before '}' token
../include/X11/TranslateI.h:285: warning: data definition has no type or storage class
../include/X11/TranslateI.h:287: error: syntax error before "EventRec"
../include/X11/TranslateI.h:287: warning: data definition has no type or storage class
../include/X11/TranslateI.h:291: error: syntax error before "XEvent"
../include/X11/TranslateI.h:291: warning: no semicolon at end of struct or union
../include/X11/TranslateI.h:292: warning: data definition has no type or storage class
../include/X11/TranslateI.h:293: warning: data definition has no type or storage class
../include/X11/TranslateI.h:308: error: syntax error before "KeyCode"
../include/X11/TranslateI.h:308: warning: no semicolon at end of struct or union
../include/X11/TranslateI.h:310: error: syntax error before "keysym"
../include/X11/TranslateI.h:310: warning: data definition has no type or storage class
../include/X11/TranslateI.h:311: error: syntax error before '}' token
../include/X11/TranslateI.h:311: warning: data definition has no type or storage class
../include/X11/TranslateI.h:314: error: syntax error before "XEvent"
../include/X11/TranslateI.h:314: warning: no semicolon at end of struct or union
../include/X11/TranslateI.h:316: error: syntax error before "keysym"
../include/X11/TranslateI.h:316: error: conflicting types for 'keysym'
../include/X11/TranslateI.h:310: error: previous declaration of 'keysym' was here
../include/X11/TranslateI.h:316: warning: data definition has no type or storage class
../include/X11/TranslateI.h:317: error: conflicting types for 'modifiers'
../include/X11/TranslateI.h:309: error: previous declaration of 'modifiers' was here
../include/X11/TranslateI.h:318: error: syntax error before "keycache"
../include/X11/TranslateI.h:318: warning: data definition has no type or storage class
../include/X11/TranslateI.h:319: warning: data definition has no type or storage class
../include/X11/TranslateI.h:326: error: syntax error before "TMModifierMatchRec"
../include/X11/TranslateI.h:326: warning: no semicolon at end of struct or union
../include/X11/TranslateI.h:343: error: syntax error before '}' token
../include/X11/TranslateI.h:343: warning: data definition has no type or storage class
../include/X11/TranslateI.h:345: error: syntax error before "_XtGlobalTM"
../include/X11/TranslateI.h:345: warning: data definition has no type or storage class
../include/X11/TranslateI.h:403: error: syntax error before "TMParseStateTree"
../include/X11/TranslateI.h:432: error: syntax error before "XEvent"
In file included from ../include/X11/EventI.h:66,
                 from ../include/X11/TranslateI.h:436,
                 from ../include/X11/IntrinsicI.h:67,
                 from ActionHook.c:72:
../include/X11/PassivGraI.h:79: error: syntax error before "KeyCode"
../include/X11/PassivGraI.h:79: warning: no semicolon at end of struct or union
../include/X11/PassivGraI.h:80: error: conflicting types for 'modifiers'
../include/X11/TranslateI.h:317: error: previous declaration of 'modifiers' was here
../include/X11/PassivGraI.h:80: error: conflicting types for 'modifiers'
../include/X11/TranslateI.h:317: error: previous declaration of 'modifiers' was here
../include/X11/PassivGraI.h:82: error: syntax error before '}' token
../include/X11/PassivGraI.h:82: warning: data definition has no type or storage class
../include/X11/PassivGraI.h:85: error: syntax error before "Mask"
../include/X11/PassivGraI.h:85: warning: no semicolon at end of struct or union
../include/X11/PassivGraI.h:86: warning: data definition has no type or storage class
../include/X11/PassivGraI.h:87: error: syntax error before "confineTo"
../include/X11/PassivGraI.h:87: warning: data definition has no type or storage class
../include/X11/PassivGraI.h:88: error: syntax error before "cursor"
../include/X11/PassivGraI.h:88: warning: data definition has no type or storage class
../include/X11/PassivGraI.h:89: warning: data definition has no type or storage class
../include/X11/PassivGraI.h:94: error: syntax error before "XtServerGrabRec"
../include/X11/PassivGraI.h:94: warning: no semicolon at end of struct or union
../include/X11/PassivGraI.h:97: error: syntax error before '}' token
../include/X11/PassivGraI.h:97: warning: data definition has no type or storage class
../include/X11/PassivGraI.h:108: error: syntax error before "XtServerGrabPtr"
../include/X11/PassivGraI.h:108: warning: no semicolon at end of struct or union
../include/X11/PassivGraI.h:110: error: syntax error before ':' token
../include/X11/PassivGraI.h:111: error: syntax error before ':' token
../include/X11/PassivGraI.h:112: error: syntax error before ':' token
../include/X11/PassivGraI.h:113: error: syntax error before ':' token
../include/X11/PassivGraI.h:115: error: syntax error before '}' token
../include/X11/PassivGraI.h:115: warning: data definition has no type or storage class
../include/X11/PassivGraI.h:119: error: syntax error before "XtDeviceRec"
../include/X11/PassivGraI.h:119: warning: no semicolon at end of struct or union
../include/X11/PassivGraI.h:120: warning: data definition has no type or storage class
../include/X11/PassivGraI.h:124: error: syntax error before '}' token
../include/X11/PassivGraI.h:124: warning: data definition has no type or storage class
../include/X11/PassivGraI.h:144: error: syntax error before "_XtGetPerWidgetInput"
../include/X11/PassivGraI.h:147: warning: data definition has no type or storage class
../include/X11/PassivGraI.h:149: error: syntax error before "_XtCheckServerGrabsOnWidget"
../include/X11/PassivGraI.h:150: error: syntax error before '*' token
../include/X11/PassivGraI.h:153: warning: data definition has no type or storage class
../include/X11/PassivGraI.h:163: error: syntax error before "XtPerWidgetInput"
../include/X11/PassivGraI.h:167: error: syntax error before '*' token
../include/X11/PassivGraI.h:173: error: syntax error before '*' token
In file included from ../include/X11/TranslateI.h:436,
                 from ../include/X11/IntrinsicI.h:67,
                 from ActionHook.c:72:
../include/X11/EventI.h:110: error: syntax error before '*' token
../include/X11/EventI.h:123: error: syntax error before '*' token
../include/X11/EventI.h:125: error: syntax error before '*' token
In file included from ../include/X11/TranslateI.h:437,
                 from ../include/X11/IntrinsicI.h:67,
                 from ActionHook.c:72:
../include/X11/HookObjI.h:50: error: syntax error before "Screen"
../include/X11/HookObjI.h:50: warning: no semicolon at end of struct or union
../include/X11/HookObjI.h:51: warning: data definition has no type or storage class
../include/X11/HookObjI.h:54: error: syntax error before "ObjectPart"
../include/X11/HookObjI.h:54: warning: no semicolon at end of struct or union
../include/X11/HookObjI.h:55: warning: data definition has no type or storage class
../include/X11/HookObjI.h:56: warning: data definition has no type or storage class
../include/X11/HookObjI.h:63: error: syntax error before "ObjectClassPart"
../include/X11/HookObjI.h:63: warning: no semicolon at end of struct or union
../include/X11/HookObjI.h:65: error: syntax error before '}' token
../include/X11/HookObjI.h:65: warning: data definition has no type or storage class
../include/X11/HookObjI.h:67: error: syntax error before "hookObjClassRec"
../include/X11/HookObjI.h:67: warning: data definition has no type or storage class
In file included from ../include/X11/TranslateI.h:440,
                 from ../include/X11/IntrinsicI.h:67,
                 from ActionHook.c:72:
../include/X11/InitialI.h:156: error: syntax error before "Display"
../include/X11/InitialI.h:156: warning: no semicolon at end of struct or union
../include/X11/InitialI.h:162: error: syntax error before "errorDB"
../include/X11/InitialI.h:162: warning: data definition has no type or storage class
../include/X11/InitialI.h:174: error: 'sync' redeclared as different kind of symbol
/usr/include/unistd.h:879: error: previous declaration of 'sync' was here
../include/X11/InitialI.h:174: error: 'sync' redeclared as different kind of symbol
/usr/include/unistd.h:879: error: previous declaration of 'sync' was here
../include/X11/InitialI.h:190: error: syntax error before '*' token
../include/X11/InitialI.h:190: warning: data definition has no type or storage class
../include/X11/InitialI.h:202: error: syntax error before '}' token
../include/X11/InitialI.h:202: warning: data definition has no type or storage class
../include/X11/InitialI.h:247: error: syntax error before '*' token
../include/X11/InitialI.h:251: error: syntax error before "XrmOptionDescRec"
../include/X11/InitialI.h:256: warning: data definition has no type or storage class
../include/X11/InitialI.h:283: error: syntax error before "KeySym"
../include/X11/InitialI.h:283: warning: no semicolon at end of struct or union
../include/X11/InitialI.h:284: warning: data definition has no type or storage class
../include/X11/InitialI.h:286: error: conflicting types for 'next'
../include/X11/TranslateI.h:283: error: previous declaration of 'next' was here
../include/X11/InitialI.h:287: error: syntax error before '}' token
../include/X11/InitialI.h:287: warning: data definition has no type or storage class
../include/X11/InitialI.h:297: error: syntax error before "Region"
../include/X11/InitialI.h:297: warning: no semicolon at end of struct or union
../include/X11/InitialI.h:302: error: syntax error before '*' token
../include/X11/InitialI.h:302: warning: data definition has no type or storage class
../include/X11/InitialI.h:305: error: syntax error before '*' token
../include/X11/InitialI.h:305: warning: data definition has no type or storage class
../include/X11/InitialI.h:308: error: syntax error before "lock_meaning"
../include/X11/InitialI.h:308: warning: data definition has no type or storage class
../include/X11/InitialI.h:313: error: syntax error before "name"
../include/X11/InitialI.h:313: error: conflicting types for 'name'
../include/X11/CoreP.h:96: error: previous declaration of 'name' was here
../include/X11/InitialI.h:313: warning: data definition has no type or storage class
../include/X11/InitialI.h:314: error: syntax error before "class"
../include/X11/InitialI.h:314: warning: data definition has no type or storage class
../include/X11/InitialI.h:317: error: syntax error before '*' token
../include/X11/InitialI.h:317: warning: data definition has no type or storage class
../include/X11/InitialI.h:319: error: syntax error before "last_event"
../include/X11/InitialI.h:319: warning: data definition has no type or storage class
../include/X11/InitialI.h:320: error: syntax error before "last_timestamp"
../include/X11/InitialI.h:320: warning: data definition has no type or storage class
../include/X11/InitialI.h:324: error: syntax error before "pdi"
../include/X11/InitialI.h:324: warning: data definition has no type or storage class
../include/X11/InitialI.h:326: error: syntax error before '*' token
../include/X11/InitialI.h:326: warning: data definition has no type or storage class
../include/X11/InitialI.h:327: error: syntax error before "cmd_db"
../include/X11/InitialI.h:327: warning: data definition has no type or storage class
../include/X11/InitialI.h:328: error: syntax error before "server_db"
../include/X11/InitialI.h:328: warning: data definition has no type or storage class
../include/X11/InitialI.h:334: error: syntax error before "rcm_init"
../include/X11/InitialI.h:334: warning: data definition has no type or storage class
../include/X11/InitialI.h:335: error: syntax error before "rcm_data"
../include/X11/InitialI.h:335: warning: data definition has no type or storage class
../include/X11/InitialI.h:337: warning: data definition has no type or storage class
../include/X11/InitialI.h:340: error: syntax error before "Display"
../include/X11/InitialI.h:340: warning: no semicolon at end of struct or union
../include/X11/InitialI.h:341: warning: data definition has no type or storage class
../include/X11/InitialI.h:342: error: conflicting types for 'next'
../include/X11/InitialI.h:286: error: previous declaration of 'next' was here
../include/X11/InitialI.h:342: error: conflicting types for 'next'
../include/X11/InitialI.h:286: error: previous declaration of 'next' was here
../include/X11/InitialI.h:343: error: syntax error before '}' token
../include/X11/InitialI.h:343: warning: data definition has no type or storage class
../include/X11/InitialI.h:345: error: syntax error before "_XtperDisplayList"
../include/X11/InitialI.h:345: warning: data definition has no type or storage class
../include/X11/InitialI.h:347: error: syntax error before "_XtSortPerDisplayList"
../include/X11/InitialI.h:348: error: syntax error before '*' token
../include/X11/InitialI.h:349: warning: data definition has no type or storage class
../include/X11/InitialI.h:351: error: syntax error before "_XtGetPerDisplay"
../include/X11/InitialI.h:352: error: syntax error before '*' token
../include/X11/InitialI.h:353: warning: data definition has no type or storage class
../include/X11/InitialI.h:355: error: syntax error before '*' token
../include/X11/InitialI.h:356: error: syntax error before '*' token
../include/X11/InitialI.h:357: warning: data definition has no type or storage class
../include/X11/InitialI.h:382: error: syntax error before '*' token
../include/X11/InitialI.h:416: error: syntax error before "pd"
../include/X11/InitialI.h:420: error: syntax error before "pd"
../include/X11/InitialI.h:424: error: syntax error before "_XtPreparseCommandLine"
../include/X11/InitialI.h:424: error: syntax error before '*' token
../include/X11/InitialI.h:427: warning: data definition has no type or storage class
In file included from ../include/X11/TranslateI.h:441,
                 from ../include/X11/IntrinsicI.h:67,
                 from ActionHook.c:72:
../include/X11/ResourceI.h:90: error: syntax error before "XrmValue"
In file included from ../include/X11/IntrinsicI.h:67,
                 from ActionHook.c:72:
../include/X11/TranslateI.h:444: error: syntax error before '*' token
../include/X11/TranslateI.h:449: error: syntax error before "XEvent"
../include/X11/TranslateI.h:456: error: syntax error before "XEvent"
../include/X11/TranslateI.h:463: error: syntax error before "XEvent"
../include/X11/TranslateI.h:479: error: syntax error before '*' token
../include/X11/TranslateI.h:486: error: syntax error before '*' token
../include/X11/TranslateI.h:493: error: syntax error before '*' token
../include/X11/TranslateI.h:507: error: syntax error before "XrmValuePtr"
../include/X11/TranslateI.h:514: error: syntax error before '*' token
../include/X11/TranslateI.h:520: warning: parameter names (without types) in function declaration
../include/X11/TranslateI.h:527: error: syntax error before '*' token
../include/X11/TranslateI.h:556: error: syntax error before "_XtParseTreeToStateTree"
../include/X11/TranslateI.h:558: warning: parameter names (without types) in function declaration
../include/X11/TranslateI.h:558: warning: data definition has no type or storage class
../include/X11/TranslateI.h:562: error: syntax error before "XrmQuark"
../include/X11/TranslateI.h:567: error: syntax error before "TMBranchHead"
../include/X11/TranslateI.h:571: error: syntax error before "Display"
../include/X11/TranslateI.h:581: error: syntax error before "_XtTraversalProc"
../include/X11/TranslateI.h:605: error: syntax error before "pd"
In file included from ActionHook.c:72:
../include/X11/IntrinsicI.h:224: error: syntax error before '*' token
ActionHook.c: In function `XtAppAddActionHook':
ActionHook.c:96: error: dereferencing pointer to incomplete type
ActionHook.c:96: error: dereferencing pointer to incomplete type
ActionHook.c:97: error: dereferencing pointer to incomplete type
ActionHook.c:101: error: dereferencing pointer to incomplete type
ActionHook.c:102: error: dereferencing pointer to incomplete type
ActionHook.c:104: error: dereferencing pointer to incomplete type
ActionHook.c:107: error: dereferencing pointer to incomplete type
ActionHook.c:108: error: dereferencing pointer to incomplete type
ActionHook.c:108: error: dereferencing pointer to incomplete type
ActionHook.c: In function `XtRemoveActionHook':
ActionHook.c:118: error: dereferencing pointer to incomplete type
ActionHook.c:118: error: dereferencing pointer to incomplete type
ActionHook.c:119: error: dereferencing pointer to incomplete type
ActionHook.c:123: error: dereferencing pointer to incomplete type
ActionHook.c:124: error: dereferencing pointer to incomplete type
ActionHook.c:125: error: dereferencing pointer to incomplete type
ActionHook.c:134: error: dereferencing pointer to incomplete type
ActionHook.c:134: error: dereferencing pointer to incomplete type
{standard input}: Assembler messages:
{standard input}:148: Warning: size of "keysym" is already 256; not changing to 4
{standard input}:149: Warning: size of "modifiers" is already 64; not changing to 4
{standard input}:159: Warning: size of "modifiers" is already 64; not changing to 2
make[3]: *** [ActionHook.lo] Error 1
make[3]: Leaving directory `/var/tmp/portage/libXt-1.0.2/work/libXt-1.0.2/src'
make[2]: *** [all] Error 2
make[2]: Leaving directory `/var/tmp/portage/libXt-1.0.2/work/libXt-1.0.2/src'
make[1]: *** [all-recursive] Error 1
make[1]: Leaving directory `/var/tmp/portage/libXt-1.0.2/work/libXt-1.0.2'
make: *** [all] Error 2

!!! ERROR: x11-libs/libXt-1.0.2 failed.
Call stack:
  ebuild.sh, line 1539:   Called dyn_compile
  ebuild.sh, line 939:   Called src_compile
  ebuild.sh, line 1248:   Called x-modular_src_compile
  x-modular.eclass, line 327:   Called x-modular_src_make
  x-modular.eclass, line 322:   Called die

!!! emake failed
!!! If you need support, post the topmost build error, and the call stack if relevant.