All pastes #78814 Raw Edit

Mine

public text v1 · immutable
·published 2006-07-04 16:09 UTC
rendered paste body
CII_CAST -DQT_NO_STL -DQT_NO_COMPAT -DQT_NO_TRANSLATION -c -o amarokdcophandler.lo `test -f 'amarokdcophandler.cpp' || echo './'`amarokdcophandler.cpp
amarokdcophandler.cpp:22:26: error: amarokconfig.h: No such file or directory
In file included from amarokdcophandler.cpp:35:
../../../amarok/src/playlist.h:23:26: error: amarokconfig.h: No such file or directory
amarokdcophandler.cpp:922:33: error: amarokdcophandler.moc: No such file or directory
../../../amarok/src/playlist.h:117: error: incomplete type 'AmarokConfig' used in nested name specifier
../../../amarok/src/playlistbrowser.h:74: error: incomplete type 'AmarokConfig' used in nested name specifier
amarokdcophandler.cpp: In member function 'virtual bool amaroK::DcopPlayerHandler::equalizerEnabled()':
amarokdcophandler.cpp:80: error: incomplete type 'AmarokConfig' used in nested name specifier
amarokdcophandler.cpp: In member function 'virtual bool amaroK::DcopPlayerHandler::osdEnabled()':
amarokdcophandler.cpp:87: error: incomplete type 'AmarokConfig' used in nested name specifier
amarokdcophandler.cpp: In member function 'virtual bool amaroK::DcopPlayerHandler::randomModeStatus()':
amarokdcophandler.cpp:97: error: incomplete type 'AmarokConfig' used in nested name specifier
amarokdcophandler.cpp: In member function 'virtual QString amaroK::DcopPlayerHandler::engine()':
amarokdcophandler.cpp:206: error: incomplete type 'AmarokConfig' used in nested name specifier
amarokdcophandler.cpp: In member function 'virtual QString amaroK::DcopPlayerHandler::setContextStyle(const QString&)':
amarokdcophandler.cpp:236: error: incomplete type 'AmarokConfig' used in nested name specifier
amarokdcophandler.cpp: In member function 'virtual void amaroK::DcopPlayerHandler::enableOSD(bool)':
amarokdcophandler.cpp:286: error: incomplete type 'AmarokConfig' used in nested name specifier
amarokdcophandler.cpp: In member function 'virtual void amaroK::DcopPlayerHandler::enableRandomMode(bool)':
amarokdcophandler.cpp:292: error: 'struct AmarokConfig::EnumRandomMode' has not been declared
amarokdcophandler.cpp:292: error: 'struct AmarokConfig::EnumRandomMode' has not been declared
amarokdcophandler.cpp: In member function 'virtual void amaroK::DcopPlayerHandler::enableRepeatPlaylist(bool)':
amarokdcophandler.cpp:298: error: 'struct AmarokConfig::EnumRepeat' has not been declared
amarokdcophandler.cpp:298: error: 'struct AmarokConfig::EnumRepeat' has not been declared
amarokdcophandler.cpp: In member function 'virtual void amaroK::DcopPlayerHandler::enableRepeatTrack(bool)':
amarokdcophandler.cpp:304: error: 'struct AmarokConfig::EnumRepeat' has not been declared
amarokdcophandler.cpp:304: error: 'struct AmarokConfig::EnumRepeat' has not been declared
amarokdcophandler.cpp: In member function 'virtual void amaroK::DcopPlayerHandler::setEqualizerEnabled(bool)':
amarokdcophandler.cpp:384: error: incomplete type 'AmarokConfig' used in nested name specifier
amarokdcophandler.cpp: In member function 'virtual QString amaroK::DcopScriptHandler::readConfig(const QString&)':
amarokdcophandler.cpp:816: error: 'KConfigSkeletonItem' was not declared in this scope
amarokdcophandler.cpp:816: error: 'configItem' was not declared in this scope
amarokdcophandler.cpp:816: error: incomplete type 'AmarokConfig' used in nested name specifier
amarokdcophandler.cpp: In member function 'virtual QStringList amaroK::DcopScriptHandler::readListConfig(const QString&)':
amarokdcophandler.cpp:826: error: 'KConfigSkeletonItem' was not declared in this scope
amarokdcophandler.cpp:826: error: 'configItem' was not declared in this scope
amarokdcophandler.cpp:826: error: incomplete type 'AmarokConfig' used in nested name specifier
amarokdcophandler.cpp: In member function 'virtual QString amaroK::DcopScriptHandler::readConfig(const QString&)':
amarokdcophandler.cpp:821: warning: control reaches end of non-void function
make[4]: *** [amarokdcophandler.lo] Error 1
make[4]: Leaving directory `/var/tmp/portage/amarok-svn-1.4-r6/work/amarok-svn-1.4/amarok/src/amarokcore'
make[3]: *** [all-recursive] Error 1
make[3]: Leaving directory `/var/tmp/portage/amarok-svn-1.4-r6/work/amarok-svn-1.4/amarok/src'
make[2]: *** [all-recursive] Error 1
make[2]: Leaving directory `/var/tmp/portage/amarok-svn-1.4-r6/work/amarok-svn-1.4/amarok'
make[1]: *** [all-recursive] Error 1
make[1]: Leaving directory `/var/tmp/portage/amarok-svn-1.4-r6/work/amarok-svn-1.4'