gnutls.Tpo"; exit 1; fi
ssl-gnutls.c:32:27: gnutls/gnutls.h: No such file or directory
ssl-gnutls.c:36: error: syntax error before "gnutls_session"
ssl-gnutls.c:36: warning: no semicolon at end of struct or union
ssl-gnutls.c:38: warning: type defaults to `int' in declaration of `GaimSslGnutl sData'
ssl-gnutls.c:38: warning: data definition has no type or storage class
ssl-gnutls.c:42: error: syntax error before "xcred"
ssl-gnutls.c:42: warning: type defaults to `int' in declaration of `xcred'
ssl-gnutls.c:42: warning: data definition has no type or storage class
ssl-gnutls.c: In function `ssl_gnutls_init_gnutls':
ssl-gnutls.c:47: warning: implicit declaration of function `gnutls_global_init'
ssl-gnutls.c:49: warning: implicit declaration of function `gnutls_certificate_a llocate_credentials'
ssl-gnutls.c:50: warning: implicit declaration of function `gnutls_certificate_s et_x509_trust_file'
ssl-gnutls.c:51: error: `GNUTLS_X509_FMT_PEM' undeclared (first use in this func tion)
ssl-gnutls.c:51: error: (Each undeclared identifier is reported only once
ssl-gnutls.c:51: error: for each function it appears in.)
ssl-gnutls.c: In function `ssl_gnutls_uninit':
ssl-gnutls.c:63: warning: implicit declaration of function `gnutls_global_deinit '
ssl-gnutls.c:65: warning: implicit declaration of function `gnutls_certificate_f ree_credentials'
ssl-gnutls.c: In function `ssl_gnutls_connect_cb':
ssl-gnutls.c:72: error: `gnutls_data' undeclared (first use in this function)
ssl-gnutls.c:73: error: `GNUTLS_CRT_X509' undeclared (first use in this function )
ssl-gnutls.c:73: error: initializer element is not constant
ssl-gnutls.c:73: error: (near initialization for `cert_type_priority[0]')
ssl-gnutls.c:86: error: syntax error before ')' token
ssl-gnutls.c:89: warning: implicit declaration of function `gnutls_init'
ssl-gnutls.c:89: error: `GNUTLS_CLIENT' undeclared (first use in this function)
ssl-gnutls.c:90: warning: implicit declaration of function `gnutls_set_default_p riority'
ssl-gnutls.c:92: warning: implicit declaration of function `gnutls_certificate_t ype_set_priority'
ssl-gnutls.c:95: warning: implicit declaration of function `gnutls_credentials_s et'
ssl-gnutls.c:95: error: `GNUTLS_CRD_CERTIFICATE' undeclared (first use in this f unction)
ssl-gnutls.c:98: warning: implicit declaration of function `gnutls_transport_set _ptr'
ssl-gnutls.c:104: warning: implicit declaration of function `gnutls_handshake'
ssl-gnutls.c:106: error: `GNUTLS_E_AGAIN' undeclared (first use in this function )
ssl-gnutls.c:106: error: `GNUTLS_E_INTERRUPTED' undeclared (first use in this fu nction)
ssl-gnutls.c: In function `ssl_gnutls_close':
ssl-gnutls.c:129: error: `gnutls_data' undeclared (first use in this function)
ssl-gnutls.c:129: error: syntax error before ')' token
ssl-gnutls.c:134: warning: implicit declaration of function `gnutls_bye'
ssl-gnutls.c:134: error: `GNUTLS_SHUT_RDWR' undeclared (first use in this functi on)
ssl-gnutls.c:136: warning: implicit declaration of function `gnutls_deinit'
ssl-gnutls.c: In function `ssl_gnutls_read':
ssl-gnutls.c:144: error: `gnutls_data' undeclared (first use in this function)
ssl-gnutls.c:144: error: syntax error before ')' token
ssl-gnutls.c:149: warning: implicit declaration of function `gnutls_record_recv'
ssl-gnutls.c:151: error: `GNUTLS_E_AGAIN' undeclared (first use in this function )
ssl-gnutls.c:151: error: `GNUTLS_E_INTERRUPTED' undeclared (first use in this fu nction)
ssl-gnutls.c: In function `ssl_gnutls_write':
ssl-gnutls.c:165: error: `gnutls_data' undeclared (first use in this function)
ssl-gnutls.c:165: error: syntax error before ')' token
ssl-gnutls.c:169: warning: implicit declaration of function `gnutls_record_send'
make[3]: *** [ssl-gnutls.lo] Error 1
make[3]: Leaving directory `/home/gaim-1.5.0/plugins/ssl'
make[2]: *** [all-recursive] Error 1
make[2]: Leaving directory `/home/gaim-1.5.0/plugins'
make[1]: *** [all-recursive] Error 1