All pastes #784570 Raw Edit

gtk+ fails to compile

public text v1 · immutable
·published 2007-11-19 19:16 UTC
rendered paste body
This file contains any messages produced by compilers while
running configure, to aid debugging if configure makes a mistake.

It was created by gtk+ configure 2.10.13, which was
generated by GNU Autoconf 2.60.  Invocation command line was

  $ ./configure LDFLAGS=-L/usr/local/lib CPPFLAGS=-I/usr/local/include

## --------- ##
## Platform. ##
## --------- ##

hostname = slowbox
uname -m = IP30
uname -r = 6.5
uname -s = IRIX64
uname -v = 07202013

/usr/bin/uname -p = mips
/bin/uname -X     = unknown

/bin/arch              = unknown
/usr/bin/arch -k       = unknown
/usr/convex/getsysinfo = unknown
/usr/bin/hostinfo      = unknown
/bin/machine           = unknown
/usr/bin/oslevel       = unknown
/bin/universe          = unknown

PATH: /usr/local/bin
PATH: /usr/freeware/bin
PATH: /usr/local/bin
PATH: /usr/freeware/bin
PATH: /usr/sbin
PATH: /usr/bsd
PATH: /sbin
PATH: /usr/bin
PATH: /etc
PATH: /usr/etc
PATH: /usr/bin/X11


## ----------- ##
## Core tests. ##
## ----------- ##

configure:2168: checking for a BSD-compatible install
configure:2224: result: ./install-sh -c
configure:2235: checking whether build environment is sane
configure:2278: result: yes
configure:2311: checking for gawk
configure:2341: result: no
configure:2311: checking for mawk
configure:2341: result: no
configure:2311: checking for nawk
configure:2327: found /usr/bin/nawk
configure:2338: result: nawk
configure:2349: checking whether make sets $(MAKE)
configure:2370: result: yes
configure:2615: checking build system type
configure:2633: result: mips-sgi-irix6.5
configure:2655: checking host system type
configure:2670: result: mips-sgi-irix6.5
configure:2694: checking for native Win32
configure:2705: result: no
configure:2761: checking for gcc
configure:2777: found /usr/freeware/bin/gcc
configure:2788: result: gcc
configure:3026: checking for C compiler version
configure:3033: gcc --version >&5
gcc (GCC) 3.3
Copyright (C) 2003 Free Software Foundation, Inc.
This is free software; see the source for copying conditions.  There is NO
warranty; not even for MERCHANTABILITY or FITNESS FOR A PARTICULAR PURPOSE.

configure:3036: $? = 0
configure:3043: gcc -v >&5
Reading specs from /usr/freeware/lib/gcc-lib/mips-sgi-irix6.5/3.3/specs
Configured with: ../configure --prefix=/usr/freeware --enable-version-specific-runtime-libs --disable-shared --enable-threads --enable-haifa --enable-libgcj --disable-c-mbchar
Thread model: single
gcc version 3.3
configure:3046: $? = 0
configure:3053: gcc -V >&5
gcc: `-V' option must have argument
configure:3056: $? = 1
configure:3079: checking for C compiler default output file name
configure:3106: gcc  -I/usr/local/include -L/usr/local/lib conftest.c  >&5
configure:3109: $? = 0
configure:3155: result: a.out
configure:3160: checking whether the C compiler works
configure:3170: ./a.out
configure:3173: $? = 0
configure:3190: result: yes
configure:3197: checking whether we are cross compiling
configure:3199: result: no
configure:3202: checking for suffix of executables
configure:3209: gcc -o conftest  -I/usr/local/include -L/usr/local/lib conftest.c  >&5
configure:3212: $? = 0
configure:3236: result: 
configure:3242: checking for suffix of object files
configure:3268: gcc -c  -I/usr/local/include conftest.c >&5
configure:3271: $? = 0
configure:3294: result: o
configure:3298: checking whether we are using the GNU C compiler
configure:3327: gcc -c  -I/usr/local/include conftest.c >&5
configure:3333: $? = 0
configure:3340: test -z "$ac_c_werror_flag" || test ! -s conftest.err
configure:3343: $? = 0
configure:3350: test -s conftest.o
configure:3353: $? = 0
configure:3367: result: yes
configure:3372: checking whether gcc accepts -g
configure:3402: gcc -c -g -I/usr/local/include conftest.c >&5
configure:3408: $? = 0
configure:3415: test -z "$ac_c_werror_flag" || test ! -s conftest.err
configure:3418: $? = 0
configure:3425: test -s conftest.o
configure:3428: $? = 0
configure:3558: result: yes
configure:3575: checking for gcc option to accept ISO C89
configure:3649: gcc  -c -g -O2 -I/usr/local/include conftest.c >&5
configure:3655: $? = 0
configure:3662: test -z "$ac_c_werror_flag" || test ! -s conftest.err
configure:3665: $? = 0
configure:3672: test -s conftest.o
configure:3675: $? = 0
configure:3695: result: none needed
configure:3724: checking for style of include used by make
configure:3752: result: GNU
configure:3780: checking dependency style of gcc
configure:3863: result: gcc3
configure:3969: checking for a sed that does not truncate output
configure:4023: result: /sbin/sed
configure:4026: checking for grep that handles long lines and -e
configure:4100: result: /sbin/grep
configure:4105: checking for egrep
configure:4183: result: /sbin/grep -E
configure:4199: checking for ld used by gcc
configure:4266: result: /usr/bin/ld
configure:4275: checking if the linker (/usr/bin/ld) is GNU ld
configure:4290: result: no
configure:4295: checking for /usr/bin/ld option to reload object files
configure:4302: result: -r
configure:4320: checking for BSD-compatible nm
configure:4369: result: /usr/bin/nm -B
configure:4373: checking whether ln -s works
configure:4377: result: yes
configure:4384: checking how to recognise dependent libraries
configure:4560: result: pass_all
configure:4611: gcc -c -g -O2 -I/usr/local/include conftest.c >&5
configure:4614: $? = 0
configure:5100: checking how to run the C preprocessor
configure:5140: gcc -E -I/usr/local/include conftest.c
configure:5146: $? = 0
configure:5184: gcc -E -I/usr/local/include conftest.c
conftest.c:9:28: ac_nonexistent.h: No such file or directory
configure:5190: $? = 1
configure: failed program was:
| /* confdefs.h.  */
| #define PACKAGE_NAME "gtk+"
| #define PACKAGE_TARNAME "gtk+"
| #define PACKAGE_VERSION "2.10.13"
| #define PACKAGE_STRING "gtk+ 2.10.13"
| #define PACKAGE_BUGREPORT "http://bugzilla.gnome.org/enter_bug.cgi?product=gtk%2B"
| #define GETTEXT_PACKAGE "gtk20"
| /* end confdefs.h.  */
| #include <ac_nonexistent.h>
configure:5230: result: gcc -E
configure:5259: gcc -E -I/usr/local/include conftest.c
configure:5265: $? = 0
configure:5303: gcc -E -I/usr/local/include conftest.c
conftest.c:9:28: ac_nonexistent.h: No such file or directory
configure:5309: $? = 1
configure: failed program was:
| /* confdefs.h.  */
| #define PACKAGE_NAME "gtk+"
| #define PACKAGE_TARNAME "gtk+"
| #define PACKAGE_VERSION "2.10.13"
| #define PACKAGE_STRING "gtk+ 2.10.13"
| #define PACKAGE_BUGREPORT "http://bugzilla.gnome.org/enter_bug.cgi?product=gtk%2B"
| #define GETTEXT_PACKAGE "gtk20"
| /* end confdefs.h.  */
| #include <ac_nonexistent.h>
configure:5354: checking for ANSI C header files
configure:5384: gcc -c -g -O2 -I/usr/local/include conftest.c >&5
configure:5390: $? = 0
configure:5397: test -z "$ac_c_werror_flag" || test ! -s conftest.err
configure:5400: $? = 0
configure:5407: test -s conftest.o
configure:5410: $? = 0
configure:5506: gcc -o conftest -g -O2 -I/usr/local/include -L/usr/local/lib conftest.c  >&5
configure:5509: $? = 0
configure:5515: ./conftest
configure:5518: $? = 0
configure:5535: result: yes
configure:5559: checking for sys/types.h
configure:5580: gcc -c -g -O2 -I/usr/local/include conftest.c >&5
configure:5586: $? = 0
configure:5593: test -z "$ac_c_werror_flag" || test ! -s conftest.err
configure:5596: $? = 0
configure:5603: test -s conftest.o
configure:5606: $? = 0
configure:5619: result: yes
configure:5559: checking for sys/stat.h
configure:5580: gcc -c -g -O2 -I/usr/local/include conftest.c >&5
configure:5586: $? = 0
configure:5593: test -z "$ac_c_werror_flag" || test ! -s conftest.err
configure:5596: $? = 0
configure:5603: test -s conftest.o
configure:5606: $? = 0
configure:5619: result: yes
configure:5559: checking for stdlib.h
configure:5580: gcc -c -g -O2 -I/usr/local/include conftest.c >&5
configure:5586: $? = 0
configure:5593: test -z "$ac_c_werror_flag" || test ! -s conftest.err
configure:5596: $? = 0
configure:5603: test -s conftest.o
configure:5606: $? = 0
configure:5619: result: yes
configure:5559: checking for string.h
configure:5580: gcc -c -g -O2 -I/usr/local/include conftest.c >&5
configure:5586: $? = 0
configure:5593: test -z "$ac_c_werror_flag" || test ! -s conftest.err
configure:5596: $? = 0
configure:5603: test -s conftest.o
configure:5606: $? = 0
configure:5619: result: yes
configure:5559: checking for memory.h
configure:5580: gcc -c -g -O2 -I/usr/local/include conftest.c >&5
configure:5586: $? = 0
configure:5593: test -z "$ac_c_werror_flag" || test ! -s conftest.err
configure:5596: $? = 0
configure:5603: test -s conftest.o
configure:5606: $? = 0
configure:5619: result: yes
configure:5559: checking for strings.h
configure:5580: gcc -c -g -O2 -I/usr/local/include conftest.c >&5
configure:5586: $? = 0
configure:5593: test -z "$ac_c_werror_flag" || test ! -s conftest.err
configure:5596: $? = 0
configure:5603: test -s conftest.o
configure:5606: $? = 0
configure:5619: result: yes
configure:5559: checking for inttypes.h
configure:5580: gcc -c -g -O2 -I/usr/local/include conftest.c >&5
configure:5586: $? = 0
configure:5593: test -z "$ac_c_werror_flag" || test ! -s conftest.err
configure:5596: $? = 0
configure:5603: test -s conftest.o
configure:5606: $? = 0
configure:5619: result: yes
configure:5559: checking for stdint.h
configure:5580: gcc -c -g -O2 -I/usr/local/include conftest.c >&5
In file included from conftest.c:51:
/usr/include/stdint.h:5:2: #error This header file is to be used only for c99 mode compilations
configure:5586: $? = 1
configure: failed program was:
| /* confdefs.h.  */
| #define PACKAGE_NAME "gtk+"
| #define PACKAGE_TARNAME "gtk+"
| #define PACKAGE_VERSION "2.10.13"
| #define PACKAGE_STRING "gtk+ 2.10.13"
| #define PACKAGE_BUGREPORT "http://bugzilla.gnome.org/enter_bug.cgi?product=gtk%2B"
| #define GETTEXT_PACKAGE "gtk20"
| #define STDC_HEADERS 1
| #define HAVE_SYS_TYPES_H 1
| #define HAVE_SYS_STAT_H 1
| #define HAVE_STDLIB_H 1
| #define HAVE_STRING_H 1
| #define HAVE_MEMORY_H 1
| #define HAVE_STRINGS_H 1
| #define HAVE_INTTYPES_H 1
| /* end confdefs.h.  */
| #include <stdio.h>
| #if HAVE_SYS_TYPES_H
| # include <sys/types.h>
| #endif
| #if HAVE_SYS_STAT_H
| # include <sys/stat.h>
| #endif
| #if STDC_HEADERS
| # include <stdlib.h>
| # include <stddef.h>
| #else
| # if HAVE_STDLIB_H
| #  include <stdlib.h>
| # endif
| #endif
| #if HAVE_STRING_H
| # if !STDC_HEADERS && HAVE_MEMORY_H
| #  include <memory.h>
| # endif
| # include <string.h>
| #endif
| #if HAVE_STRINGS_H
| # include <strings.h>
| #endif
| #if HAVE_INTTYPES_H
| # include <inttypes.h>
| #endif
| #if HAVE_STDINT_H
| # include <stdint.h>
| #endif
| #if HAVE_UNISTD_H
| # include <unistd.h>
| #endif
| 
| #include <stdint.h>
configure:5619: result: no
configure:5559: checking for unistd.h
configure:5580: gcc -c -g -O2 -I/usr/local/include conftest.c >&5
configure:5586: $? = 0
configure:5593: test -z "$ac_c_werror_flag" || test ! -s conftest.err
configure:5596: $? = 0
configure:5603: test -s conftest.o
configure:5606: $? = 0
configure:5619: result: yes
configure:5646: checking dlfcn.h usability
configure:5663: gcc -c -g -O2 -I/usr/local/include conftest.c >&5
configure:5669: $? = 0
configure:5676: test -z "$ac_c_werror_flag" || test ! -s conftest.err
configure:5679: $? = 0
configure:5686: test -s conftest.o
configure:5689: $? = 0
configure:5700: result: yes
configure:5704: checking dlfcn.h presence
configure:5719: gcc -E -I/usr/local/include conftest.c
configure:5725: $? = 0
configure:5746: result: yes
configure:5779: checking for dlfcn.h
configure:5787: result: yes
configure:5858: checking for g++
configure:5874: found /usr/freeware/bin/g++
configure:5885: result: g++
configure:5916: checking for C++ compiler version
configure:5923: g++ --version >&5
g++ (GCC) 3.3
Copyright (C) 2003 Free Software Foundation, Inc.
This is free software; see the source for copying conditions.  There is NO
warranty; not even for MERCHANTABILITY or FITNESS FOR A PARTICULAR PURPOSE.

configure:5926: $? = 0
configure:5933: g++ -v >&5
Reading specs from /usr/freeware/lib/gcc-lib/mips-sgi-irix6.5/3.3/specs
Configured with: ../configure --prefix=/usr/freeware --enable-version-specific-runtime-libs --disable-shared --enable-threads --enable-haifa --enable-libgcj --disable-c-mbchar
Thread model: single
gcc version 3.3
configure:5936: $? = 0
configure:5943: g++ -V >&5
g++: `-V' option must have argument
configure:5946: $? = 1
configure:5949: checking whether we are using the GNU C++ compiler
configure:5978: g++ -c  -I/usr/local/include conftest.cpp >&5
configure:5984: $? = 0
configure:5991: test -z "$ac_cxx_werror_flag" || test ! -s conftest.err
configure:5994: $? = 0
configure:6001: test -s conftest.o
configure:6004: $? = 0
configure:6018: result: yes
configure:6023: checking whether g++ accepts -g
configure:6053: g++ -c -g -I/usr/local/include conftest.cpp >&5
configure:6059: $? = 0
configure:6066: test -z "$ac_cxx_werror_flag" || test ! -s conftest.err
configure:6069: $? = 0
configure:6076: test -s conftest.o
configure:6079: $? = 0
configure:6209: result: yes
configure:6234: checking dependency style of g++
configure:6317: result: gcc3
configure:6344: checking how to run the C++ preprocessor
configure:6380: g++ -E -I/usr/local/include conftest.cpp
configure:6386: $? = 0
configure:6424: g++ -E -I/usr/local/include conftest.cpp
conftest.cpp:19:28: ac_nonexistent.h: No such file or directory
configure:6430: $? = 1
configure: failed program was:
| /* confdefs.h.  */
| #define PACKAGE_NAME "gtk+"
| #define PACKAGE_TARNAME "gtk+"
| #define PACKAGE_VERSION "2.10.13"
| #define PACKAGE_STRING "gtk+ 2.10.13"
| #define PACKAGE_BUGREPORT "http://bugzilla.gnome.org/enter_bug.cgi?product=gtk%2B"
| #define GETTEXT_PACKAGE "gtk20"
| #define STDC_HEADERS 1
| #define HAVE_SYS_TYPES_H 1
| #define HAVE_SYS_STAT_H 1
| #define HAVE_STDLIB_H 1
| #define HAVE_STRING_H 1
| #define HAVE_MEMORY_H 1
| #define HAVE_STRINGS_H 1
| #define HAVE_INTTYPES_H 1
| #define HAVE_UNISTD_H 1
| #define HAVE_DLFCN_H 1
| /* end confdefs.h.  */
| #include <ac_nonexistent.h>
configure:6470: result: g++ -E
configure:6499: g++ -E -I/usr/local/include conftest.cpp
configure:6505: $? = 0
configure:6543: g++ -E -I/usr/local/include conftest.cpp
conftest.cpp:19:28: ac_nonexistent.h: No such file or directory
configure:6549: $? = 1
configure: failed program was:
| /* confdefs.h.  */
| #define PACKAGE_NAME "gtk+"
| #define PACKAGE_TARNAME "gtk+"
| #define PACKAGE_VERSION "2.10.13"
| #define PACKAGE_STRING "gtk+ 2.10.13"
| #define PACKAGE_BUGREPORT "http://bugzilla.gnome.org/enter_bug.cgi?product=gtk%2B"
| #define GETTEXT_PACKAGE "gtk20"
| #define STDC_HEADERS 1
| #define HAVE_SYS_TYPES_H 1
| #define HAVE_SYS_STAT_H 1
| #define HAVE_STDLIB_H 1
| #define HAVE_STRING_H 1
| #define HAVE_MEMORY_H 1
| #define HAVE_STRINGS_H 1
| #define HAVE_INTTYPES_H 1
| #define HAVE_UNISTD_H 1
| #define HAVE_DLFCN_H 1
| /* end confdefs.h.  */
| #include <ac_nonexistent.h>
configure:6649: checking for g77
configure:6665: found /usr/freeware/bin/g77
configure:6676: result: g77
configure:6706: checking for Fortran 77 compiler version
configure:6713: g77 --version >&5
GNU Fortran (GCC) 3.3
Copyright (C) 2002 Free Software Foundation, Inc.

GNU Fortran comes with NO WARRANTY, to the extent permitted by law.
You may redistribute copies of GNU Fortran
under the terms of the GNU General Public License.
For more information about these matters, see the file named COPYING
or type the command `info -f g77 Copying'.
configure:6716: $? = 0
configure:6723: g77 -v >&5
Reading specs from /usr/freeware/lib/gcc-lib/mips-sgi-irix6.5/3.3/specs
Configured with: ../configure --prefix=/usr/freeware --enable-version-specific-runtime-libs --disable-shared --enable-threads --enable-haifa --enable-libgcj --disable-c-mbchar
Thread model: single
gcc version 3.3
configure:6726: $? = 0
configure:6733: g77 -V >&5
g77: `-V' option must have argument
configure:6736: $? = 1
configure:6744: checking whether we are using the GNU Fortran 77 compiler
configure:6763: g77 -c  conftest.F >&5
configure:6769: $? = 0
configure:6776: test -z "$ac_f77_werror_flag" || test ! -s conftest.err
configure:6779: $? = 0
configure:6786: test -s conftest.o
configure:6789: $? = 0
configure:6803: result: yes
configure:6809: checking whether g77 accepts -g
configure:6826: g77 -c -g conftest.f >&5
configure:6832: $? = 0
configure:6839: test -z "$ac_f77_werror_flag" || test ! -s conftest.err
configure:6842: $? = 0
configure:6849: test -s conftest.o
configure:6852: $? = 0
configure:6865: result: yes
configure:6895: checking the maximum length of command line arguments
configure:7004: result: 65536
configure:7015: checking command to parse /usr/bin/nm -B output from gcc object
configure:7120: gcc -c -g -O2 -I/usr/local/include conftest.c >&5
configure:7123: $? = 0
configure:7127: /usr/bin/nm -B conftest.o \| sed -n -e 's/^.*[ 	]\([BCDEGRST][BCDEGRST]*\)[ 	][ 	]*\([_A-Za-z][_A-Za-z0-9]*\)$/\1 \2 \2/p' \> conftest.nm
configure:7130: $? = 0
configure:7182: gcc -o conftest -g -O2 -I/usr/local/include -L/usr/local/lib conftest.c conftstm.o >&5
configure:7185: $? = 0
configure:7223: result: ok
configure:7227: checking for objdir
configure:7242: result: .libs
configure:7334: checking for ar
configure:7350: found /usr/bin/ar
configure:7361: result: ar
configure:7430: checking for ranlib
configure:7460: result: no
configure:7526: checking for strip
configure:7542: found /usr/bin/strip
configure:7553: result: strip
configure:7839: checking if gcc supports -fno-rtti -fno-exceptions
configure:7857: gcc -c -g -O2 -I/usr/local/include -fno-rtti -fno-exceptions conftest.c >&5
cc1: warning: "-frtti" is valid for C++ but not for C/ObjC
configure:7861: $? = 0
configure:7874: result: no
configure:7889: checking for gcc option to produce PIC
configure:8099: result: 
configure:8170: checking if gcc static flag -static works
configure:8198: result: yes
configure:8208: checking if gcc supports -c -o file.o
configure:8229: gcc -c -g -O2 -I/usr/local/include -o out/conftest2.o conftest.c >&5
configure:8233: $? = 0
configure:8255: result: yes
configure:8281: checking whether the gcc linker (/usr/bin/ld -n32) supports shared libraries
configure:9267: result: yes
configure:9288: checking whether -lc should be explicitly linked in
configure:9293: gcc -c -g -O2 -I/usr/local/include conftest.c >&5
configure:9296: $? = 0
configure:9311: gcc -shared conftest.o  -v -Wl,-soname -Wl,conftest  -Wl,-update_registry -Wl,./so_locations -o conftest 2\>\&1 \| grep  -lc  \>/dev/null 2\>\&1
configure:9314: $? = 1
configure:9326: result: yes
configure:9334: checking dynamic linker characteristics
configure:9943: result: irix6.5 ld.so
configure:9952: checking how to hardcode library paths into programs
configure:9977: result: immediate
configure:9991: checking whether stripping libraries is possible
configure:10012: result: no
configure:10909: checking if libtool supports shared libraries
configure:10911: result: yes
configure:10914: checking whether to build shared libraries
configure:10935: result: yes
configure:10938: checking whether to build static libraries
configure:10942: result: no
configure:11034: creating libtool
configure:11622: checking for ld used by g++
configure:11689: result: /usr/bin/ld -n32
configure:11698: checking if the linker (/usr/bin/ld -n32) is GNU ld
configure:11713: result: no
configure:11764: checking whether the g++ linker (/usr/bin/ld -n32) supports shared libraries
configure:12730: result: yes
configure:12748: g++ -c -g -O2 -I/usr/local/include conftest.cpp >&5
configure:12751: $? = 0
configure:12870: checking for g++ option to produce PIC
configure:13144: result: 
configure:13215: checking if g++ static flag -static works
ld32: WARNING 84 : /usr/freeware/lib/gcc-lib/mips-sgi-irix6.5/3.3/libstdc++.a is not used for resolving any symbol.
ld32: WARNING 84 : /usr/lib32/libm.so is not used for resolving any symbol.
configure:13243: result: yes
configure:13253: checking if g++ supports -c -o file.o
configure:13274: g++ -c -g -O2 -I/usr/local/include -o out/conftest2.o conftest.cpp >&5
configure:13278: $? = 0
configure:13300: result: yes
configure:13326: checking whether the g++ linker (/usr/bin/ld -n32) supports shared libraries
configure:13351: result: yes
configure:13418: checking dynamic linker characteristics
configure:14027: result: irix6.5 ld.so
configure:14036: checking how to hardcode library paths into programs
configure:14061: result: immediate
configure:14587: checking if libtool supports shared libraries
configure:14589: result: yes
configure:14592: checking whether to build shared libraries
configure:14612: result: yes
configure:14615: checking whether to build static libraries
configure:14619: result: no
configure:14629: checking for g77 option to produce PIC
configure:14839: result: 
configure:14910: checking if g77 static flag -static works
ld32: WARNING 84 : /usr/lib32/libm.so is not used for resolving any symbol.
configure:14938: result: yes
configure:14948: checking if g77 supports -c -o file.o
configure:14969: g77 -c -g -O2 -o out/conftest2.o conftest.f >&5
configure:14973: $? = 0
configure:14995: result: yes
configure:15021: checking whether the g77 linker (/usr/bin/ld -n32) supports shared libraries
configure:15987: result: yes
configure:16054: checking dynamic linker characteristics
configure:16663: result: irix6.5 ld.so
configure:16672: checking how to hardcode library paths into programs
configure:16697: result: immediate
configure:20316: checking for special C compiler options needed for large files
configure:20443: result: no
configure:20449: checking for _FILE_OFFSET_BITS value needed for large files
configure:20485: gcc -c -g -O2 -I/usr/local/include conftest.c >&5
configure:20491: $? = 0
configure:20498: test -z "$ac_c_werror_flag" || test ! -s conftest.err
configure:20501: $? = 0
configure:20508: test -s conftest.o
configure:20511: $? = 0
configure:20592: result: no
configure:20602: checking for _LARGE_FILES value needed for large files
configure:20638: gcc -c -g -O2 -I/usr/local/include conftest.c >&5
configure:20644: $? = 0
configure:20651: test -z "$ac_c_werror_flag" || test ! -s conftest.err
configure:20654: $? = 0
configure:20661: test -s conftest.o
configure:20664: $? = 0
configure:20745: result: no
configure:20767: checking for nm
configure:20798: result: /usr/bin/nm -B
configure:20807: checking whether to enable maintainer-specific portions of Makefiles
configure:20816: result: no
configure:20832: checking for some Win32 platform
configure:20842: result: no
configure:21162: checking whether build environment is sane
configure:21205: result: yes
configure:21209: checking for library containing strerror
configure:21250: gcc -o conftest -g -O2 -I/usr/local/include -L/usr/local/lib conftest.c  >&5
configure:21256: $? = 0
configure:21263: test -z "$ac_c_werror_flag" || test ! -s conftest.err
configure:21266: $? = 0
configure:21273: test -s conftest
configure:21276: $? = 0
configure:21300: result: none required
configure:21311: checking for gcc option to accept ANSI C
configure:21379: gcc  -c -g -O2 -I/usr/local/include conftest.c >&5
configure:21385: $? = 0
configure:21392: test -z "$ac_c_werror_flag" || test ! -s conftest.err
configure:21395: $? = 0
configure:21402: test -s conftest.o
configure:21405: $? = 0
configure:21422: result: none needed
configure:21446: checking for a BSD-compatible install
configure:21502: result: ./install-sh -c
configure:21513: checking whether make sets $(MAKE)
configure:21534: result: yes
configure:21660: checking for pkg-config
configure:21678: found /usr/local/bin/pkg-config
configure:21690: result: /usr/local/bin/pkg-config
configure:21719: checking pkg-config is at least version 0.9.0
configure:21722: result: yes
configure:21733: checking for BASE_DEPENDENCIES
configure:21741: $PKG_CONFIG --exists --print-errors "glib-2.0 >= 2.12.0    atk >= 1.9.0    pango >= 1.12.0    cairo >= 1.2.0"
configure:21744: $? = 0
configure:21759: $PKG_CONFIG --exists --print-errors "glib-2.0 >= 2.12.0    atk >= 1.9.0    pango >= 1.12.0    cairo >= 1.2.0"
configure:21762: $? = 0
configure:21838: result: yes
configure:21862: checking Whether to write dependencies into .pc files
configure:21881: result: no
configure:21902: checking for perl5
configure:21920: found /usr/local/bin/perl5
configure:21932: result: /usr/local/bin/perl5
configure:21947: checking for indent
configure:21977: result: no
configure:21998: checking for lstat
configure:22054: gcc -o conftest -g -O2 -Wall -I/usr/local/include -L/usr/local/lib conftest.c  >&5
configure:22060: $? = 0
configure:22067: test -z "$ac_c_werror_flag" || test ! -s conftest.err
configure:22070: $? = 0
configure:22077: test -s conftest
configure:22080: $? = 0
configure:22094: result: yes
configure:21998: checking for mkstemp
configure:22054: gcc -o conftest -g -O2 -Wall -I/usr/local/include -L/usr/local/lib conftest.c  >&5
configure:22060: $? = 0
configure:22067: test -z "$ac_c_werror_flag" || test ! -s conftest.err
configure:22070: $? = 0
configure:22077: test -s conftest
configure:22080: $? = 0
configure:22094: result: yes
configure:21998: checking for flockfile
configure:22054: gcc -o conftest -g -O2 -Wall -I/usr/local/include -L/usr/local/lib conftest.c  >&5
configure:22060: $? = 0
configure:22067: test -z "$ac_c_werror_flag" || test ! -s conftest.err
configure:22070: $? = 0
configure:22077: test -s conftest
configure:22080: $? = 0
configure:22094: result: yes
configure:21998: checking for getc_unlocked
configure:22054: gcc -o conftest -g -O2 -Wall -I/usr/local/include -L/usr/local/lib conftest.c  >&5
configure:22060: $? = 0
configure:22067: test -z "$ac_c_werror_flag" || test ! -s conftest.err
configure:22070: $? = 0
configure:22077: test -s conftest
configure:22080: $? = 0
configure:22094: result: yes
configure:22106: checking for _NL_TIME_FIRST_WEEKDAY
configure:22132: gcc -o conftest -g -O2 -Wall -I/usr/local/include -L/usr/local/lib conftest.c  >&5
conftest.c: In function `main':
conftest.c:30: error: `_NL_TIME_FIRST_WEEKDAY' undeclared (first use in this function)
conftest.c:30: error: (Each undeclared identifier is reported only once
conftest.c:30: error: for each function it appears in.)
configure:22138: $? = 1
configure: failed program was:
| /* confdefs.h.  */
| #define PACKAGE_NAME "gtk+"
| #define PACKAGE_TARNAME "gtk+"
| #define PACKAGE_VERSION "2.10.13"
| #define PACKAGE_STRING "gtk+ 2.10.13"
| #define PACKAGE_BUGREPORT "http://bugzilla.gnome.org/enter_bug.cgi?product=gtk%2B"
| #define GETTEXT_PACKAGE "gtk20"
| #define STDC_HEADERS 1
| #define HAVE_SYS_TYPES_H 1
| #define HAVE_SYS_STAT_H 1
| #define HAVE_STDLIB_H 1
| #define HAVE_STRING_H 1
| #define HAVE_MEMORY_H 1
| #define HAVE_STRINGS_H 1
| #define HAVE_INTTYPES_H 1
| #define HAVE_UNISTD_H 1
| #define HAVE_DLFCN_H 1
| #define GTK_COMPILED_WITH_DEBUGGING "minimum"
| #define HAVE_LSTAT 1
| #define HAVE_MKSTEMP 1
| #define HAVE_FLOCKFILE 1
| #define HAVE_GETC_UNLOCKED 1
| /* end confdefs.h.  */
| #include <langinfo.h>
| int
| main ()
| {
| 
| char c;
| c = *((unsigned char *)  nl_langinfo(_NL_TIME_FIRST_WEEKDAY));
| 
|   ;
|   return 0;
| }
configure:22170: result: no
configure:22181: checking for _NL_MEASUREMENT_MEASUREMENT
configure:22207: gcc -o conftest -g -O2 -Wall -I/usr/local/include -L/usr/local/lib conftest.c  >&5
conftest.c: In function `main':
conftest.c:30: error: `_NL_MEASUREMENT_MEASUREMENT' undeclared (first use in this function)
conftest.c:30: error: (Each undeclared identifier is reported only once
conftest.c:30: error: for each function it appears in.)
configure:22213: $? = 1
configure: failed program was:
| /* confdefs.h.  */
| #define PACKAGE_NAME "gtk+"
| #define PACKAGE_TARNAME "gtk+"
| #define PACKAGE_VERSION "2.10.13"
| #define PACKAGE_STRING "gtk+ 2.10.13"
| #define PACKAGE_BUGREPORT "http://bugzilla.gnome.org/enter_bug.cgi?product=gtk%2B"
| #define GETTEXT_PACKAGE "gtk20"
| #define STDC_HEADERS 1
| #define HAVE_SYS_TYPES_H 1
| #define HAVE_SYS_STAT_H 1
| #define HAVE_STDLIB_H 1
| #define HAVE_STRING_H 1
| #define HAVE_MEMORY_H 1
| #define HAVE_STRINGS_H 1
| #define HAVE_INTTYPES_H 1
| #define HAVE_UNISTD_H 1
| #define HAVE_DLFCN_H 1
| #define GTK_COMPILED_WITH_DEBUGGING "minimum"
| #define HAVE_LSTAT 1
| #define HAVE_MKSTEMP 1
| #define HAVE_FLOCKFILE 1
| #define HAVE_GETC_UNLOCKED 1
| /* end confdefs.h.  */
| #include <langinfo.h>
| int
| main ()
| {
| 
| char c;
| c = *((unsigned char *)  nl_langinfo(_NL_MEASUREMENT_MEASUREMENT));
| 
|   ;
|   return 0;
| }
configure:22245: result: no
configure:22256: checking for _NL_PAPER_HEIGHT
configure:22282: gcc -o conftest -g -O2 -Wall -I/usr/local/include -L/usr/local/lib conftest.c  >&5
conftest.c: In function `main':
conftest.c:30: error: `_NL_PAPER_HEIGHT' undeclared (first use in this function)
conftest.c:30: error: (Each undeclared identifier is reported only once
conftest.c:30: error: for each function it appears in.)
configure:22288: $? = 1
configure: failed program was:
| /* confdefs.h.  */
| #define PACKAGE_NAME "gtk+"
| #define PACKAGE_TARNAME "gtk+"
| #define PACKAGE_VERSION "2.10.13"
| #define PACKAGE_STRING "gtk+ 2.10.13"
| #define PACKAGE_BUGREPORT "http://bugzilla.gnome.org/enter_bug.cgi?product=gtk%2B"
| #define GETTEXT_PACKAGE "gtk20"
| #define STDC_HEADERS 1
| #define HAVE_SYS_TYPES_H 1
| #define HAVE_SYS_STAT_H 1
| #define HAVE_STDLIB_H 1
| #define HAVE_STRING_H 1
| #define HAVE_MEMORY_H 1
| #define HAVE_STRINGS_H 1
| #define HAVE_INTTYPES_H 1
| #define HAVE_UNISTD_H 1
| #define HAVE_DLFCN_H 1
| #define GTK_COMPILED_WITH_DEBUGGING "minimum"
| #define HAVE_LSTAT 1
| #define HAVE_MKSTEMP 1
| #define HAVE_FLOCKFILE 1
| #define HAVE_GETC_UNLOCKED 1
| /* end confdefs.h.  */
| #include <langinfo.h>
| int
| main ()
| {
| 
| char c;
| c = *((unsigned char *)  nl_langinfo(_NL_PAPER_HEIGHT));
| 
|   ;
|   return 0;
| }
configure:22320: result: no
configure:22331: checking for _NL_PAPER_WIDTH
configure:22357: gcc -o conftest -g -O2 -Wall -I/usr/local/include -L/usr/local/lib conftest.c  >&5
conftest.c: In function `main':
conftest.c:30: error: `_NL_PAPER_WIDTH' undeclared (first use in this function)
conftest.c:30: error: (Each undeclared identifier is reported only once
conftest.c:30: error: for each function it appears in.)
configure:22363: $? = 1
configure: failed program was:
| /* confdefs.h.  */
| #define PACKAGE_NAME "gtk+"
| #define PACKAGE_TARNAME "gtk+"
| #define PACKAGE_VERSION "2.10.13"
| #define PACKAGE_STRING "gtk+ 2.10.13"
| #define PACKAGE_BUGREPORT "http://bugzilla.gnome.org/enter_bug.cgi?product=gtk%2B"
| #define GETTEXT_PACKAGE "gtk20"
| #define STDC_HEADERS 1
| #define HAVE_SYS_TYPES_H 1
| #define HAVE_SYS_STAT_H 1
| #define HAVE_STDLIB_H 1
| #define HAVE_STRING_H 1
| #define HAVE_MEMORY_H 1
| #define HAVE_STRINGS_H 1
| #define HAVE_INTTYPES_H 1
| #define HAVE_UNISTD_H 1
| #define HAVE_DLFCN_H 1
| #define GTK_COMPILED_WITH_DEBUGGING "minimum"
| #define HAVE_LSTAT 1
| #define HAVE_MKSTEMP 1
| #define HAVE_FLOCKFILE 1
| #define HAVE_GETC_UNLOCKED 1
| /* end confdefs.h.  */
| #include <langinfo.h>
| int
| main ()
| {
| 
| char c;
| c = *((unsigned char *)  nl_langinfo(_NL_PAPER_WIDTH));
| 
|   ;
|   return 0;
| }
configure:22395: result: no
configure:22406: checking for sigsetjmp
configure:22432: gcc -o conftest -g -O2 -Wall -I/usr/local/include -L/usr/local/lib conftest.c  >&5
configure:22438: $? = 0
configure:22445: test -z "$ac_c_werror_flag" || test ! -s conftest.err
configure:22448: $? = 0
configure:22455: test -s conftest
configure:22458: $? = 0
configure:22470: result: yes
configure:22502: checking locale.h usability
configure:22519: gcc -c -g -O2 -Wall -I/usr/local/include conftest.c >&5
configure:22525: $? = 0
configure:22532: test -z "$ac_c_werror_flag" || test ! -s conftest.err
configure:22535: $? = 0
configure:22542: test -s conftest.o
configure:22545: $? = 0
configure:22556: result: yes
configure:22560: checking locale.h presence
configure:22575: gcc -E -I/usr/local/include conftest.c
configure:22581: $? = 0
configure:22602: result: yes
configure:22635: checking for locale.h
configure:22643: result: yes
configure:22657: checking for LC_MESSAGES
configure:22683: gcc -o conftest -g -O2 -Wall -I/usr/local/include -L/usr/local/lib conftest.c  >&5
configure:22689: $? = 0
configure:22696: test -z "$ac_c_werror_flag" || test ! -s conftest.err
configure:22699: $? = 0
configure:22706: test -s conftest
configure:22709: $? = 0
configure:22722: result: yes
configure:22751: checking libintl.h usability
configure:22768: gcc -c -g -O2 -Wall -I/usr/local/include conftest.c >&5
configure:22774: $? = 0
configure:22781: test -z "$ac_c_werror_flag" || test ! -s conftest.err
configure:22784: $? = 0
configure:22791: test -s conftest.o
configure:22794: $? = 0
configure:22805: result: yes
configure:22809: checking libintl.h presence
configure:22824: gcc -E -I/usr/local/include conftest.c
configure:22830: $? = 0
configure:22851: result: yes
configure:22884: checking for libintl.h
configure:22891: result: yes
configure:22902: checking for ngettext in libc
configure:22930: gcc -o conftest -g -O2 -Wall -I/usr/local/include -L/usr/local/lib conftest.c  >&5
ld32: ERROR   33 : Unresolved text symbol "libintl_ngettext" -- 1st referenced by /var/tmp//ccSQLSJe.o.
	Use linker option -v to see when and which objects, archives and dsos are loaded.  
ld32: INFO    152: Output file removed because of error.
collect2: ld returned 2 exit status
configure:22936: $? = 1
configure: failed program was:
| /* confdefs.h.  */
| #define PACKAGE_NAME "gtk+"
| #define PACKAGE_TARNAME "gtk+"
| #define PACKAGE_VERSION "2.10.13"
| #define PACKAGE_STRING "gtk+ 2.10.13"
| #define PACKAGE_BUGREPORT "http://bugzilla.gnome.org/enter_bug.cgi?product=gtk%2B"
| #define GETTEXT_PACKAGE "gtk20"
| #define STDC_HEADERS 1
| #define HAVE_SYS_TYPES_H 1
| #define HAVE_SYS_STAT_H 1
| #define HAVE_STDLIB_H 1
| #define HAVE_STRING_H 1
| #define HAVE_MEMORY_H 1
| #define HAVE_STRINGS_H 1
| #define HAVE_INTTYPES_H 1
| #define HAVE_UNISTD_H 1
| #define HAVE_DLFCN_H 1
| #define GTK_COMPILED_WITH_DEBUGGING "minimum"
| #define HAVE_LSTAT 1
| #define HAVE_MKSTEMP 1
| #define HAVE_FLOCKFILE 1
| #define HAVE_GETC_UNLOCKED 1
| #define HAVE_SIGSETJMP 1
| #define HAVE_LOCALE_H 1
| #define HAVE_LC_MESSAGES 1
| /* end confdefs.h.  */
| 
| #include <libintl.h>
| 
| int
| main ()
| {
| return !ngettext ("","", 1)
|   ;
|   return 0;
| }
configure:22970: result: no
configure:23166: checking for bindtextdomain in -lintl
configure:23201: gcc -o conftest -g -O2 -Wall -I/usr/local/include -L/usr/local/lib conftest.c -lintl   >&5
configure:23207: $? = 0
configure:23214: test -z "$ac_c_werror_flag" || test ! -s conftest.err
configure:23217: $? = 0
configure:23224: test -s conftest
configure:23227: $? = 0
configure:23241: result: yes
configure:23244: checking for ngettext in -lintl
configure:23279: gcc -o conftest -g -O2 -Wall -I/usr/local/include -L/usr/local/lib conftest.c -lintl   >&5
configure:23285: $? = 0
configure:23292: test -z "$ac_c_werror_flag" || test ! -s conftest.err
configure:23295: $? = 0
configure:23302: test -s conftest
configure:23305: $? = 0
configure:23319: result: yes
configure:23322: checking for dgettext in -lintl
configure:23357: gcc -o conftest -g -O2 -Wall -I/usr/local/include -L/usr/local/lib conftest.c -lintl   >&5
configure:23363: $? = 0
configure:23370: test -z "$ac_c_werror_flag" || test ! -s conftest.err
configure:23373: $? = 0
configure:23380: test -s conftest
configure:23383: $? = 0
configure:23397: result: yes
configure:23594: checking for bind_textdomain_codeset
configure:23650: gcc -o conftest -g -O2 -Wall -I/usr/local/include -L/usr/local/lib conftest.c  -lintl  >&5
configure:23656: $? = 0
configure:23663: test -z "$ac_c_werror_flag" || test ! -s conftest.err
configure:23666: $? = 0
configure:23673: test -s conftest
configure:23676: $? = 0
configure:23690: result: yes
configure:23730: checking for msgfmt
configure:23757: result: /usr/local/bin/msgfmt
configure:23770: checking for dcgettext
configure:23826: gcc -o conftest -g -O2 -Wall -I/usr/local/include -L/usr/local/lib conftest.c  -lintl  >&5
configure:23832: $? = 0
configure:23839: test -z "$ac_c_werror_flag" || test ! -s conftest.err
configure:23842: $? = 0
configure:23849: test -s conftest
configure:23852: $? = 0
configure:23866: result: yes
configure:23877: checking if msgfmt accepts -c
configure:23892: msgfmt -c -o /dev/null conftest.foo
configure:23895: $? = 0
configure:23897: result: yes
configure:23907: checking for gmsgfmt
configure:23938: result: /usr/local/bin/msgfmt
configure:23948: checking for xgettext
configure:23975: result: /usr/local/bin/xgettext
configure:24004: gcc -o conftest -g -O2 -Wall -I/usr/local/include -L/usr/local/lib conftest.c  -lintl  >&5
configure:24010: $? = 0
configure:24017: test -z "$ac_c_werror_flag" || test ! -s conftest.err
configure:24020: $? = 0
configure:24027: test -s conftest
configure:24030: $? = 0
configure:24211: checking for catalogs to be installed
configure:24236: result:  af am ang ar as az az_IR be be@latin bg bn bn_IN br bs ca cs cy da de dz el en_CA en_GB eo es et eu fa fi fr ga gl gu he hi hr hu hy ia id is it ja ka ko ku li lt lv mi mk ml mn mr ms nb ne nl nn nso or pa pl pt pt_BR ro ru rw si sk sl sq sr sr@Latn sr@ije sv ta te th tk tr tt uk ur uz uz@Latn vi wa xh yi zh_CN zh_HK zh_TW
configure:24293: checking for extra flags to get ANSI library prototypes
configure:24318: gcc -o conftest -g -O2 -Wall -I/usr/local/include -L/usr/local/lib conftest.c  -lintl  -lm >&5
configure:24321: $? = 0
configure:24327: ./conftest
configure:24330: $? = 0
configure:24332: result: none needed
configure:24400: checking for the BeOS
configure:24409: result: no
configure:24417: checking for HP-UX
configure:24426: result: no
configure:24431: checking for extra flags for POSIX compliance
configure:24454: gcc -c -g -O2 -Wall -I/usr/local/include conftest.c >&5
conftest.c: In function `main':
conftest.c:36: warning: unused variable `dir'
configure:24460: $? = 0
configure:24467: test -z "$ac_c_werror_flag" || test ! -s conftest.err
configure:24470: $? = 0
configure:24477: test -s conftest.o
configure:24480: $? = 0
configure:24482: result: none needed
configure:24639: checking for pkg-config
configure:24669: result: /usr/local/bin/pkg-config
configure:24698: checking pkg-config is at least version 0.7
configure:24701: result: yes
configure:24719: checking for GLIB - version >= 2.12.0
configure:24843: gcc -o conftest -g -O2 -Wall -D_REENTRANT -I/usr/local/include/glib-2.0 -I/usr/local/lib/glib-2.0/include   -I/usr/local/include -L/usr/local/lib conftest.c -L/usr/local/lib -lgobject-2.0 -lgmodule-2.0 -lgthread-2.0 -lpthread -lglib-2.0 -lintl    -lintl  >&5
ld32: WARNING 84 : /usr/local/lib/libgobject-2.0.so is not used for resolving any symbol.
ld32: WARNING 84 : /usr/local/lib/libgmodule-2.0.so is not used for resolving any symbol.
ld32: WARNING 84 : /usr/local/lib/libgthread-2.0.so is not used for resolving any symbol.
configure:24846: $? = 0
configure:24852: ./conftest
configure:24855: $? = 0
configure:24875: result: yes (version 2.12.13)
configure:25003: checking for bind_textdomain_codeset
configure:25099: result: yes
configure:25126: checking pwd.h usability
configure:25143: gcc -c -DG_DISABLE_DEPRECATED -g -O2 -Wall -I/usr/local/include conftest.c >&5
configure:25149: $? = 0
configure:25156: test -z "$ac_c_werror_flag" || test ! -s conftest.err
configure:25159: $? = 0
configure:25166: test -s conftest.o
configure:25169: $? = 0
configure:25180: result: yes
configure:25184: checking pwd.h presence
configure:25199: gcc -E -I/usr/local/include conftest.c
configure:25205: $? = 0
configure:25226: result: yes
configure:25259: checking for pwd.h
configure:25267: result: yes
configure:25298: checking sys/time.h usability
configure:25315: gcc -c -DG_DISABLE_DEPRECATED -g -O2 -Wall -I/usr/local/include conftest.c >&5
configure:25321: $? = 0
configure:25328: test -z "$ac_c_werror_flag" || test ! -s conftest.err
configure:25331: $? = 0
configure:25338: test -s conftest.o
configure:25341: $? = 0
configure:25352: result: yes
configure:25356: checking sys/time.h presence
configure:25371: gcc -E -I/usr/local/include conftest.c
configure:25377: $? = 0
configure:25398: result: yes
configure:25431: checking for sys/time.h
configure:25439: result: yes
configure:25460: checking for unistd.h
configure:25466: result: yes
configure:25843: checking for ANSI C header files
configure:26024: result: yes
configure:26036: checking for an ANSI C-conforming const
configure:26111: gcc -c -DG_DISABLE_DEPRECATED -g -O2 -Wall -I/usr/local/include conftest.c >&5
conftest.c: In function `main':
conftest.c:66: warning: `t' might be used uninitialized in this function
conftest.c:85: warning: `b' might be used uninitialized in this function
configure:26117: $? = 0
configure:26124: test -z "$ac_c_werror_flag" || test ! -s conftest.err
configure:26127: $? = 0
configure:26134: test -s conftest.o
configure:26137: $? = 0
configure:26149: result: yes
configure:26161: checking return type of signal handlers
configure:26189: gcc -c -DG_DISABLE_DEPRECATED -g -O2 -Wall -I/usr/local/include conftest.c >&5
conftest.c: In function `main':
conftest.c:46: error: void value not ignored as it ought to be
configure:26195: $? = 1
configure: failed program was:
| /* confdefs.h.  */
| #define PACKAGE_NAME "gtk+"
| #define PACKAGE_TARNAME "gtk+"
| #define PACKAGE_VERSION "2.10.13"
| #define PACKAGE_STRING "gtk+ 2.10.13"
| #define PACKAGE_BUGREPORT "http://bugzilla.gnome.org/enter_bug.cgi?product=gtk%2B"
| #define GETTEXT_PACKAGE "gtk20"
| #define STDC_HEADERS 1
| #define HAVE_SYS_TYPES_H 1
| #define HAVE_SYS_STAT_H 1
| #define HAVE_STDLIB_H 1
| #define HAVE_STRING_H 1
| #define HAVE_MEMORY_H 1
| #define HAVE_STRINGS_H 1
| #define HAVE_INTTYPES_H 1
| #define HAVE_UNISTD_H 1
| #define HAVE_DLFCN_H 1
| #define GTK_COMPILED_WITH_DEBUGGING "minimum"
| #define HAVE_LSTAT 1
| #define HAVE_MKSTEMP 1
| #define HAVE_FLOCKFILE 1
| #define HAVE_GETC_UNLOCKED 1
| #define HAVE_SIGSETJMP 1
| #define HAVE_LOCALE_H 1
| #define HAVE_LC_MESSAGES 1
| #define HAVE_BIND_TEXTDOMAIN_CODESET 1
| #define HAVE_GETTEXT 1
| #define HAVE_DCGETTEXT 1
| #define ENABLE_NLS 1
| #define GTK_LOCALEDIR "/usr/local/share/locale"
| #define HAVE_BIND_TEXTDOMAIN_CODESET 1
| #define HAVE_PWD_H 1
| #define HAVE_PWD_H 1
| #define HAVE_SYS_TIME_H 1
| #define HAVE_SYS_TIME_H 1
| #define HAVE_UNISTD_H 1
| #define HAVE_UNISTD_H 1
| #define STDC_HEADERS 1
| /* end confdefs.h.  */
| #include <sys/types.h>
| #include <signal.h>
| 
| int
| main ()
| {
| return *(signal (0, 0)) (0) == 1;
|   ;
|   return 0;
| }
configure:26227: result: void
configure:26241: checking for stdlib.h
configure:26247: result: yes
configure:26241: checking for unistd.h
configure:26247: result: yes
configure:26409: checking for getpagesize
configure:26465: gcc -o conftest -DG_DISABLE_DEPRECATED -g -O2 -Wall -I/usr/local/include -L/usr/local/lib conftest.c  -lintl  >&5
configure:26471: $? = 0
configure:26478: test -z "$ac_c_werror_flag" || test ! -s conftest.err
configure:26481: $? = 0
configure:26488: test -s conftest
configure:26491: $? = 0
configure:26505: result: yes
configure:26515: checking for working mmap
configure:26662: gcc -o conftest -DG_DISABLE_DEPRECATED -g -O2 -Wall -I/usr/local/include -L/usr/local/lib conftest.c  -lintl  >&5
configure:26665: $? = 0
configure:26671: ./conftest
configure:26674: $? = 0
configure:26690: result: yes
configure:26706: checking for mallinfo
configure:26762: gcc -o conftest -DG_DISABLE_DEPRECATED -g -O2 -Wall -I/usr/local/include -L/usr/local/lib conftest.c  -lintl  >&5
ld32: ERROR   33 : Unresolved text symbol "mallinfo" -- 1st referenced by /var/tmp//ccS2NuPe.o.
	Use linker option -v to see when and which objects, archives and dsos are loaded.  
ld32: INFO    152: Output file removed because of error.
collect2: ld returned 2 exit status
configure:26768: $? = 1
configure: failed program was:
| /* confdefs.h.  */
| #define PACKAGE_NAME "gtk+"
| #define PACKAGE_TARNAME "gtk+"
| #define PACKAGE_VERSION "2.10.13"
| #define PACKAGE_STRING "gtk+ 2.10.13"
| #define PACKAGE_BUGREPORT "http://bugzilla.gnome.org/enter_bug.cgi?product=gtk%2B"
| #define GETTEXT_PACKAGE "gtk20"
| #define STDC_HEADERS 1
| #define HAVE_SYS_TYPES_H 1
| #define HAVE_SYS_STAT_H 1
| #define HAVE_STDLIB_H 1
| #define HAVE_STRING_H 1
| #define HAVE_MEMORY_H 1
| #define HAVE_STRINGS_H 1
| #define HAVE_INTTYPES_H 1
| #define HAVE_UNISTD_H 1
| #define HAVE_DLFCN_H 1
| #define GTK_COMPILED_WITH_DEBUGGING "minimum"
| #define HAVE_LSTAT 1
| #define HAVE_MKSTEMP 1
| #define HAVE_FLOCKFILE 1
| #define HAVE_GETC_UNLOCKED 1
| #define HAVE_SIGSETJMP 1
| #define HAVE_LOCALE_H 1
| #define HAVE_LC_MESSAGES 1
| #define HAVE_BIND_TEXTDOMAIN_CODESET 1
| #define HAVE_GETTEXT 1
| #define HAVE_DCGETTEXT 1
| #define ENABLE_NLS 1
| #define GTK_LOCALEDIR "/usr/local/share/locale"
| #define HAVE_BIND_TEXTDOMAIN_CODESET 1
| #define HAVE_PWD_H 1
| #define HAVE_PWD_H 1
| #define HAVE_SYS_TIME_H 1
| #define HAVE_SYS_TIME_H 1
| #define HAVE_UNISTD_H 1
| #define HAVE_UNISTD_H 1
| #define STDC_HEADERS 1
| #define RETSIGTYPE void
| #define HAVE_STDLIB_H 1
| #define HAVE_UNISTD_H 1
| #define HAVE_GETPAGESIZE 1
| #define HAVE_MMAP 1
| /* end confdefs.h.  */
| /* Define mallinfo to an innocuous variant, in case <limits.h> declares mallinfo.
|    For example, HP-UX 11i <limits.h> declares gettimeofday.  */
| #define mallinfo innocuous_mallinfo
| 
| /* System header to define __stub macros and hopefully few prototypes,
|     which can conflict with char mallinfo (); below.
|     Prefer <limits.h> to <assert.h> if __STDC__ is defined, since
|     <limits.h> exists even on freestanding compilers.  */
| 
| #ifdef __STDC__
| # include <limits.h>
| #else
| # include <assert.h>
| #endif
| 
| #undef mallinfo
| 
| /* Override any GCC internal prototype to avoid an error.
|    Use char because int might match the return type of a GCC
|    builtin and then its argument prototype would still apply.  */
| #ifdef __cplusplus
| extern "C"
| #endif
| char mallinfo ();
| /* The GNU C library defines this for functions which it implements
|     to always fail with ENOSYS.  Some functions are actually named
|     something starting with __ and the normal name is an alias.  */
| #if defined __stub_mallinfo || defined __stub___mallinfo
| choke me
| #endif
| 
| int
| main ()
| {
| return mallinfo ();
|   ;
|   return 0;
| }
configure:26802: result: no
configure:26816: checking for getresuid
configure:26872: gcc -o conftest -DG_DISABLE_DEPRECATED -g -O2 -Wall -I/usr/local/include -L/usr/local/lib conftest.c  -lintl  >&5
ld32: ERROR   33 : Unresolved text symbol "getresuid" -- 1st referenced by /var/tmp//cc4PgFDd.o.
	Use linker option -v to see when and which objects, archives and dsos are loaded.  
ld32: INFO    152: Output file removed because of error.
collect2: ld returned 2 exit status
configure:26878: $? = 1
configure: failed program was:
| /* confdefs.h.  */
| #define PACKAGE_NAME "gtk+"
| #define PACKAGE_TARNAME "gtk+"
| #define PACKAGE_VERSION "2.10.13"
| #define PACKAGE_STRING "gtk+ 2.10.13"
| #define PACKAGE_BUGREPORT "http://bugzilla.gnome.org/enter_bug.cgi?product=gtk%2B"
| #define GETTEXT_PACKAGE "gtk20"
| #define STDC_HEADERS 1
| #define HAVE_SYS_TYPES_H 1
| #define HAVE_SYS_STAT_H 1
| #define HAVE_STDLIB_H 1
| #define HAVE_STRING_H 1
| #define HAVE_MEMORY_H 1
| #define HAVE_STRINGS_H 1
| #define HAVE_INTTYPES_H 1
| #define HAVE_UNISTD_H 1
| #define HAVE_DLFCN_H 1
| #define GTK_COMPILED_WITH_DEBUGGING "minimum"
| #define HAVE_LSTAT 1
| #define HAVE_MKSTEMP 1
| #define HAVE_FLOCKFILE 1
| #define HAVE_GETC_UNLOCKED 1
| #define HAVE_SIGSETJMP 1
| #define HAVE_LOCALE_H 1
| #define HAVE_LC_MESSAGES 1
| #define HAVE_BIND_TEXTDOMAIN_CODESET 1
| #define HAVE_GETTEXT 1
| #define HAVE_DCGETTEXT 1
| #define ENABLE_NLS 1
| #define GTK_LOCALEDIR "/usr/local/share/locale"
| #define HAVE_BIND_TEXTDOMAIN_CODESET 1
| #define HAVE_PWD_H 1
| #define HAVE_PWD_H 1
| #define HAVE_SYS_TIME_H 1
| #define HAVE_SYS_TIME_H 1
| #define HAVE_UNISTD_H 1
| #define HAVE_UNISTD_H 1
| #define STDC_HEADERS 1
| #define RETSIGTYPE void
| #define HAVE_STDLIB_H 1
| #define HAVE_UNISTD_H 1
| #define HAVE_GETPAGESIZE 1
| #define HAVE_MMAP 1
| /* end confdefs.h.  */
| /* Define getresuid to an innocuous variant, in case <limits.h> declares getresuid.
|    For example, HP-UX 11i <limits.h> declares gettimeofday.  */
| #define getresuid innocuous_getresuid
| 
| /* System header to define __stub macros and hopefully few prototypes,
|     which can conflict with char getresuid (); below.
|     Prefer <limits.h> to <assert.h> if __STDC__ is defined, since
|     <limits.h> exists even on freestanding compilers.  */
| 
| #ifdef __STDC__
| # include <limits.h>
| #else
| # include <assert.h>
| #endif
| 
| #undef getresuid
| 
| /* Override any GCC internal prototype to avoid an error.
|    Use char because int might match the return type of a GCC
|    builtin and then its argument prototype would still apply.  */
| #ifdef __cplusplus
| extern "C"
| #endif
| char getresuid ();
| /* The GNU C library defines this for functions which it implements
|     to always fail with ENOSYS.  Some functions are actually named
|     something starting with __ and the normal name is an alias.  */
| #if defined __stub_getresuid || defined __stub___getresuid
| choke me
| #endif
| 
| int
| main ()
| {
| return getresuid ();
|   ;
|   return 0;
| }
configure:26912: result: no
configure:26922: checking for uid_t in sys/types.h
configure:26945: result: yes
configure:26962: checking for fd_set
configure:26985: gcc -c -DG_DISABLE_DEPRECATED -g -O2 -Wall -I/usr/local/include conftest.c >&5
conftest.c: In function `main':
conftest.c:49: warning: unused variable `readMask'
conftest.c:49: warning: unused variable `writeMask'
configure:26991: $? = 0
configure:26998: test -z "$ac_c_werror_flag" || test ! -s conftest.err
configure:27001: $? = 0
configure:27008: test -s conftest.o
configure:27011: $? = 0
configure:27023: result: yes, found in sys/types.h
configure:27059: checking for wchar.h
configure:27074: gcc -E -I/usr/local/include conftest.c
configure:27080: $? = 0
configure:27108: result: yes
configure:27112: checking for wctype.h
configure:27127: gcc -E -I/usr/local/include conftest.c
configure:27133: $? = 0
configure:27161: result: yes
configure:27166: checking for iswalnum
configure:27222: gcc -o conftest -DG_DISABLE_DEPRECATED -g -O2 -Wall -I/usr/local/include -L/usr/local/lib conftest.c  -lintl  >&5
configure:27228: $? = 0
configure:27235: test -z "$ac_c_werror_flag" || test ! -s conftest.err
configure:27238: $? = 0
configure:27245: test -s conftest
configure:27248: $? = 0
configure:27261: result: yes
configure:27353: checking if iswalnum() and friends are properly defined
configure:27389: gcc -o conftest -DG_DISABLE_DEPRECATED -g -O2 -Wall -I/usr/local/include -L/usr/local/lib conftest.c  -lintl   >&5
configure:27395: $? = 0
configure:27402: test -z "$ac_c_werror_flag" || test ! -s conftest.err
configure:27405: $? = 0
configure:27412: test -s conftest
configure:27415: $? = 0
configure:27437: result: yes
configure:27442: checking for uxtheme.h
configure:27457: gcc -E -I/usr/local/include conftest.c
conftest.c:47:21: uxtheme.h: No such file or directory
configure:27463: $? = 1
configure: failed program was:
| /* confdefs.h.  */
| #define PACKAGE_NAME "gtk+"
| #define PACKAGE_TARNAME "gtk+"
| #define PACKAGE_VERSION "2.10.13"
| #define PACKAGE_STRING "gtk+ 2.10.13"
| #define PACKAGE_BUGREPORT "http://bugzilla.gnome.org/enter_bug.cgi?product=gtk%2B"
| #define GETTEXT_PACKAGE "gtk20"
| #define STDC_HEADERS 1
| #define HAVE_SYS_TYPES_H 1
| #define HAVE_SYS_STAT_H 1
| #define HAVE_STDLIB_H 1
| #define HAVE_STRING_H 1
| #define HAVE_MEMORY_H 1
| #define HAVE_STRINGS_H 1
| #define HAVE_INTTYPES_H 1
| #define HAVE_UNISTD_H 1
| #define HAVE_DLFCN_H 1
| #define GTK_COMPILED_WITH_DEBUGGING "minimum"
| #define HAVE_LSTAT 1
| #define HAVE_MKSTEMP 1
| #define HAVE_FLOCKFILE 1
| #define HAVE_GETC_UNLOCKED 1
| #define HAVE_SIGSETJMP 1
| #define HAVE_LOCALE_H 1
| #define HAVE_LC_MESSAGES 1
| #define HAVE_BIND_TEXTDOMAIN_CODESET 1
| #define HAVE_GETTEXT 1
| #define HAVE_DCGETTEXT 1
| #define ENABLE_NLS 1
| #define GTK_LOCALEDIR "/usr/local/share/locale"
| #define HAVE_BIND_TEXTDOMAIN_CODESET 1
| #define HAVE_PWD_H 1
| #define HAVE_PWD_H 1
| #define HAVE_SYS_TIME_H 1
| #define HAVE_SYS_TIME_H 1
| #define HAVE_UNISTD_H 1
| #define HAVE_UNISTD_H 1
| #define STDC_HEADERS 1
| #define RETSIGTYPE void
| #define HAVE_STDLIB_H 1
| #define HAVE_UNISTD_H 1
| #define HAVE_GETPAGESIZE 1
| #define HAVE_MMAP 1
| #define HAVE_WCHAR_H 1
| #define HAVE_WCTYPE_H 1
| /* end confdefs.h.  */
| #include <uxtheme.h>
configure:27491: result: no
configure:27511: checking crt_externs.h usability
configure:27528: gcc -c -DG_DISABLE_DEPRECATED -g -O2 -Wall -I/usr/local/include conftest.c >&5
conftest.c:80:25: crt_externs.h: No such file or directory
configure:27534: $? = 1
configure: failed program was:
| /* confdefs.h.  */
| #define PACKAGE_NAME "gtk+"
| #define PACKAGE_TARNAME "gtk+"
| #define PACKAGE_VERSION "2.10.13"
| #define PACKAGE_STRING "gtk+ 2.10.13"
| #define PACKAGE_BUGREPORT "http://bugzilla.gnome.org/enter_bug.cgi?product=gtk%2B"
| #define GETTEXT_PACKAGE "gtk20"
| #define STDC_HEADERS 1
| #define HAVE_SYS_TYPES_H 1
| #define HAVE_SYS_STAT_H 1
| #define HAVE_STDLIB_H 1
| #define HAVE_STRING_H 1
| #define HAVE_MEMORY_H 1
| #define HAVE_STRINGS_H 1
| #define HAVE_INTTYPES_H 1
| #define HAVE_UNISTD_H 1
| #define HAVE_DLFCN_H 1
| #define GTK_COMPILED_WITH_DEBUGGING "minimum"
| #define HAVE_LSTAT 1
| #define HAVE_MKSTEMP 1
| #define HAVE_FLOCKFILE 1
| #define HAVE_GETC_UNLOCKED 1
| #define HAVE_SIGSETJMP 1
| #define HAVE_LOCALE_H 1
| #define HAVE_LC_MESSAGES 1
| #define HAVE_BIND_TEXTDOMAIN_CODESET 1
| #define HAVE_GETTEXT 1
| #define HAVE_DCGETTEXT 1
| #define ENABLE_NLS 1
| #define GTK_LOCALEDIR "/usr/local/share/locale"
| #define HAVE_BIND_TEXTDOMAIN_CODESET 1
| #define HAVE_PWD_H 1
| #define HAVE_PWD_H 1
| #define HAVE_SYS_TIME_H 1
| #define HAVE_SYS_TIME_H 1
| #define HAVE_UNISTD_H 1
| #define HAVE_UNISTD_H 1
| #define STDC_HEADERS 1
| #define RETSIGTYPE void
| #define HAVE_STDLIB_H 1
| #define HAVE_UNISTD_H 1
| #define HAVE_GETPAGESIZE 1
| #define HAVE_MMAP 1
| #define HAVE_WCHAR_H 1
| #define HAVE_WCTYPE_H 1
| /* end confdefs.h.  */
| #include <stdio.h>
| #if HAVE_SYS_TYPES_H
| # include <sys/types.h>
| #endif
| #if HAVE_SYS_STAT_H
| # include <sys/stat.h>
| #endif
| #if STDC_HEADERS
| # include <stdlib.h>
| # include <stddef.h>
| #else
| # if HAVE_STDLIB_H
| #  include <stdlib.h>
| # endif
| #endif
| #if HAVE_STRING_H
| # if !STDC_HEADERS && HAVE_MEMORY_H
| #  include <memory.h>
| # endif
| # include <string.h>
| #endif
| #if HAVE_STRINGS_H
| # include <strings.h>
| #endif
| #if HAVE_INTTYPES_H
| # include <inttypes.h>
| #endif
| #if HAVE_STDINT_H
| # include <stdint.h>
| #endif
| #if HAVE_UNISTD_H
| # include <unistd.h>
| #endif
| #include <crt_externs.h>
configure:27565: result: no
configure:27569: checking crt_externs.h presence
configure:27584: gcc -E -I/usr/local/include conftest.c
conftest.c:47:25: crt_externs.h: No such file or directory
configure:27590: $? = 1
configure: failed program was:
| /* confdefs.h.  */
| #define PACKAGE_NAME "gtk+"
| #define PACKAGE_TARNAME "gtk+"
| #define PACKAGE_VERSION "2.10.13"
| #define PACKAGE_STRING "gtk+ 2.10.13"
| #define PACKAGE_BUGREPORT "http://bugzilla.gnome.org/enter_bug.cgi?product=gtk%2B"
| #define GETTEXT_PACKAGE "gtk20"
| #define STDC_HEADERS 1
| #define HAVE_SYS_TYPES_H 1
| #define HAVE_SYS_STAT_H 1
| #define HAVE_STDLIB_H 1
| #define HAVE_STRING_H 1
| #define HAVE_MEMORY_H 1
| #define HAVE_STRINGS_H 1
| #define HAVE_INTTYPES_H 1
| #define HAVE_UNISTD_H 1
| #define HAVE_DLFCN_H 1
| #define GTK_COMPILED_WITH_DEBUGGING "minimum"
| #define HAVE_LSTAT 1
| #define HAVE_MKSTEMP 1
| #define HAVE_FLOCKFILE 1
| #define HAVE_GETC_UNLOCKED 1
| #define HAVE_SIGSETJMP 1
| #define HAVE_LOCALE_H 1
| #define HAVE_LC_MESSAGES 1
| #define HAVE_BIND_TEXTDOMAIN_CODESET 1
| #define HAVE_GETTEXT 1
| #define HAVE_DCGETTEXT 1
| #define ENABLE_NLS 1
| #define GTK_LOCALEDIR "/usr/local/share/locale"
| #define HAVE_BIND_TEXTDOMAIN_CODESET 1
| #define HAVE_PWD_H 1
| #define HAVE_PWD_H 1
| #define HAVE_SYS_TIME_H 1
| #define HAVE_SYS_TIME_H 1
| #define HAVE_UNISTD_H 1
| #define HAVE_UNISTD_H 1
| #define STDC_HEADERS 1
| #define RETSIGTYPE void
| #define HAVE_STDLIB_H 1
| #define HAVE_UNISTD_H 1
| #define HAVE_GETPAGESIZE 1
| #define HAVE_MMAP 1
| #define HAVE_WCHAR_H 1
| #define HAVE_WCTYPE_H 1
| /* end confdefs.h.  */
| #include <crt_externs.h>
configure:27611: result: no
configure:27644: checking for crt_externs.h
configure:27652: result: no
configure:27669: checking for _NSGetEnviron
configure:27725: gcc -o conftest -DG_DISABLE_DEPRECATED -g -O2 -Wall -I/usr/local/include -L/usr/local/lib conftest.c  -lintl  >&5
ld32: ERROR   33 : Unresolved text symbol "_NSGetEnviron" -- 1st referenced by /var/tmp//ccQ4sYxd.o.
	Use linker option -v to see when and which objects, archives and dsos are loaded.  
ld32: INFO    152: Output file removed because of error.
collect2: ld returned 2 exit status
configure:27731: $? = 1
configure: failed program was:
| /* confdefs.h.  */
| #define PACKAGE_NAME "gtk+"
| #define PACKAGE_TARNAME "gtk+"
| #define PACKAGE_VERSION "2.10.13"
| #define PACKAGE_STRING "gtk+ 2.10.13"
| #define PACKAGE_BUGREPORT "http://bugzilla.gnome.org/enter_bug.cgi?product=gtk%2B"
| #define GETTEXT_PACKAGE "gtk20"
| #define STDC_HEADERS 1
| #define HAVE_SYS_TYPES_H 1
| #define HAVE_SYS_STAT_H 1
| #define HAVE_STDLIB_H 1
| #define HAVE_STRING_H 1
| #define HAVE_MEMORY_H 1
| #define HAVE_STRINGS_H 1
| #define HAVE_INTTYPES_H 1
| #define HAVE_UNISTD_H 1
| #define HAVE_DLFCN_H 1
| #define GTK_COMPILED_WITH_DEBUGGING "minimum"
| #define HAVE_LSTAT 1
| #define HAVE_MKSTEMP 1
| #define HAVE_FLOCKFILE 1
| #define HAVE_GETC_UNLOCKED 1
| #define HAVE_SIGSETJMP 1
| #define HAVE_LOCALE_H 1
| #define HAVE_LC_MESSAGES 1
| #define HAVE_BIND_TEXTDOMAIN_CODESET 1
| #define HAVE_GETTEXT 1
| #define HAVE_DCGETTEXT 1
| #define ENABLE_NLS 1
| #define GTK_LOCALEDIR "/usr/local/share/locale"
| #define HAVE_BIND_TEXTDOMAIN_CODESET 1
| #define HAVE_PWD_H 1
| #define HAVE_PWD_H 1
| #define HAVE_SYS_TIME_H 1
| #define HAVE_SYS_TIME_H 1
| #define HAVE_UNISTD_H 1
| #define HAVE_UNISTD_H 1
| #define STDC_HEADERS 1
| #define RETSIGTYPE void
| #define HAVE_STDLIB_H 1
| #define HAVE_UNISTD_H 1
| #define HAVE_GETPAGESIZE 1
| #define HAVE_MMAP 1
| #define HAVE_WCHAR_H 1
| #define HAVE_WCTYPE_H 1
| /* end confdefs.h.  */
| /* Define _NSGetEnviron to an innocuous variant, in case <limits.h> declares _NSGetEnviron.
|    For example, HP-UX 11i <limits.h> declares gettimeofday.  */
| #define _NSGetEnviron innocuous__NSGetEnviron
| 
| /* System header to define __stub macros and hopefully few prototypes,
|     which can conflict with char _NSGetEnviron (); below.
|     Prefer <limits.h> to <assert.h> if __STDC__ is defined, since
|     <limits.h> exists even on freestanding compilers.  */
| 
| #ifdef __STDC__
| # include <limits.h>
| #else
| # include <assert.h>
| #endif
| 
| #undef _NSGetEnviron
| 
| /* Override any GCC internal prototype to avoid an error.
|    Use char because int might match the return type of a GCC
|    builtin and then its argument prototype would still apply.  */
| #ifdef __cplusplus
| extern "C"
| #endif
| char _NSGetEnviron ();
| /* The GNU C library defines this for functions which it implements
|     to always fail with ENOSYS.  Some functions are actually named
|     something starting with __ and the normal name is an alias.  */
| #if defined __stub__NSGetEnviron || defined __stub____NSGetEnviron
| choke me
| #endif
| 
| int
| main ()
| {
| return _NSGetEnviron ();
|   ;
|   return 0;
| }
configure:27765: result: no
configure:27795: checking whether to build gmodulized gdk-pixbuf
configure:27810: result: yes
configure:27812: checking whether dynamic modules work
configure:27837: result: yes
configure:27866: checking for TIFFReadScanline in -ltiff
configure:27901: gcc -o conftest -DG_DISABLE_DEPRECATED -g -O2 -Wall -I/usr/local/include -L/usr/local/lib conftest.c -ltiff -lm  -lintl  >&5
configure:27907: $? = 0
configure:27914: test -z "$ac_c_werror_flag" || test ! -s conftest.err
configure:27917: $? = 0
configure:27924: test -s conftest
configure:27927: $? = 0
configure:27941: result: yes
configure:27954: checking tiffio.h usability
configure:27971: gcc -c -DG_DISABLE_DEPRECATED -g -O2 -Wall -I/usr/local/include conftest.c >&5
configure:27977: $? = 0
configure:27984: test -z "$ac_c_werror_flag" || test ! -s conftest.err
configure:27987: $? = 0
configure:27994: test -s conftest.o
configure:27997: $? = 0
configure:28008: result: yes
configure:28012: checking tiffio.h presence
configure:28027: gcc -E -I/usr/local/include conftest.c
configure:28033: $? = 0
configure:28054: result: yes
configure:28087: checking for tiffio.h
configure:28094: result: yes
configure:28612: checking for jpeg_destroy_decompress in -ljpeg
configure:28647: gcc -o conftest -DG_DISABLE_DEPRECATED -g -O2 -Wall -I/usr/local/include -L/usr/local/lib conftest.c -ljpeg   -lintl  >&5
configure:28653: $? = 0
configure:28660: test -z "$ac_c_werror_flag" || test ! -s conftest.err
configure:28663: $? = 0
configure:28670: test -s conftest
configure:28673: $? = 0
configure:28687: result: yes
configure:28698: checking for jpeglib.h
configure:28717: gcc -E -I/usr/local/include conftest.c
configure:28723: $? = 0
configure:28744: result: yes
configure:28748: checking for jpeg_simple_progression in -ljpeg
configure:28783: gcc -o conftest -DG_DISABLE_DEPRECATED -g -O2 -Wall -I/usr/local/include -L/usr/local/lib conftest.c -ljpeg   -lintl  >&5
configure:28789: $? = 0
configure:28796: test -z "$ac_c_werror_flag" || test ! -s conftest.err
configure:28799: $? = 0
configure:28806: test -s conftest
configure:28809: $? = 0
configure:28823: result: yes
configure:28855: checking for libpng12
configure:28858: result: yes
configure:29218: checking pixbuf loaders to build
configure:29246: result: 
configure:29269: checking for sys/wait.h that is POSIX.1 compatible
configure:29305: gcc -c -DG_DISABLE_DEPRECATED -g -O2 -Wall -I/usr/local/include conftest.c >&5
configure:29311: $? = 0
configure:29318: test -z "$ac_c_werror_flag" || test ! -s conftest.err
configure:29321: $? = 0
configure:29328: test -s conftest.o
configure:29331: $? = 0
configure:29343: result: yes
configure:29354: checking return type of signal handlers
configure:29420: result: void
configure:29481: checking for x86 platform
configure:29490: result: no
configure:29721: checking for X
configure:29898: gcc -o conftest -DG_DISABLE_DEPRECATED -g -O2 -Wall -I/usr/local/include -L/usr/local/lib conftest.c -lXt  -lintl  >&5
ld32: WARNING 84 : /usr/lib32/libXt.so is not used for resolving any symbol.
ld32: ERROR   33 : Unresolved text symbol "XrmInitialize" -- 1st referenced by /var/tmp//ccdwKlPd.o.
	Use linker option -v to see when and which objects, archives and dsos are loaded.  
ld32: INFO    152: Output file removed because of error.
collect2: ld returned 2 exit status
configure:29904: $? = 1
configure: failed program was:
| /* confdefs.h.  */
| #define PACKAGE_NAME "gtk+"
| #define PACKAGE_TARNAME "gtk+"
| #define PACKAGE_VERSION "2.10.13"
| #define PACKAGE_STRING "gtk+ 2.10.13"
| #define PACKAGE_BUGREPORT "http://bugzilla.gnome.org/enter_bug.cgi?product=gtk%2B"
| #define GETTEXT_PACKAGE "gtk20"
| #define STDC_HEADERS 1
| #define HAVE_SYS_TYPES_H 1
| #define HAVE_SYS_STAT_H 1
| #define HAVE_STDLIB_H 1
| #define HAVE_STRING_H 1
| #define HAVE_MEMORY_H 1
| #define HAVE_STRINGS_H 1
| #define HAVE_INTTYPES_H 1
| #define HAVE_UNISTD_H 1
| #define HAVE_DLFCN_H 1
| #define GTK_COMPILED_WITH_DEBUGGING "minimum"
| #define HAVE_LSTAT 1
| #define HAVE_MKSTEMP 1
| #define HAVE_FLOCKFILE 1
| #define HAVE_GETC_UNLOCKED 1
| #define HAVE_SIGSETJMP 1
| #define HAVE_LOCALE_H 1
| #define HAVE_LC_MESSAGES 1
| #define HAVE_BIND_TEXTDOMAIN_CODESET 1
| #define HAVE_GETTEXT 1
| #define HAVE_DCGETTEXT 1
| #define ENABLE_NLS 1
| #define GTK_LOCALEDIR "/usr/local/share/locale"
| #define HAVE_BIND_TEXTDOMAIN_CODESET 1
| #define HAVE_PWD_H 1
| #define HAVE_PWD_H 1
| #define HAVE_SYS_TIME_H 1
| #define HAVE_SYS_TIME_H 1
| #define HAVE_UNISTD_H 1
| #define HAVE_UNISTD_H 1
| #define STDC_HEADERS 1
| #define RETSIGTYPE void
| #define HAVE_STDLIB_H 1
| #define HAVE_UNISTD_H 1
| #define HAVE_GETPAGESIZE 1
| #define HAVE_MMAP 1
| #define HAVE_WCHAR_H 1
| #define HAVE_WCTYPE_H 1
| #define USE_GMODULE 1
| #define HAVE_PROGRESSIVE_JPEG 1
| #define HAVE_SYS_WAIT_H 1
| #define RETSIGTYPE void
| /* end confdefs.h.  */
| #include <X11/Xlib.h>
| int
| main ()
| {
| XrmInitialize ()
|   ;
|   return 0;
| }
configure:29979: result: libraries /usr/lib, headers 
configure:30182: gcc -o conftest -DG_DISABLE_DEPRECATED -g -O2 -Wall -I/usr/local/include -L/usr/local/lib conftest.c  -lintl   -L/usr/lib -lX11 >&5
ld32: FATAL   12 : Expecting n32 objects: /usr/lib/libX11.so is o32.
collect2: ld returned 4 exit status
configure:30188: $? = 1
configure: failed program was:
| /* confdefs.h.  */
| #define PACKAGE_NAME "gtk+"
| #define PACKAGE_TARNAME "gtk+"
| #define PACKAGE_VERSION "2.10.13"
| #define PACKAGE_STRING "gtk+ 2.10.13"
| #define PACKAGE_BUGREPORT "http://bugzilla.gnome.org/enter_bug.cgi?product=gtk%2B"
| #define GETTEXT_PACKAGE "gtk20"
| #define STDC_HEADERS 1
| #define HAVE_SYS_TYPES_H 1
| #define HAVE_SYS_STAT_H 1
| #define HAVE_STDLIB_H 1
| #define HAVE_STRING_H 1
| #define HAVE_MEMORY_H 1
| #define HAVE_STRINGS_H 1
| #define HAVE_INTTYPES_H 1
| #define HAVE_UNISTD_H 1
| #define HAVE_DLFCN_H 1
| #define GTK_COMPILED_WITH_DEBUGGING "minimum"
| #define HAVE_LSTAT 1
| #define HAVE_MKSTEMP 1
| #define HAVE_FLOCKFILE 1
| #define HAVE_GETC_UNLOCKED 1
| #define HAVE_SIGSETJMP 1
| #define HAVE_LOCALE_H 1
| #define HAVE_LC_MESSAGES 1
| #define HAVE_BIND_TEXTDOMAIN_CODESET 1
| #define HAVE_GETTEXT 1
| #define HAVE_DCGETTEXT 1
| #define ENABLE_NLS 1
| #define GTK_LOCALEDIR "/usr/local/share/locale"
| #define HAVE_BIND_TEXTDOMAIN_CODESET 1
| #define HAVE_PWD_H 1
| #define HAVE_PWD_H 1
| #define HAVE_SYS_TIME_H 1
| #define HAVE_SYS_TIME_H 1
| #define HAVE_UNISTD_H 1
| #define HAVE_UNISTD_H 1
| #define STDC_HEADERS 1
| #define RETSIGTYPE void
| #define HAVE_STDLIB_H 1
| #define HAVE_UNISTD_H 1
| #define HAVE_GETPAGESIZE 1
| #define HAVE_MMAP 1
| #define HAVE_WCHAR_H 1
| #define HAVE_WCTYPE_H 1
| #define USE_GMODULE 1
| #define HAVE_PROGRESSIVE_JPEG 1
| #define HAVE_SYS_WAIT_H 1
| #define RETSIGTYPE void
| /* end confdefs.h.  */
| 
| /* Override any GCC internal prototype to avoid an error.
|    Use char because int might match the return type of a GCC
|    builtin and then its argument prototype would still apply.  */
| #ifdef __cplusplus
| extern "C"
| #endif
| char XOpenDisplay ();
| int
| main ()
| {
| return XOpenDisplay ();
|   ;
|   return 0;
| }
configure:30215: checking for dnet_ntoa in -ldnet
configure:30250: gcc -o conftest -DG_DISABLE_DEPRECATED -g -O2 -Wall -I/usr/local/include -L/usr/local/lib conftest.c -ldnet   -lintl   -L/usr/lib -lX11 >&5
ld32: FATAL   9  : I/O error (-ldnet): No such file or directory
collect2: ld returned 32 exit status
configure:30256: $? = 1
configure: failed program was:
| /* confdefs.h.  */
| #define PACKAGE_NAME "gtk+"
| #define PACKAGE_TARNAME "gtk+"
| #define PACKAGE_VERSION "2.10.13"
| #define PACKAGE_STRING "gtk+ 2.10.13"
| #define PACKAGE_BUGREPORT "http://bugzilla.gnome.org/enter_bug.cgi?product=gtk%2B"
| #define GETTEXT_PACKAGE "gtk20"
| #define STDC_HEADERS 1
| #define HAVE_SYS_TYPES_H 1
| #define HAVE_SYS_STAT_H 1
| #define HAVE_STDLIB_H 1
| #define HAVE_STRING_H 1
| #define HAVE_MEMORY_H 1
| #define HAVE_STRINGS_H 1
| #define HAVE_INTTYPES_H 1
| #define HAVE_UNISTD_H 1
| #define HAVE_DLFCN_H 1
| #define GTK_COMPILED_WITH_DEBUGGING "minimum"
| #define HAVE_LSTAT 1
| #define HAVE_MKSTEMP 1
| #define HAVE_FLOCKFILE 1
| #define HAVE_GETC_UNLOCKED 1
| #define HAVE_SIGSETJMP 1
| #define HAVE_LOCALE_H 1
| #define HAVE_LC_MESSAGES 1
| #define HAVE_BIND_TEXTDOMAIN_CODESET 1
| #define HAVE_GETTEXT 1
| #define HAVE_DCGETTEXT 1
| #define ENABLE_NLS 1
| #define GTK_LOCALEDIR "/usr/local/share/locale"
| #define HAVE_BIND_TEXTDOMAIN_CODESET 1
| #define HAVE_PWD_H 1
| #define HAVE_PWD_H 1
| #define HAVE_SYS_TIME_H 1
| #define HAVE_SYS_TIME_H 1
| #define HAVE_UNISTD_H 1
| #define HAVE_UNISTD_H 1
| #define STDC_HEADERS 1
| #define RETSIGTYPE void
| #define HAVE_STDLIB_H 1
| #define HAVE_UNISTD_H 1
| #define HAVE_GETPAGESIZE 1
| #define HAVE_MMAP 1
| #define HAVE_WCHAR_H 1
| #define HAVE_WCTYPE_H 1
| #define USE_GMODULE 1
| #define HAVE_PROGRESSIVE_JPEG 1
| #define HAVE_SYS_WAIT_H 1
| #define RETSIGTYPE void
| /* end confdefs.h.  */
| 
| /* Override any GCC internal prototype to avoid an error.
|    Use char because int might match the return type of a GCC
|    builtin and then its argument prototype would still apply.  */
| #ifdef __cplusplus
| extern "C"
| #endif
| char dnet_ntoa ();
| int
| main ()
| {
| return dnet_ntoa ();
|   ;
|   return 0;
| }
configure:30290: result: no
configure:30297: checking for dnet_ntoa in -ldnet_stub
configure:30332: gcc -o conftest -DG_DISABLE_DEPRECATED -g -O2 -Wall -I/usr/local/include -L/usr/local/lib conftest.c -ldnet_stub   -lintl   -L/usr/lib -lX11 >&5
ld32: FATAL   9  : I/O error (-ldnet_stub): No such file or directory
collect2: ld returned 32 exit status
configure:30338: $? = 1
configure: failed program was:
| /* confdefs.h.  */
| #define PACKAGE_NAME "gtk+"
| #define PACKAGE_TARNAME "gtk+"
| #define PACKAGE_VERSION "2.10.13"
| #define PACKAGE_STRING "gtk+ 2.10.13"
| #define PACKAGE_BUGREPORT "http://bugzilla.gnome.org/enter_bug.cgi?product=gtk%2B"
| #define GETTEXT_PACKAGE "gtk20"
| #define STDC_HEADERS 1
| #define HAVE_SYS_TYPES_H 1
| #define HAVE_SYS_STAT_H 1
| #define HAVE_STDLIB_H 1
| #define HAVE_STRING_H 1
| #define HAVE_MEMORY_H 1
| #define HAVE_STRINGS_H 1
| #define HAVE_INTTYPES_H 1
| #define HAVE_UNISTD_H 1
| #define HAVE_DLFCN_H 1
| #define GTK_COMPILED_WITH_DEBUGGING "minimum"
| #define HAVE_LSTAT 1
| #define HAVE_MKSTEMP 1
| #define HAVE_FLOCKFILE 1
| #define HAVE_GETC_UNLOCKED 1
| #define HAVE_SIGSETJMP 1
| #define HAVE_LOCALE_H 1
| #define HAVE_LC_MESSAGES 1
| #define HAVE_BIND_TEXTDOMAIN_CODESET 1
| #define HAVE_GETTEXT 1
| #define HAVE_DCGETTEXT 1
| #define ENABLE_NLS 1
| #define GTK_LOCALEDIR "/usr/local/share/locale"
| #define HAVE_BIND_TEXTDOMAIN_CODESET 1
| #define HAVE_PWD_H 1
| #define HAVE_PWD_H 1
| #define HAVE_SYS_TIME_H 1
| #define HAVE_SYS_TIME_H 1
| #define HAVE_UNISTD_H 1
| #define HAVE_UNISTD_H 1
| #define STDC_HEADERS 1
| #define RETSIGTYPE void
| #define HAVE_STDLIB_H 1
| #define HAVE_UNISTD_H 1
| #define HAVE_GETPAGESIZE 1
| #define HAVE_MMAP 1
| #define HAVE_WCHAR_H 1
| #define HAVE_WCTYPE_H 1
| #define USE_GMODULE 1
| #define HAVE_PROGRESSIVE_JPEG 1
| #define HAVE_SYS_WAIT_H 1
| #define RETSIGTYPE void
| /* end confdefs.h.  */
| 
| /* Override any GCC internal prototype to avoid an error.
|    Use char because int might match the return type of a GCC
|    builtin and then its argument prototype would still apply.  */
| #ifdef __cplusplus
| extern "C"
| #endif
| char dnet_ntoa ();
| int
| main ()
| {
| return dnet_ntoa ();
|   ;
|   return 0;
| }
configure:30372: result: no
configure:30393: checking for gethostbyname
configure:30449: gcc -o conftest -DG_DISABLE_DEPRECATED -g -O2 -Wall -I/usr/local/include -L/usr/local/lib conftest.c  -lintl  >&5
configure:30455: $? = 0
configure:30462: test -z "$ac_c_werror_flag" || test ! -s conftest.err
configure:30465: $? = 0
configure:30472: test -s conftest
configure:30475: $? = 0
configure:30488: result: yes
configure:30665: checking for connect
configure:30721: gcc -o conftest -DG_DISABLE_DEPRECATED -g -O2 -Wall -I/usr/local/include -L/usr/local/lib conftest.c  -lintl  >&5
configure:30727: $? = 0
configure:30734: test -z "$ac_c_werror_flag" || test ! -s conftest.err
configure:30737: $? = 0
configure:30744: test -s conftest
configure:30747: $? = 0
configure:30760: result: yes
configure:30848: checking for remove
configure:30904: gcc -o conftest -DG_DISABLE_DEPRECATED -g -O2 -Wall -I/usr/local/include -L/usr/local/lib conftest.c  -lintl  >&5
configure:30910: $? = 0
configure:30917: test -z "$ac_c_werror_flag" || test ! -s conftest.err
configure:30920: $? = 0
configure:30927: test -s conftest
configure:30930: $? = 0
configure:30943: result: yes
configure:31031: checking for shmat
configure:31087: gcc -o conftest -DG_DISABLE_DEPRECATED -g -O2 -Wall -I/usr/local/include -L/usr/local/lib conftest.c  -lintl  >&5
configure:31093: $? = 0
configure:31100: test -z "$ac_c_werror_flag" || test ! -s conftest.err
configure:31103: $? = 0
configure:31110: test -s conftest
configure:31113: $? = 0
configure:31126: result: yes
configure:31223: checking for IceConnectionNumber in -lICE
configure:31258: gcc -o conftest -DG_DISABLE_DEPRECATED -g -O2 -Wall -I/usr/local/include -L/usr/local/lib -L/usr/lib conftest.c -lICE   -lintl  >&5
ld32: FATAL   12 : Expecting n32 objects: /usr/lib/libICE.so is o32.
collect2: ld returned 4 exit status
configure:31264: $? = 1
configure: failed program was:
| /* confdefs.h.  */
| #define PACKAGE_NAME "gtk+"
| #define PACKAGE_TARNAME "gtk+"
| #define PACKAGE_VERSION "2.10.13"
| #define PACKAGE_STRING "gtk+ 2.10.13"
| #define PACKAGE_BUGREPORT "http://bugzilla.gnome.org/enter_bug.cgi?product=gtk%2B"
| #define GETTEXT_PACKAGE "gtk20"
| #define STDC_HEADERS 1
| #define HAVE_SYS_TYPES_H 1
| #define HAVE_SYS_STAT_H 1
| #define HAVE_STDLIB_H 1
| #define HAVE_STRING_H 1
| #define HAVE_MEMORY_H 1
| #define HAVE_STRINGS_H 1
| #define HAVE_INTTYPES_H 1
| #define HAVE_UNISTD_H 1
| #define HAVE_DLFCN_H 1
| #define GTK_COMPILED_WITH_DEBUGGING "minimum"
| #define HAVE_LSTAT 1
| #define HAVE_MKSTEMP 1
| #define HAVE_FLOCKFILE 1
| #define HAVE_GETC_UNLOCKED 1
| #define HAVE_SIGSETJMP 1
| #define HAVE_LOCALE_H 1
| #define HAVE_LC_MESSAGES 1
| #define HAVE_BIND_TEXTDOMAIN_CODESET 1
| #define HAVE_GETTEXT 1
| #define HAVE_DCGETTEXT 1
| #define ENABLE_NLS 1
| #define GTK_LOCALEDIR "/usr/local/share/locale"
| #define HAVE_BIND_TEXTDOMAIN_CODESET 1
| #define HAVE_PWD_H 1
| #define HAVE_PWD_H 1
| #define HAVE_SYS_TIME_H 1
| #define HAVE_SYS_TIME_H 1
| #define HAVE_UNISTD_H 1
| #define HAVE_UNISTD_H 1
| #define STDC_HEADERS 1
| #define RETSIGTYPE void
| #define HAVE_STDLIB_H 1
| #define HAVE_UNISTD_H 1
| #define HAVE_GETPAGESIZE 1
| #define HAVE_MMAP 1
| #define HAVE_WCHAR_H 1
| #define HAVE_WCTYPE_H 1
| #define USE_GMODULE 1
| #define HAVE_PROGRESSIVE_JPEG 1
| #define HAVE_SYS_WAIT_H 1
| #define RETSIGTYPE void
| /* end confdefs.h.  */
| 
| /* Override any GCC internal prototype to avoid an error.
|    Use char because int might match the return type of a GCC
|    builtin and then its argument prototype would still apply.  */
| #ifdef __cplusplus
| extern "C"
| #endif
| char IceConnectionNumber ();
| int
| main ()
| {
| return IceConnectionNumber ();
|   ;
|   return 0;
| }
configure:31298: result: no
configure:31334: checking for XOpenDisplay
configure:31390: gcc -o conftest -DG_DISABLE_DEPRECATED -g -O2 -Wall -I/usr/local/include  -L/usr/local/lib conftest.c  -L/usr/lib -lXext -lXrender -lX11   -lintl  >&5
ld32: FATAL   12 : Expecting n32 objects: /usr/lib/libXext.so is o32.
collect2: ld returned 4 exit status
configure:31396: $? = 1
configure: failed program was:
| /* confdefs.h.  */
| #define PACKAGE_NAME "gtk+"
| #define PACKAGE_TARNAME "gtk+"
| #define PACKAGE_VERSION "2.10.13"
| #define PACKAGE_STRING "gtk+ 2.10.13"
| #define PACKAGE_BUGREPORT "http://bugzilla.gnome.org/enter_bug.cgi?product=gtk%2B"
| #define GETTEXT_PACKAGE "gtk20"
| #define STDC_HEADERS 1
| #define HAVE_SYS_TYPES_H 1
| #define HAVE_SYS_STAT_H 1
| #define HAVE_STDLIB_H 1
| #define HAVE_STRING_H 1
| #define HAVE_MEMORY_H 1
| #define HAVE_STRINGS_H 1
| #define HAVE_INTTYPES_H 1
| #define HAVE_UNISTD_H 1
| #define HAVE_DLFCN_H 1
| #define GTK_COMPILED_WITH_DEBUGGING "minimum"
| #define HAVE_LSTAT 1
| #define HAVE_MKSTEMP 1
| #define HAVE_FLOCKFILE 1
| #define HAVE_GETC_UNLOCKED 1
| #define HAVE_SIGSETJMP 1
| #define HAVE_LOCALE_H 1
| #define HAVE_LC_MESSAGES 1
| #define HAVE_BIND_TEXTDOMAIN_CODESET 1
| #define HAVE_GETTEXT 1
| #define HAVE_DCGETTEXT 1
| #define ENABLE_NLS 1
| #define GTK_LOCALEDIR "/usr/local/share/locale"
| #define HAVE_BIND_TEXTDOMAIN_CODESET 1
| #define HAVE_PWD_H 1
| #define HAVE_PWD_H 1
| #define HAVE_SYS_TIME_H 1
| #define HAVE_SYS_TIME_H 1
| #define HAVE_UNISTD_H 1
| #define HAVE_UNISTD_H 1
| #define STDC_HEADERS 1
| #define RETSIGTYPE void
| #define HAVE_STDLIB_H 1
| #define HAVE_UNISTD_H 1
| #define HAVE_GETPAGESIZE 1
| #define HAVE_MMAP 1
| #define HAVE_WCHAR_H 1
| #define HAVE_WCTYPE_H 1
| #define USE_GMODULE 1
| #define HAVE_PROGRESSIVE_JPEG 1
| #define HAVE_SYS_WAIT_H 1
| #define RETSIGTYPE void
| /* end confdefs.h.  */
| /* Define XOpenDisplay to an innocuous variant, in case <limits.h> declares XOpenDisplay.
|    For example, HP-UX 11i <limits.h> declares gettimeofday.  */
| #define XOpenDisplay innocuous_XOpenDisplay
| 
| /* System header to define __stub macros and hopefully few prototypes,
|     which can conflict with char XOpenDisplay (); below.
|     Prefer <limits.h> to <assert.h> if __STDC__ is defined, since
|     <limits.h> exists even on freestanding compilers.  */
| 
| #ifdef __STDC__
| # include <limits.h>
| #else
| # include <assert.h>
| #endif
| 
| #undef XOpenDisplay
| 
| /* Override any GCC internal prototype to avoid an error.
|    Use char because int might match the return type of a GCC
|    builtin and then its argument prototype would still apply.  */
| #ifdef __cplusplus
| extern "C"
| #endif
| char XOpenDisplay ();
| /* The GNU C library defines this for functions which it implements
|     to always fail with ENOSYS.  Some functions are actually named
|     something starting with __ and the normal name is an alias.  */
| #if defined __stub_XOpenDisplay || defined __stub___XOpenDisplay
| choke me
| #endif
| 
| int
| main ()
| {
| return XOpenDisplay ();
|   ;
|   return 0;
| }
configure:31429: result: no
configure:31434: error: *** libX11 not found. Check 'config.log' for more details.

## ---------------- ##
## Cache variables. ##
## ---------------- ##

ac_cv_build=mips-sgi-irix6.5
ac_cv_c_compiler_gnu=yes
ac_cv_c_const=yes
ac_cv_cxx_compiler_gnu=yes
ac_cv_env_BASE_DEPENDENCIES_CFLAGS_set=''
ac_cv_env_BASE_DEPENDENCIES_CFLAGS_value=''
ac_cv_env_BASE_DEPENDENCIES_LIBS_set=''
ac_cv_env_BASE_DEPENDENCIES_LIBS_value=''
ac_cv_env_CCC_set=''
ac_cv_env_CCC_value=''
ac_cv_env_CC_set=''
ac_cv_env_CC_value=''
ac_cv_env_CFLAGS_set=''
ac_cv_env_CFLAGS_value=''
ac_cv_env_CPPFLAGS_set=set
ac_cv_env_CPPFLAGS_value=-I/usr/local/include
ac_cv_env_CPP_set=''
ac_cv_env_CPP_value=''
ac_cv_env_CXXCPP_set=''
ac_cv_env_CXXCPP_value=''
ac_cv_env_CXXFLAGS_set=''
ac_cv_env_CXXFLAGS_value=''
ac_cv_env_CXX_set=''
ac_cv_env_CXX_value=''
ac_cv_env_F77_set=''
ac_cv_env_F77_value=''
ac_cv_env_FFLAGS_set=''
ac_cv_env_FFLAGS_value=''
ac_cv_env_LDFLAGS_set=set
ac_cv_env_LDFLAGS_value=-L/usr/local/lib
ac_cv_env_PKG_CONFIG_set=''
ac_cv_env_PKG_CONFIG_value=''
ac_cv_env_XMKMF_set=''
ac_cv_env_XMKMF_value=''
ac_cv_env_build_alias_set=''
ac_cv_env_build_alias_value=''
ac_cv_env_host_alias_set=''
ac_cv_env_host_alias_value=''
ac_cv_env_target_alias_set=''
ac_cv_env_target_alias_value=''
ac_cv_f77_compiler_gnu=yes
ac_cv_func_XOpenDisplay=no
ac_cv_func__NSGetEnviron=no
ac_cv_func_bind_textdomain_codeset=yes
ac_cv_func_connect=yes
ac_cv_func_dcgettext=yes
ac_cv_func_flockfile=yes
ac_cv_func_getc_unlocked=yes
ac_cv_func_gethostbyname=yes
ac_cv_func_getpagesize=yes
ac_cv_func_getresuid=no
ac_cv_func_iswalnum=yes
ac_cv_func_lstat=yes
ac_cv_func_mallinfo=no
ac_cv_func_mkstemp=yes
ac_cv_func_mmap_fixed_mapped=yes
ac_cv_func_remove=yes
ac_cv_func_shmat=yes
ac_cv_have_x=have_x='yes	ac_x_includes='\'''\''	ac_x_libraries='\''/usr/lib'\'
ac_cv_header_crt_externs_h=no
ac_cv_header_dlfcn_h=yes
ac_cv_header_inttypes_h=yes
ac_cv_header_libintl_h=yes
ac_cv_header_locale_h=yes
ac_cv_header_memory_h=yes
ac_cv_header_pwd_h=yes
ac_cv_header_stdc=yes
ac_cv_header_stdint_h=no
ac_cv_header_stdlib_h=yes
ac_cv_header_string_h=yes
ac_cv_header_strings_h=yes
ac_cv_header_sys_stat_h=yes
ac_cv_header_sys_time_h=yes
ac_cv_header_sys_types_h=yes
ac_cv_header_sys_wait_h=yes
ac_cv_header_tiffio_h=yes
ac_cv_header_unistd_h=yes
ac_cv_host=mips-sgi-irix6.5
ac_cv_lib_ICE_IceConnectionNumber=no
ac_cv_lib_dnet_dnet_ntoa=no
ac_cv_lib_dnet_stub_dnet_ntoa=no
ac_cv_lib_intl_bindtextdomain=yes
ac_cv_lib_intl_dgettext=yes
ac_cv_lib_intl_ngettext=yes
ac_cv_lib_jpeg_jpeg_destroy_decompress=yes
ac_cv_lib_jpeg_jpeg_simple_progression=yes
ac_cv_lib_tiff_TIFFReadScanline=yes
ac_cv_objext=o
ac_cv_path_EGREP='/sbin/grep -E'
ac_cv_path_GMSGFMT=/usr/local/bin/msgfmt
ac_cv_path_GREP=/sbin/grep
ac_cv_path_MSGFMT=/usr/local/bin/msgfmt
ac_cv_path_NM='/usr/bin/nm -B'
ac_cv_path_PERL=/usr/local/bin/perl5
ac_cv_path_XGETTEXT=/usr/local/bin/xgettext
ac_cv_path_ac_pt_PKG_CONFIG=/usr/local/bin/pkg-config
ac_cv_prog_AWK=nawk
ac_cv_prog_CPP='gcc -E'
ac_cv_prog_CXXCPP='g++ -E'
ac_cv_prog_ac_ct_AR=ar
ac_cv_prog_ac_ct_CC=gcc
ac_cv_prog_ac_ct_CXX=g++
ac_cv_prog_ac_ct_F77=g77
ac_cv_prog_ac_ct_STRIP=strip
ac_cv_prog_cc_c89=''
ac_cv_prog_cc_g=yes
ac_cv_prog_cxx_g=yes
ac_cv_prog_f77_g=yes
ac_cv_prog_make_make_set=yes
ac_cv_search_strerror='none required'
ac_cv_sys_file_offset_bits=no
ac_cv_sys_large_files=no
ac_cv_sys_largefile_CC=no
ac_cv_type_signal=void
ac_cv_type_uid_t=yes
am_cv_CC_dependencies_compiler_type=gcc3
am_cv_CXX_dependencies_compiler_type=gcc3
am_cv_prog_cc_stdc=''
am_cv_val_LC_MESSAGES=yes
gt_cv_func_dgettext_libc=no
gt_cv_func_dgettext_libintl=yes
gt_cv_func_ngettext_libc=no
gt_cv_have_gettext=yes
lt_cv_deplibs_check_method=pass_all
lt_cv_file_magic_cmd='$MAGIC_CMD'
lt_cv_file_magic_test_file=''
lt_cv_ld_reload_flag=-r
lt_cv_objdir=.libs
lt_cv_path_LD=/usr/bin/ld
lt_cv_path_LDCXX='/usr/bin/ld -n32'
lt_cv_path_NM='/usr/bin/nm -B'
lt_cv_path_SED=/sbin/sed
lt_cv_prog_compiler_c_o=yes
lt_cv_prog_compiler_c_o_CXX=yes
lt_cv_prog_compiler_c_o_F77=yes
lt_cv_prog_compiler_rtti_exceptions=no
lt_cv_prog_gnu_ld=no
lt_cv_prog_gnu_ldcxx=no
lt_cv_sys_global_symbol_pipe='sed -n -e '\''s/^.*[ 	]\([BCDEGRST][BCDEGRST]*\)[ 	][ 	]*\([_A-Za-z][_A-Za-z0-9]*\)$/\1 \2 \2/p'\'
lt_cv_sys_global_symbol_to_c_name_address='sed -n -e '\''s/^: \([^ ]*\) $/  {\"\1\", (lt_ptr) 0},/p'\'' -e '\''s/^[BCDEGRST] \([^ ]*\) \([^ ]*\)$/  {"\2", (lt_ptr) \&\2},/p'\'
lt_cv_sys_global_symbol_to_cdecl='sed -n -e '\''s/^. .* \(.*\)$/extern int \1;/p'\'
lt_cv_sys_max_cmd_len=65536
lt_lt_cv_prog_compiler_c_o='"yes"'
lt_lt_cv_prog_compiler_c_o_CXX='"yes"'
lt_lt_cv_prog_compiler_c_o_F77='"yes"'
lt_lt_cv_sys_global_symbol_pipe='"sed -n -e '\''s/^.*[ 	]\\([BCDEGRST][BCDEGRST]*\\)[ 	][ 	]*\\([_A-Za-z][_A-Za-z0-9]*\\)\$/\\1 \\2 \\2/p'\''"'
lt_lt_cv_sys_global_symbol_to_c_name_address='"sed -n -e '\''s/^: \\([^ ]*\\) \$/  {\\\"\\1\\\", (lt_ptr) 0},/p'\'' -e '\''s/^[BCDEGRST] \\([^ ]*\\) \\([^ ]*\\)\$/  {\"\\2\", (lt_ptr) \\&\\2},/p'\''"'
lt_lt_cv_sys_global_symbol_to_cdecl='"sed -n -e '\''s/^. .* \\(.*\\)\$/extern int \\1;/p'\''"'
pkg_cv_BASE_DEPENDENCIES_CFLAGS='-I/usr/local/include/glib-2.0 -I/usr/local/lib/glib-2.0/include -I/usr/local/include/atk-1.0 -I/usr/local/include/pango-1.0 -I/usr/local/include/cairo -I/usr/local/include/freetype2 -I/usr/local/include -I/usr/local/include/libpng12  '
pkg_cv_BASE_DEPENDENCIES_LIBS='-L/usr/local/lib -latk-1.0 -lpango-1.0 -lgobject-2.0 -lgmodule-2.0 -lglib-2.0 -lintl -lcairo  '

## ----------------- ##
## Output variables. ##
## ----------------- ##

ACLOCAL='${SHELL} /usr/people/bluer/Desktop/gtk+-2.10.13/missing --run aclocal-1.7 '
AMDEPBACKSLASH='\'
AMDEP_FALSE='#'
AMDEP_TRUE=''
AMTAR='${SHELL} /usr/people/bluer/Desktop/gtk+-2.10.13/missing --run tar'
AR='ar'
AS='as'
AUTOCONF='${SHELL} /usr/people/bluer/Desktop/gtk+-2.10.13/missing --run autoconf'
AUTOHEADER='${SHELL} /usr/people/bluer/Desktop/gtk+-2.10.13/missing --run autoheader'
AUTOMAKE='${SHELL} /usr/people/bluer/Desktop/gtk+-2.10.13/missing --run automake-1.7'
AWK='nawk'
BASE_DEPENDENCIES_CFLAGS='-I/usr/local/include/glib-2.0 -I/usr/local/lib/glib-2.0/include -I/usr/local/include/atk-1.0 -I/usr/local/include/pango-1.0 -I/usr/local/include/cairo -I/usr/local/include/freetype2 -I/usr/local/include -I/usr/local/include/libpng12  '
BASE_DEPENDENCIES_LIBS='-L/usr/local/lib -latk-1.0 -lpango-1.0 -lgobject-2.0 -lgmodule-2.0 -lglib-2.0 -lintl -lcairo  '
BUILD_DYNAMIC_MODULES_FALSE='#'
BUILD_DYNAMIC_MODULES_TRUE=''
CATALOGS=' af.gmo am.gmo ang.gmo ar.gmo as.gmo az.gmo az_IR.gmo be.gmo be@latin.gmo bg.gmo bn.gmo bn_IN.gmo br.gmo bs.gmo ca.gmo cs.gmo cy.gmo da.gmo de.gmo dz.gmo el.gmo en_CA.gmo en_GB.gmo eo.gmo es.gmo et.gmo eu.gmo fa.gmo fi.gmo fr.gmo ga.gmo gl.gmo gu.gmo he.gmo hi.gmo hr.gmo hu.gmo hy.gmo ia.gmo id.gmo is.gmo it.gmo ja.gmo ka.gmo ko.gmo ku.gmo li.gmo lt.gmo lv.gmo mi.gmo mk.gmo ml.gmo mn.gmo mr.gmo ms.gmo nb.gmo ne.gmo nl.gmo nn.gmo nso.gmo or.gmo pa.gmo pl.gmo pt.gmo pt_BR.gmo ro.gmo ru.gmo rw.gmo si.gmo sk.gmo sl.gmo sq.gmo sr.gmo sr@Latn.gmo sr@ije.gmo sv.gmo ta.gmo te.gmo th.gmo tk.gmo tr.gmo tt.gmo uk.gmo ur.gmo uz.gmo uz@Latn.gmo vi.gmo wa.gmo xh.gmo yi.gmo zh_CN.gmo zh_HK.gmo zh_TW.gmo'
CATOBJEXT='.gmo'
CC='gcc'
CCAS='$(CC)'
CCASFLAGS='$(CFLAGS)'
CCDEPMODE='depmode=gcc3'
CFLAGS='-DG_DISABLE_DEPRECATED -g -O2 -Wall'
CPP='gcc -E'
CPPFLAGS='-I/usr/local/include '
CROSS_COMPILING_FALSE=''
CROSS_COMPILING_TRUE='#'
CUPS_API_MAJOR=''
CUPS_API_MINOR=''
CUPS_CFLAGS=''
CUPS_CONFIG=''
CUPS_LIBS=''
CXX='g++'
CXXCPP='g++ -E'
CXXDEPMODE='depmode=gcc3'
CXXFLAGS='-g -O2'
CYGPATH_W='echo'
DATADIRNAME='share'
DB2HTML=''
DEFS=''
DEPDIR='.deps'
DISABLE_EXPLICIT_DEPS_FALSE='#'
DISABLE_EXPLICIT_DEPS_TRUE=''
DLLTOOL='dlltool'
ECHO='print -r'
ECHO_C=''
ECHO_N='-n'
ECHO_T=''
EGREP='/sbin/grep -E'
ENABLE_FB_MANAGER_FALSE=''
ENABLE_FB_MANAGER_TRUE=''
ENABLE_GTK_DOC_FALSE=''
ENABLE_GTK_DOC_TRUE=''
ENABLE_MAN_FALSE=''
ENABLE_MAN_TRUE=''
EXEEXT=''
F77='g77'
FFLAGS='-g -O2'
GDK_DEP_CFLAGS=''
GDK_DEP_LIBS=''
GDK_EXTRA_CFLAGS=''
GDK_EXTRA_LIBS=''
GDK_PACKAGES=''
GDK_PIXBUF_CSOURCE=''
GDK_PIXBUF_DEP_CFLAGS='-D_REENTRANT -I/usr/local/include/glib-2.0 -I/usr/local/lib/glib-2.0/include -I/usr/local/include/libpng12   '
GDK_PIXBUF_DEP_LIBS='-L/usr/local/lib -lgmodule-2.0 -lgobject-2.0 -lglib-2.0 -lintl    -lm'
GDK_PIXBUF_EXTRA_CFLAGS=''
GDK_PIXBUF_EXTRA_LIBS=' -lm'
GDK_PIXBUF_MAJOR='2'
GDK_PIXBUF_MICRO='13'
GDK_PIXBUF_MINOR='10'
GDK_PIXBUF_PACKAGES='gmodule-no-export-2.0 gobject-2.0'
GDK_PIXBUF_VERSION='2.10.13'
GDK_PIXBUF_XLIB_DEP_CFLAGS=''
GDK_PIXBUF_XLIB_DEP_LIBS=''
GDK_PIXBUF_XLIB_EXTRA_CFLAGS=''
GDK_PIXBUF_XLIB_EXTRA_LIBS=' -L/usr/lib -lX11 '
GDK_PIXBUF_XLIB_PACKAGES=''
GDK_WIN32_EXTRA_CFLAGS=''
GDK_WLIBS=''
GETTEXT_PACKAGE='gtk20'
GLIB_CFLAGS='-D_REENTRANT -I/usr/local/include/glib-2.0 -I/usr/local/lib/glib-2.0/include  '
GLIB_GENMARSHAL='glib-genmarshal'
GLIB_LIBS='-L/usr/local/lib -lgobject-2.0 -lgmodule-2.0 -lgthread-2.0 -lpthread -lglib-2.0 -lintl  '
GLIB_MKENUMS='glib-mkenums'
GMOFILES=' af.gmo am.gmo ang.gmo ar.gmo as.gmo az.gmo az_IR.gmo be.gmo be@latin.gmo bg.gmo bn.gmo bn_IN.gmo br.gmo bs.gmo ca.gmo cs.gmo cy.gmo da.gmo de.gmo dz.gmo el.gmo en_CA.gmo en_GB.gmo eo.gmo es.gmo et.gmo eu.gmo fa.gmo fi.gmo fr.gmo ga.gmo gl.gmo gu.gmo he.gmo hi.gmo hr.gmo hu.gmo hy.gmo ia.gmo id.gmo is.gmo it.gmo ja.gmo ka.gmo ko.gmo ku.gmo li.gmo lt.gmo lv.gmo mi.gmo mk.gmo ml.gmo mn.gmo mr.gmo ms.gmo nb.gmo ne.gmo nl.gmo nn.gmo nso.gmo or.gmo pa.gmo pl.gmo pt.gmo pt_BR.gmo ro.gmo ru.gmo rw.gmo si.gmo sk.gmo sl.gmo sq.gmo sr.gmo sr@Latn.gmo sr@ije.gmo sv.gmo ta.gmo te.gmo th.gmo tk.gmo tr.gmo tt.gmo uk.gmo ur.gmo uz.gmo uz@Latn.gmo vi.gmo wa.gmo xh.gmo yi.gmo zh_CN.gmo zh_HK.gmo zh_TW.gmo'
GMSGFMT='/usr/local/bin/msgfmt'
GOBJECT_QUERY='gobject-query'
GREP='/sbin/grep'
GTK_API_VERSION='2.0'
GTK_BINARY_AGE='1013'
GTK_BINARY_VERSION='2.10.0'
GTK_DEBUG_FLAGS='-DG_DISABLE_CAST_CHECKS'
GTK_DEP_CFLAGS=''
GTK_DEP_LIBS=''
GTK_DOC_USE_LIBTOOL_FALSE=''
GTK_DOC_USE_LIBTOOL_TRUE=''
GTK_EXTRA_CFLAGS=''
GTK_EXTRA_LIBS=''
GTK_INTERFACE_AGE='13'
GTK_MAJOR_VERSION='2'
GTK_MICRO_VERSION='13'
GTK_MINOR_VERSION='10'
GTK_PACKAGES=''
GTK_UPDATE_ICON_CACHE=''
GTK_VERSION='2.10.13'
GTK_XIM_FLAGS=''
HAVE_CUPS_FALSE=''
HAVE_CUPS_TRUE=''
HAVE_DOCBOOK_FALSE=''
HAVE_DOCBOOK_TRUE=''
HAVE_IE55_FALSE=''
HAVE_IE55_TRUE='#'
HAVE_JPEG_FALSE='#'
HAVE_JPEG_TRUE=''
HAVE_PNG_FALSE='#'
HAVE_PNG_TRUE=''
HAVE_TIFF_FALSE='#'
HAVE_TIFF_TRUE=''
HAVE_WINTAB_FALSE=''
HAVE_WINTAB_TRUE='#'
HAVE_X11R6_FALSE=''
HAVE_X11R6_TRUE=''
HTML_DIR=''
IE55_UUID_LIB=''
INCLUDED_LOADER_DEFINE=''
INCLUDED_LOADER_OBJ=''
INDENT=''
INSTALL_DATA='${INSTALL} -m 644'
INSTALL_PROGRAM='${INSTALL}'
INSTALL_SCRIPT='${INSTALL}'
INSTALL_STRIP_PROGRAM='${SHELL} $(install_sh) -c -s'
INSTOBJEXT='.mo'
INTLLIBS='-lintl '
LDFLAGS='-L/usr/local/lib'
LIBJPEG='-ljpeg'
LIBOBJS=''
LIBPNG='-L/usr/local/lib -lpng12 -lz -lm  '
LIBS=' -L/usr/lib -lXext -lXrender -lX11   -lintl '
LIBTIFF='-ltiff'
LIBTOOL='$(SHELL) $(top_builddir)/libtool'
LIBTOOL_EXPORT_OPTIONS='-export-symbols-regex "^[^_].*"'
LN_S='ln -s'
LTLIBOBJS=''
LT_CURRENT_MINUS_AGE='0'
LT_VERSION_INFO='1000:13:1000'
MAINT='#'
MAINTAINER_MODE_FALSE=''
MAINTAINER_MODE_TRUE='#'
MAKEINFO='${SHELL} /usr/people/bluer/Desktop/gtk+-2.10.13/missing --run makeinfo'
MKINSTALLDIRS='./mkinstalldirs'
MSGFMT='/usr/local/bin/msgfmt'
MSGFMT_OPTS='-c'
MS_LIB_AVAILABLE_FALSE=''
MS_LIB_AVAILABLE_TRUE='#'
NM='/usr/bin/nm -B'
OBJDUMP='objdump'
OBJEXT='o'
OS_LINUX_FALSE=''
OS_LINUX_TRUE='#'
OS_UNIX_FALSE='#'
OS_UNIX_TRUE=''
OS_WIN32_FALSE=''
OS_WIN32_TRUE='#'
PACKAGE='gtk+'
PACKAGE_BUGREPORT='http://bugzilla.gnome.org/enter_bug.cgi?product=gtk%2B'
PACKAGE_NAME='gtk+'
PACKAGE_STRING='gtk+ 2.10.13'
PACKAGE_TARNAME='gtk+'
PACKAGE_VERSION='2.10.13'
PATH_SEPARATOR=':'
PERL='/usr/local/bin/perl5'
PKG_CONFIG='/usr/local/bin/pkg-config'
PLATFORM_WIN32_FALSE=''
PLATFORM_WIN32_TRUE='#'
POFILES=' af.po am.po ang.po ar.po as.po az.po az_IR.po be.po be@latin.po bg.po bn.po bn_IN.po br.po bs.po ca.po cs.po cy.po da.po de.po dz.po el.po en_CA.po en_GB.po eo.po es.po et.po eu.po fa.po fi.po fr.po ga.po gl.po gu.po he.po hi.po hr.po hu.po hy.po ia.po id.po is.po it.po ja.po ka.po ko.po ku.po li.po lt.po lv.po mi.po mk.po ml.po mn.po mr.po ms.po nb.po ne.po nl.po nn.po nso.po or.po pa.po pl.po pt.po pt_BR.po ro.po ru.po rw.po si.po sk.po sl.po sq.po sr.po sr@Latn.po sr@ije.po sv.po ta.po te.po th.po tk.po tr.po tt.po uk.po ur.po uz.po uz@Latn.po vi.po wa.po xh.po yi.po zh_CN.po zh_HK.po zh_TW.po'
POSUB='po'
PO_IN_DATADIR_FALSE=''
PO_IN_DATADIR_TRUE=''
RANLIB=':'
REBUILD=''
REBUILD_PNGS=''
SET_MAKE=''
SHELL='/bin/sh'
STRIP='strip'
USE_DIRECTFB_FALSE=''
USE_DIRECTFB_TRUE=''
USE_LINUX_FB_FALSE=''
USE_LINUX_FB_TRUE=''
USE_MMX_FALSE=''
USE_MMX_TRUE='#'
USE_NLS='yes'
USE_QUARTZ_FALSE=''
USE_QUARTZ_TRUE=''
USE_WIN32_FALSE=''
USE_WIN32_TRUE=''
USE_X11_FALSE=''
USE_X11_TRUE=''
VERSION='2.10.13'
WINDRES=''
WINTAB_LIB=''
XGETTEXT='/usr/local/bin/xgettext'
XINPUT_XFREE_FALSE=''
XINPUT_XFREE_TRUE=''
XMKMF=''
XMLCATALOG=''
XML_CATALOG_FILE=''
XSLTPROC=''
X_CFLAGS=''
X_EXTRA_LIBS=''
X_LIBS=' -L/usr/lib'
X_PRE_LIBS=''
ac_ct_CC='gcc'
ac_ct_CXX='g++'
ac_ct_F77='g77'
am__fastdepCC_FALSE='#'
am__fastdepCC_TRUE=''
am__fastdepCXX_FALSE='#'
am__fastdepCXX_TRUE=''
am__include='include'
am__leading_dot='.'
am__quote=''
bindir='${exec_prefix}/bin'
build='mips-sgi-irix6.5'
build_alias=''
build_cpu='mips'
build_os='irix6.5'
build_vendor='sgi'
datadir='${datarootdir}'
datarootdir='${prefix}/share'
docdir='${datarootdir}/doc/${PACKAGE_TARNAME}'
dvidir='${docdir}'
exec_prefix='NONE'
gdktarget='x11'
gdktargetlib='libgdk-x11-2.0.la'
gtktargetlib='libgtk-x11-2.0.la'
host='mips-sgi-irix6.5'
host_alias=''
host_cpu='mips'
host_os='irix6.5'
host_vendor='sgi'
htmldir='${docdir}'
includedir='${prefix}/include'
infodir='${datarootdir}/info'
install_sh='/usr/people/bluer/Desktop/gtk+-2.10.13/install-sh'
libdir='${exec_prefix}/lib'
libexecdir='${exec_prefix}/libexec'
localedir='/usr/local/share/locale'
localstatedir='${prefix}/var'
mandir='${datarootdir}/man'
ms_librarian=''
oldincludedir='/usr/include'
pdfdir='${docdir}'
prefix='NONE'
program_transform_name='s,x,x,'
psdir='${docdir}'
sbindir='${exec_prefix}/sbin'
sharedstatedir='${prefix}/com'
sysconfdir='${prefix}/etc'
target_alias=''

## ----------- ##
## confdefs.h. ##
## ----------- ##

#define PACKAGE_NAME "gtk+"
#define PACKAGE_TARNAME "gtk+"
#define PACKAGE_VERSION "2.10.13"
#define PACKAGE_STRING "gtk+ 2.10.13"
#define PACKAGE_BUGREPORT "http://bugzilla.gnome.org/enter_bug.cgi?product=gtk%2B"
#define GETTEXT_PACKAGE "gtk20"
#define STDC_HEADERS 1
#define HAVE_SYS_TYPES_H 1
#define HAVE_SYS_STAT_H 1
#define HAVE_STDLIB_H 1
#define HAVE_STRING_H 1
#define HAVE_MEMORY_H 1
#define HAVE_STRINGS_H 1
#define HAVE_INTTYPES_H 1
#define HAVE_UNISTD_H 1
#define HAVE_DLFCN_H 1
#define GTK_COMPILED_WITH_DEBUGGING "minimum"
#define HAVE_LSTAT 1
#define HAVE_MKSTEMP 1
#define HAVE_FLOCKFILE 1
#define HAVE_GETC_UNLOCKED 1
#define HAVE_SIGSETJMP 1
#define HAVE_LOCALE_H 1
#define HAVE_LC_MESSAGES 1
#define HAVE_BIND_TEXTDOMAIN_CODESET 1
#define HAVE_GETTEXT 1
#define HAVE_DCGETTEXT 1
#define ENABLE_NLS 1
#define GTK_LOCALEDIR "/usr/local/share/locale"
#define HAVE_BIND_TEXTDOMAIN_CODESET 1
#define HAVE_PWD_H 1
#define HAVE_PWD_H 1
#define HAVE_SYS_TIME_H 1
#define HAVE_SYS_TIME_H 1
#define HAVE_UNISTD_H 1
#define HAVE_UNISTD_H 1
#define STDC_HEADERS 1
#define RETSIGTYPE void
#define HAVE_STDLIB_H 1
#define HAVE_UNISTD_H 1
#define HAVE_GETPAGESIZE 1
#define HAVE_MMAP 1
#define HAVE_WCHAR_H 1
#define HAVE_WCTYPE_H 1
#define USE_GMODULE 1
#define HAVE_PROGRESSIVE_JPEG 1
#define HAVE_SYS_WAIT_H 1
#define RETSIGTYPE void

configure: exit 1