All pastes #784255 Raw Edit

Unnamed

public text v1 · immutable
·published 2007-11-19 16:48 UTC
rendered paste body
   _MESSAGE_T_PRESENT -DNV_PCI_CHOOSE_STATE_PRESENT -DNV_VM_INSERT_PAGE_PRESENT
   -DNV_REMAP_PFN_RANGE_PRESENT -DNV_CHANGE_PAGE_ATTR_PRESENT -DNV_VMAP_4_PRESE
   NT -DMODULE -D"KBUILD_STR(s)=#s" -D"KBUILD_BASENAME=KBUILD_STR(nv)"  -D"KBUI
   LD_MODNAME=KBUILD_STR(nvidia)" -c -o /tmp/selfgz11192/NVIDIA-Linux-x86-1.0-8
   776-pkg1/usr/src/nv/nv.o /tmp/selfgz11192/NVIDIA-Linux-x86-1.0-8776-pkg1/usr
   /src/nv/nv.c
   In file included from /tmp/selfgz11192/NVIDIA-Linux-x86-1.0-8776-pkg1/usr/sr
   c/nv/nv.c:14:
   /tmp/selfgz11192/NVIDIA-Linux-x86-1.0-8776-pkg1/usr/src/nv/nv-linux.h:17:26:
   error: linux/config.h: No such file or directory
   In file included from include/linux/list.h:8,
                    from include/linux/wait.h:22,
                    from include/asm/semaphore.h:41,
                    from include/linux/sched.h:66,
                    from include/linux/utsname.h:35,
                    from /tmp/selfgz11192/NVIDIA-Linux-x86-1.0-8776-pkg1/usr/sr
   c/nv/nv-linux.h:19,
                    from /tmp/selfgz11192/NVIDIA-Linux-x86-1.0-8776-pkg1/usr/sr
   c/nv/nv.c:14:
   include/linux/prefetch.h: In function 'prefetch_range':
   include/linux/prefetch.h:62: warning: pointer of type 'void *' used in arith
   metic
   /tmp/selfgz11192/NVIDIA-Linux-x86-1.0-8776-pkg1/usr/src/nv/nv.c: At top leve
   l:
   /tmp/selfgz11192/NVIDIA-Linux-x86-1.0-8776-pkg1/usr/src/nv/nv.c:102: warning
   : 'kmem_cache_t' is deprecated
   /tmp/selfgz11192/NVIDIA-Linux-x86-1.0-8776-pkg1/usr/src/nv/nv.c: In function
   'nv_kern_open':
   /tmp/selfgz11192/NVIDIA-Linux-x86-1.0-8776-pkg1/usr/src/nv/nv.c:1805: warnin
   g: 'deprecated_irq_flag' is deprecated (declared at include/linux/interrupt.
   h:66)
   /tmp/selfgz11192/NVIDIA-Linux-x86-1.0-8776-pkg1/usr/src/nv/nv.c:1805: warnin
   g: 'deprecated_irq_flag' is deprecated (declared at include/linux/interrupt.
   h:66)
   /tmp/selfgz11192/NVIDIA-Linux-x86-1.0-8776-pkg1/usr/src/nv/nv.c:1806: warnin
   g: passing argument 2 of 'request_irq' from incompatible pointer type
   make[4]: *** [/tmp/selfgz11192/NVIDIA-Linux-x86-1.0-8776-pkg1/usr/src/nv/nv.
   o] Error 1
   make[3]: *** [_module_/tmp/selfgz11192/NVIDIA-Linux-x86-1.0-8776-pkg1/usr/sr
   c/nv] Error 2
   make[2]: *** [modules] Error 2
   NVIDIA: left KBUILD.
   nvidia.ko failed to build!
   make[1]: *** [mdl] Error 1
   make: *** [module] Error 2
-> Error.
ERROR: Unable to build the NVIDIA kernel module.
ERROR: Installation has failed.  Please see the file
       '/var/log/nvidia-installer.log' for details.  You may find suggestions
       on fixing installation problems in the README available on the Linux
       driver download page at www.nvidia.com.