rendered paste bodypatching file caiaq-audio.c
copying file alsa-kernel/usb/caiaq/caiaq-device.c
patching file caiaq-device.c
Hunk #1 succeeded at 106 (offset 6 lines).
Hunk #2 succeeded at 313 (offset 14 lines).
make[3]: Leaving directory `/home/buz/bin/alsa-driver-1.0.15/usb/caiaq'
make[3]: Entering directory `/home/buz/bin/alsa-driver-1.0.15/usb/usx2y'
copying file alsa-kernel/usb/usx2y/usX2Yhwdep.c
patching file usX2Yhwdep.c
Hunk #3 succeeded at 63 with fuzz 2.
copying file alsa-kernel/usb/usx2y/usbusx2y.c
patching file usbusx2y.c
copying file alsa-kernel/usb/usx2y/usbusx2yaudio.c
patching file usbusx2yaudio.c
Hunk #10 succeeded at 1057 (offset -1 lines).
copying file alsa-kernel/usb/usx2y/usx2yhwdeppcm.c
patching file usx2yhwdeppcm.c
make[3]: Leaving directory `/home/buz/bin/alsa-driver-1.0.15/usb/usx2y'
make[2]: Leaving directory `/home/buz/bin/alsa-driver-1.0.15/usb'
make[2]: Entering directory `/home/buz/bin/alsa-driver-1.0.15/pcmcia'
make[3]: Entering directory `/home/buz/bin/alsa-driver-1.0.15/pcmcia/pdaudiocf'
make[3]: Leaving directory `/home/buz/bin/alsa-driver-1.0.15/pcmcia/pdaudiocf'
make[3]: Entering directory `/home/buz/bin/alsa-driver-1.0.15/pcmcia/vx'
make[3]: Leaving directory `/home/buz/bin/alsa-driver-1.0.15/pcmcia/vx'
make[2]: Leaving directory `/home/buz/bin/alsa-driver-1.0.15/pcmcia'
make[1]: Leaving directory `/home/buz/bin/alsa-driver-1.0.15'
make -C /usr/src/linux-headers-2.6.24-rc3-git1 SUBDIRS=/home/buz/bin/alsa-driver-1.0.15 CPP="gcc -E" CC="gcc" modules
make[1]: Entering directory `/usr/src/linux-headers-2.6.24-rc3-git1'
/usr/src/linux-headers-2.6.24-rc3-git1/arch/x86/Makefile:14: /usr/src/linux-headers-2.6.24-rc3-git1/arch/x86/Makefile_32: No such file or directory
scripts/Makefile.build:46: *** CFLAGS was changed in "/home/buz/bin/alsa-driver-1.0.15/acore/Makefile". Fix it to use EXTRA_CFLAGS. Stop.
make[2]: *** [/home/buz/bin/alsa-driver-1.0.15/acore] Error 2
make[1]: *** [_module_/home/buz/bin/alsa-driver-1.0.15] Error 2
make[1]: Leaving directory `/usr/src/linux-headers-2.6.24-rc3-git1'
make: *** [compile] Error 2