All pastes #782046 Raw Edit

sheep

public text v1 · immutable
·published 2007-11-19 03:03 UTC
rendered paste body
 gcc -DHAVE_CONFIG_H -I. -I. -I.. -pthread -I/usr/include/glib-2.0 -I/usr/lib/glib-2.0/include -I/usr/include/gtk-2.0 -I/usr/lib/gtk-2.0/include -I/usr/include/atk-1.0 -I/usr/include/cairo -I/usr/include/pango-1.0 -I/usr/include/freetype2 -I/usr/include/libpng12 -I/usr/include/libwnck-1.0 -I/usr/include/startup-notification-1.0 -I/usr/include/thunar-vfs-1 -I/usr/include/exo-0.3 -I/usr/include/xfce4 -I/usr/include/dbus-1.0 -I/usr/lib/dbus-1.0/include -I/usr/include/libglade-2.0 -I/usr/include/libxml2 -I.. -I.. -DDATADIR=\"/usr/local/share\" -DSYSCONFDIR=\"/usr/local/etc\" -DLIBDIR=\"/usr/local/lib\" -shared -g -O2 -Wall -fno-strict-aliasing -fmessage-length=0 -D_FORTIFY_SOURCE=2 -MT awn-vfs.lo -MD -MP -MF .deps/awn-vfs.Tpo -c awn-vfs.c  -fPIC -DPIC -o .libs/awn-vfs.o
awn-vfs.c: In function 'thunar_vfs_monitor_callback_proxy':
awn-vfs.c:146: error: conversion to non-scalar type requested
awn-vfs.c: In function 'awn_vfs_monitor_add':
awn-vfs.c:195: error: too few arguments to function 'thunar_vfs_path_new'
awn-vfs.c:197: warning: passing argument 3 of 'thunar_vfs_monitor_add_file' from incompatible pointer type
awn-vfs.c:199: warning: passing argument 3 of 'thunar_vfs_monitor_add_directory' from incompatible pointer type
awn-vfs.c: In function 'awn_vfs_monitor_emit':
awn-vfs.c:236: warning: passing argument 1 of 'thunar_vfs_monitor_feed' from incompatible pointer type
make[4]: *** [awn-vfs.lo] Error 1
make[4]: Leaving directory `/home/sheep/devel/awn-0.2.2/libawn'
make[3]: *** [all-recursive] Error 1
make[3]: Leaving directory `/home/sheep/devel/awn-0.2.2/libawn'
make[2]: *** [all] Error 2
make[2]: Leaving directory `/home/sheep/devel/awn-0.2.2/libawn'
make[1]: *** [all-recursive] Error 1
make[1]: Leaving directory `/home/sheep/devel/awn-0.2.2'
make: *** [all] Error 2