All pastes #780595 Raw Edit

Miscellany

public text v1 · immutable
·published 2007-11-18 16:58 UTC
rendered paste body
[ 53%] [ 53%] Building CXX object workspace/kwin/effects/CMakeFiles/kwin4_effect_builtins.dir/trackmouse.o
Building CXX object workspace/plasma/applets/battery/CMakeFiles/plasma_applet_battery.dir/plasma_applet_battery_automoc.o
[ 53%] Building CXX object workspace/kwin/effects/CMakeFiles/kwin4_effect_builtins.dir/showfps.o
[ 54%] Building CXX object workspace/plasma/applets/battery/CMakeFiles/plasma_applet_battery.dir/battery.o
[ 54%] Building CXX object workspace/kwin/effects/CMakeFiles/kwin4_effect_builtins.dir/showpaint.o
/var/tmp/portage/kde-base/kdebase-9999.4/work/kdebase-9999.4/workspace/kwin/effects/showpaint.cpp: In member function 'void KWin::ShowPaintEffect::paintXrender()':
/var/tmp/portage/kde-base/kdebase-9999.4/work/kdebase-9999.4/workspace/kwin/effects/showpaint.cpp:89: warning: converting to 'int' from 'double'
Linking CXX shared module ../../../lib/kwin4_effect_builtins.so
/var/tmp/portage/kde-base/kdebase-9999.4/work/kdebase_build/workspace/plasma/applets/battery/ui_batteryConfig.h: In member function 'void Ui_batteryConfig::retranslateUi(QWidget*)':
/var/tmp/portage/kde-base/kdebase-9999.4/work/kdebase_build/workspace/plasma/applets/battery/ui_batteryConfig.h:109: error: 'class QWidget' has no member named 'setAccessibleName'
make[2]: *** [workspace/plasma/applets/battery/CMakeFiles/plasma_applet_battery.dir/battery.o] Error 1
make[1]: *** [workspace/plasma/applets/battery/CMakeFiles/plasma_applet_battery.dir/all] Error 2
make[1]: *** Waiting for unfinished jobs....
[ 54%] Built target kwin4_effect_builtins
make: *** [all] Error 2
 *
 * ERROR: kde-base/kdebase-9999.4 failed.
 * Call stack:
 *               ebuild.sh, line 1696:  Called dyn_compile
 *               ebuild.sh, line 1034:  Called qa_call 'src_compile'
 *               ebuild.sh, line   44:  Called src_compile
 *   kdebase-9999.4.ebuild, line  132:  Called kde4-base_src_compile
 *        kde4-base.eclass, line  290:  Called kde4-base_src_make
 *        kde4-base.eclass, line  396:  Called cmake-utils_src_make
 *      cmake-utils.eclass, line  124:  Called die
 * The specific snippet of code:
 *              emake || die "Make failed!"
 *  The die message:
 *   Make failed!
 *
 * If you need support, post the topmost build error, and the call stack if relevant.
 * A complete build log is located at '/var/log/portage/kde-base:kdebase-9999.4:20071118-163635.log'.
 *