All pastes #779626 Raw Edit

Anonymous

public text v1 · immutable
·published 2007-11-18 12:14 UTC
rendered paste body
steve@wopr:~/Random/opensync/libopensync-plugin-syncml-0.34/build$ cmake ..
-- Check for working C compiler: /usr/bin/gcc
-- Check for working C compiler: /usr/bin/gcc -- works
-- Check size of void*
-- Check size of void* - done
-- Found OpenSync: /usr/local/lib/libopensync.so
-- Found GLib2: /usr/lib/libglib-2.0.so;/usr/lib/libgmodule-2.0.so;/usr/lib/libgthread-2.0.so;/usr/lib/libgobject-2.0.so
-- Found LibXml2: /usr/lib/libxml2.so
-- Found libsyncml: /usr/lib/libsyncml.so
-- Cannot determine repository type. Please set UPDATE_TYPE to 'cvs' or 'svn'. CTest update will not work.
-- Configuring done
-- Generating done
-- Build files have been written to: /home/steve/Random/opensync/libopensync-plugin-syncml-0.34/build
steve@wopr:~/Random/opensync/libopensync-plugin-syncml-0.34/build$ make
[100%] Building C object src/CMakeFiles/syncml-plugin.dir/syncml_plugin.o
/home/steve/Random/opensync/libopensync-plugin-syncml-0.34/src/syncml_plugin.c:162: error: expected declaration specifiers or ‘...’ before ‘SmlDsEvent’
/home/steve/Random/opensync/libopensync-plugin-syncml-0.34/src/syncml_plugin.c: In function ‘_ds_event’:
/home/steve/Random/opensync/libopensync-plugin-syncml-0.34/src/syncml_plugin.c:164: error: ‘event’ undeclared (first use in this function)
/home/steve/Random/opensync/libopensync-plugin-syncml-0.34/src/syncml_plugin.c:164: error: (Each undeclared identifier is reported only once
/home/steve/Random/opensync/libopensync-plugin-syncml-0.34/src/syncml_plugin.c:164: error: for each function it appears in.)
/home/steve/Random/opensync/libopensync-plugin-syncml-0.34/src/syncml_plugin.c:170: error: ‘SML_DS_EVENT_GOTCHANGES’ undeclared (first use in this function)
/home/steve/Random/opensync/libopensync-plugin-syncml-0.34/src/syncml_plugin.c:178: error: ‘SML_DS_EVENT_COMMITEDCHANGES’ undeclared (first use in this function)
/home/steve/Random/opensync/libopensync-plugin-syncml-0.34/src/syncml_plugin.c: In function ‘syncml_http_server_init’:
/home/steve/Random/opensync/libopensync-plugin-syncml-0.34/src/syncml_plugin.c:1098: error: ‘SmlTransportHttpServerConfig’ has no member named ‘ssl_key’
/home/steve/Random/opensync/libopensync-plugin-syncml-0.34/src/syncml_plugin.c:1099: error: ‘SmlTransportHttpServerConfig’ has no member named ‘ssl_crt’
make[2]: *** [src/CMakeFiles/syncml-plugin.dir/syncml_plugin.o] Error 1
make[1]: *** [src/CMakeFiles/syncml-plugin.dir/all] Error 2
make: *** [all] Error 2
steve@wopr:~/Random/opensync/libopensync-plugin-syncml-0.34/build$