[echo] Build Directory is /home/ckrinke/svnsugi/opensim/OpenSim/Region/Physics/OdePlugin/bin/Release
[mkdir] Creating directory '/home/ckrinke/svnsugi/opensim/OpenSim/Region/Physics/OdePlugin/bin/Release'.
[csc] Compiling 2 files to '/home/ckrinke/svnsugi/opensim/OpenSim/Region/Physics/OdePlugin/bin/Release/OpenSim.Region.Physics.OdePlugin.dll'.
[csc] /home/ckrinke/svnsugi/opensim/OpenSim/Region/Physics/OdePlugin/OdePlugin.cs(324,39): warning CS0168: The variable `ch2' is declared but never used
[csc] /home/ckrinke/svnsugi/opensim/OpenSim/Region/Physics/OdePlugin/OdePlugin.cs(468,25): error CS0019: Operator `!=' cannot be applied to operands of type `System.IntPtr' and `null'
[csc] /home/ckrinke/svnsugi/opensim/OpenSim/Region/Physics/OdePlugin/OdePlugin.cs(493,25): error CS0019: Operator `!=' cannot be applied to operands of type `System.IntPtr' and `null'
[csc] /home/ckrinke/svnsugi/opensim/OpenSim/Region/Physics/OdePlugin/OdePlugin.cs(744,35): warning CS0168: The variable `caphead' is declared but never used
[csc] /home/ckrinke/svnsugi/opensim/OpenSim/Region/Physics/OdePlugin/OdePlugin.cs(746,35): warning CS0168: The variable `capfoot' is declared but never used
[csc] /home/ckrinke/svnsugi/opensim/OpenSim/Region/Physics/OdePlugin/OdePlugin.cs(735,35): warning CS0219: The variable `temp' is assigned but its value is never used
[csc] /home/ckrinke/svnsugi/opensim/OpenSim/Region/Physics/OdePlugin/OdePlugin.cs(734,31): warning CS0219: The variable `Zoff' is assigned but its value is never used
[csc] /home/ckrinke/svnsugi/opensim/OpenSim/Region/Physics/OdePlugin/OdePlugin.cs(762,29): warning CS0219: The variable `outofBoundsPrim' is assigned but its value is never used
[csc] Compilation failed: 2 error(s), 6 warnings
BUILD FAILED - 0 non-fatal error(s), 8 warning(s)
/home/ckrinke/svnsugi/opensim/OpenSim/Region/Physics/OdePlugin/OpenSim.Region.Physics.OdePlugin.dll.build(10,10):
External Program Failed: /home/ckrinke/mono-1.2.4/lib/pkgconfig/../../lib/mono/2.0/gmcs.exe (return code was 1)
Total time: 1.2 seconds.
BUILD FAILED
Nested build failed. Refer to build log for exact reason.