[ 11%] Building CXX object src/streams/CMakeFiles/streams.dir/strigi/stgdirent.o
Linking CXX shared library libstreams.dylib
ld: warning -L: directory name (/opt/kde4/lib) does not exist
ld: warning -L: directory name (/opt/kde4/lib) does not exist
ld: Undefined symbols:
__keymgr_get_and_lock_processwide_ptr
__keymgr_get_and_lock_processwide_ptr_2
__keymgr_set_and_unlock_processwide_ptr
_calloc
_dlopen
_dlsym
_free
_malloc
__ZN9__gnu_cxx18__exchange_and_addEPVii
__ZNKSs4findEcm
__ZNKSs5rfindEcm
__ZNSolsEm
__ZNSs4_Rep10_M_destroyERKSaIcE
__ZNSs4_Rep20_S_empty_rep_storageE
__ZNSs6assignERKSs
__ZNSsC1ERKSs
__ZNSsC1ERKSsmm
__ZNSt15_List_node_base4hookEPS_
__ZNSt15_List_node_base6unhookEv
__ZNSt8ios_base4InitC1Ev
__ZNSt8ios_base4InitD1Ev
__ZSt17__throw_bad_allocv
__ZSt18_Rb_tree_decrementPSt18_Rb_tree_node_base
__ZSt18_Rb_tree_incrementPKSt18_Rb_tree_node_base
__ZSt18_Rb_tree_incrementPSt18_Rb_tree_node_base
__ZSt20__throw_length_errorPKc
__ZSt20__throw_out_of_rangePKc
__ZSt28_Rb_tree_rebalance_for_erasePSt18_Rb_tree_node_baseRS_
__ZSt29_Rb_tree_insert_and_rebalancebPSt18_Rb_tree_node_baseS0_RS_
__ZSt4cerr
__ZSt4endlIcSt11char_traitsIcEERSt13basic_ostreamIT_T0_ES6_
__ZStlsISt11char_traitsIcEERSt13basic_ostreamIcT_ES5_PKc
__ZTVN10__cxxabiv117__class_type_infoE
__ZTVN10__cxxabiv120__si_class_type_infoE
__ZdlPv
__Znwm
___cxa_pure_virtual
_memmove
_printf
_putchar
_strncmp
__ZNSs6appendEPKcm
__ZNSs6assignEPKcm
__ZNSsC1EPKcmRKSaIcE
_atoi
_strchr
__ZNSs7reserveEm
_realloc
___sF
_fwrite
__ZNKSs7compareEPKc
__ZNSolsEl
__ZNSolsEx
_localtime
_mktime
_time
___error
_fprintf
_snprintf
__ZNSs6appendERKSs
_fclose
_feof
_ferror
_fopen
_fread
_fseeko
_ftello
_strerror
_stat
__ZNSolsEPKv
_deflate
_deflateEnd
_deflateInit_
_inflate
_inflateEnd
_inflateInit2_
_inflateInit_
__ZdaPv
__Znam
__DefaultRuneLocale
__ZNSs4_Rep11_S_terminalE
__ZNSs4_Rep9_S_createEmmRKSaIcE
__ZNSs6resizeEmc
__ZNSt19basic_ostringstreamIcSt11char_traitsIcESaIcEEC1ESt13_Ios_Openmode
__ZNSt6localeD1Ev
__ZNSt8ios_baseD2Ev
__ZSt19__throw_logic_errorPKc
__ZTTSt19basic_ostringstreamIcSt11char_traitsIcESaIcEE
__ZTVSt15basic_streambufIcSt11char_traitsIcEE
__ZTVSt15basic_stringbufIcSt11char_traitsIcESaIcEE
__ZTVSt19basic_ostringstreamIcSt11char_traitsIcESaIcEE
__ZTVSt9basic_iosIcSt11char_traitsIcEE
___maskrune
_isalnum
_isspace
_isxdigit
_memcpy
_strcasestr
_strncasecmp
_strspn
__ZNSs12_M_leak_hardEv
__ZNSsC1EPKcRKSaIcE
_sscanf
__NSGetEnviron
_close
_dup2
_execve
_exit
_fork
_kill
_pipe
_read
_write
___tolower
_abort
_fflush
__DefaultRuneLocale referenced from libbz2 expected to be defined in /usr/lib/libSystem.B.dylib
___sF referenced from libbz2 expected to be defined in /usr/lib/libSystem.B.dylib
_exit referenced from libbz2 expected to be defined in /usr/lib/libSystem.B.dylib
_fclose referenced from libbz2 expected to be defined in /usr/lib/libSystem.B.dylib
_fdopen referenced from libbz2 expected to be defined in /usr/lib/libSystem.B.dylib
_ferror referenced from libbz2 expected to be defined in /usr/lib/libSystem.B.dylib
_fflush referenced from libbz2 expected to be defined in /usr/lib/libSystem.B.dylib
_fgetc referenced from libbz2 expected to be defined in /usr/lib/libSystem.B.dylib
_fopen referenced from libbz2 expected to be defined in /usr/lib/libSystem.B.dylib
_fprintf referenced from libbz2 expected to be defined in /usr/lib/libSystem.B.dylib
_fputc referenced from libbz2 expected to be defined in /usr/lib/libSystem.B.dylib
_fread referenced from libbz2 expected to be defined in /usr/lib/libSystem.B.dylib
_free referenced from libbz2 expected to be defined in /usr/lib/libSystem.B.dylib
_fwrite referenced from libbz2 expected to be defined in /usr/lib/libSystem.B.dylib
_malloc referenced from libbz2 expected to be defined in /usr/lib/libSystem.B.dylib
_strcat referenced from libbz2 expected to be defined in /usr/lib/libSystem.B.dylib
_ungetc referenced from libbz2 expected to be defined in /usr/lib/libSystem.B.dylib
___error referenced from libiconv expected to be defined in /usr/lib/libSystem.B.dylib
___mb_cur_max referenced from libiconv expected to be defined in /usr/lib/libSystem.B.dylib
_abort referenced from libiconv expected to be defined in /usr/lib/libSystem.B.dylib
_mbrtowc referenced from libiconv expected to be defined in /usr/lib/libSystem.B.dylib
_memcpy referenced from libiconv expected to be defined in /usr/lib/libSystem.B.dylib
_memset referenced from libiconv expected to be defined in /usr/lib/libSystem.B.dylib
_qsort referenced from libiconv expected to be defined in /usr/lib/libSystem.B.dylib
_strcmp referenced from libiconv expected to be defined in /usr/lib/libSystem.B.dylib
_wcrtomb referenced from libiconv expected to be defined in /usr/lib/libSystem.B.dylib
_fscanf referenced from libiconv expected to be defined in /usr/lib/libSystem.B.dylib
_getc referenced from libiconv expected to be defined in /usr/lib/libSystem.B.dylib
_getenv referenced from libiconv expected to be defined in /usr/lib/libSystem.B.dylib
_nl_langinfo referenced from libiconv expected to be defined in /usr/lib/libSystem.B.dylib
_realloc referenced from libiconv expected to be defined in /usr/lib/libSystem.B.dylib
_strcpy referenced from libiconv expected to be defined in /usr/lib/libSystem.B.dylib
_strncmp referenced from libiconv expected to be defined in /usr/lib/libSystem.B.dylib
/usr/bin/libtool: internal link edit command failed
lipo: can't figure out the architecture type of: /var/tmp//ccxFW6oN.out
make[3]: *** [src/streams/libstreams.0.5.7.dylib] Error 1
make[2]: *** [src/streams/CMakeFiles/streams.dir/all] Error 2
make[1]: *** [all] Error 2
make: *** [dist] Error 2
Shiva:~/kde-mac tomaz$