rendered paste bodyroot@fermi:/home/claudiu/Desktop/Miro-1.0/Miro-1.0/platform/gtk-x11# ./run.sh --unittest
Using the Xine driver hack. If you experience trouble playing video,
try setting USE_XINE_HACK to False in setup.py.
running install
running build
running build_py
copying /home/claudiu/Desktop/Miro-1.0/Miro-1.0/portable/dl_daemon/daemon.py -> build/lib.linux-i686-2.5/miro/dl_daemon
running build_ext
running build_scripts
copying /home/claudiu/Desktop/Miro-1.0/Miro-1.0/platform/gtk-x11/miro -> build/scripts-2.5
changing mode of build/scripts-2.5/miro from 644 to 755
running install_lib
copying build/lib.linux-i686-2.5/miro/dl_daemon/daemon.py -> ./dist/usr/lib/python2.5/site-packages/miro/dl_daemon
byte-compiling ./dist/usr/lib/python2.5/site-packages/miro/dl_daemon/daemon.py to daemon.pyc
running install_scripts
copying build/scripts-2.5/miro -> ./dist/usr/bin
changing mode of ./dist/usr/bin/miro to 755
changing mode of ./dist/usr/bin/miro.real to 755
running install_data
copying /home/claudiu/Desktop/Miro-1.0/Miro-1.0/platform/gtk-x11/miro.1.gz -> ./dist/usr/share/man/man1
copying /home/claudiu/Desktop/Miro-1.0/Miro-1.0/platform/gtk-x11/xine/xine_extractor -> ./dist/usr/libexec/
svn: '/home/claudiu/Desktop/Miro-1.0/Miro-1.0' is not a working copy
running install_egg_info
Removing ./dist/usr/lib/python2.5/site-packages/miro-1.0-py2.5.egg-info
Writing ./dist/usr/lib/python2.5/site-packages/miro-1.0-py2.5.egg-info
/usr/local/lib/xulrunner-1.8.0.4
...................................................................................................E.........................................................WARNING:root:KeyError for element abc123 in HTMLChangeOptimizer.calcChanges()
F...............................................................................................................................
======================================================================
ERROR: testGetFilenameFromResponse (test.httpclienttest.HTTPClientTest)
----------------------------------------------------------------------
Traceback (most recent call last):
File "/usr/lib/python2.5/site-packages/miro/test/httpclienttest.py", line 1190, in testGetFilenameFromResponse
File "/usr/lib/python2.5/site-packages/miro/test/httpclienttest.py", line 1188, in getIt
File "/usr/lib/python2.5/site-packages/miro/httpclient.py", line 1773, in getFilenameFromResponse
return filenameFromURL(util.unicodify(response['redirected-url']), clean=True)
KeyError: 'redirected-url'
======================================================================
FAIL: testChangeWithoutInitalHTML (test.templatetest.OptimizedAttributeChangeTest)
----------------------------------------------------------------------
Traceback (most recent call last):
File "/usr/lib/python2.5/site-packages/miro/test/templatetest.py", line 413, in testChangeWithoutInitalHTML
AssertionError: KeyError not raised
----------------------------------------------------------------------
Ran 285 tests in 84.416s
FAILED (failures=1, errors=1)
root@fermi:/home/claudiu/Desktop/Miro-1.0/Miro-1.0/platform/gtk-x11#