All pastes #777503 Raw Edit

Someone

public text v1 · immutable
·published 2007-11-16 21:09 UTC
rendered paste body
------ Build started: Project: projekti, Configuration: Debug Win32 ------
Compiling...
main.c
c:\documents and settings\tenho ruohoranta\my documents\visual studio 2005\projects\projekti\main.c(34) : error C2143: syntax error : missing ';' before 'type'
c:\documents and settings\tenho ruohoranta\my documents\visual studio 2005\projects\projekti\main.c(36) : error C2143: syntax error : missing ';' before 'type'
c:\documents and settings\tenho ruohoranta\my documents\visual studio 2005\projects\projekti\main.c(39) : error C2065: 'foo' : undeclared identifier
c:\documents and settings\tenho ruohoranta\my documents\visual studio 2005\projects\projekti\main.c(39) : error C2224: left of '.x' must have struct/union type
c:\documents and settings\tenho ruohoranta\my documents\visual studio 2005\projects\projekti\main.c(39) : error C2065: 'x1' : undeclared identifier
c:\documents and settings\tenho ruohoranta\my documents\visual studio 2005\projects\projekti\main.c(40) : error C2224: left of '.y' must have struct/union type
c:\documents and settings\tenho ruohoranta\my documents\visual studio 2005\projects\projekti\main.c(40) : error C2065: 'y1' : undeclared identifier
c:\documents and settings\tenho ruohoranta\my documents\visual studio 2005\projects\projekti\main.c(44) : warning C4013: 'luo_piste' undefined; assuming extern returning int
c:\documents and settings\tenho ruohoranta\my documents\visual studio 2005\projects\projekti\main.c(44) : error C2099: initializer is not a constant
c:\documents and settings\tenho ruohoranta\my documents\visual studio 2005\projects\projekti\main.c(46) : error C2143: syntax error : missing ')' before 'string'
c:\documents and settings\tenho ruohoranta\my documents\visual studio 2005\projects\projekti\main.c(46) : error C2143: syntax error : missing '{' before 'string'
c:\documents and settings\tenho ruohoranta\my documents\visual studio 2005\projects\projekti\main.c(46) : error C2059: syntax error : '<Unknown>'
c:\documents and settings\tenho ruohoranta\my documents\visual studio 2005\projects\projekti\main.c(46) : error C2059: syntax error : ')'
c:\documents and settings\tenho ruohoranta\my documents\visual studio 2005\projects\projekti\main.c(48) : error C2079: 'summavektori' uses undefined struct 'Piste'
c:\documents and settings\tenho ruohoranta\my documents\visual studio 2005\projects\projekti\main.c(51) : error C2079: 'paikkavektoreiden_summa' uses undefined struct 'Piste'
c:\documents and settings\tenho ruohoranta\my documents\visual studio 2005\projects\projekti\main.c(52) : error C2079: 'foo' uses undefined struct 'Piste'
c:\documents and settings\tenho ruohoranta\my documents\visual studio 2005\projects\projekti\main.c(53) : error C2224: left of '.x' must have struct/union type
c:\documents and settings\tenho ruohoranta\my documents\visual studio 2005\projects\projekti\main.c(54) : error C2224: left of '.y' must have struct/union type
c:\documents and settings\tenho ruohoranta\my documents\visual studio 2005\projects\projekti\main.c(56) : error C2440: 'return' : cannot convert from 'int' to 'Piste'
c:\documents and settings\tenho ruohoranta\my documents\visual studio 2005\projects\projekti\main.c(59) : error C2099: initializer is not a constant
c:\documents and settings\tenho ruohoranta\my documents\visual studio 2005\projects\projekti\main.c(61) : error C2143: syntax error : missing ')' before 'string'
c:\documents and settings\tenho ruohoranta\my documents\visual studio 2005\projects\projekti\main.c(61) : error C2143: syntax error : missing '{' before 'string'
c:\documents and settings\tenho ruohoranta\my documents\visual studio 2005\projects\projekti\main.c(61) : error C2059: syntax error : '<Unknown>'
c:\documents and settings\tenho ruohoranta\my documents\visual studio 2005\projects\projekti\main.c(61) : error C2059: syntax error : ')'
c:\documents and settings\tenho ruohoranta\my documents\visual studio 2005\projects\projekti\main.c(63) : error C2059: syntax error : '}'
Build log was saved at "file://c:\Documents and Settings\Tenho Ruohoranta\My Documents\Visual Studio 2005\Projects\projekti\Debug\BuildLog.htm"
projekti - 24 error(s), 1 warning(s)
========== Build: 0 succeeded, 1 failed, 0 up-to-date, 0 skipped ==========