In file included from /usr/include/mysql/mysql.h:68,
from src/mysql/mysql.h:1,
from src/main.h:4,
from src/main.c:1:
/usr/include/mysql/mysql_com.h:223: error: expected identifier or ‘(’ before string constant
/usr/include/mysql/mysql_com.h:336: error: expected declaration specifiers or ‘...’ before string constant
/usr/include/mysql/mysql_com.h:337: error: expected declaration specifiers or ‘...’ before string constant
/usr/include/mysql/mysql_com.h:338: error: expected declaration specifiers or ‘...’ before string constant
/usr/include/mysql/mysql_com.h:339: error: expected declaration specifiers or ‘...’ before string constant
/usr/include/mysql/mysql_com.h:340: error: expected declaration specifiers or ‘...’ before string constant
/usr/include/mysql/mysql_com.h:341: error: expected declaration specifiers or ‘...’ before string constant
/usr/include/mysql/mysql_com.h:342: error: expected declaration specifiers or ‘...’ before string constant
/usr/include/mysql/mysql_com.h:343: error: expected declaration specifiers or ‘...’ before string constant
/usr/include/mysql/mysql_com.h:346: error: expected declaration specifiers or ‘...’ before string constant
/usr/include/mysql/mysql_com.h:347: error: expected declaration specifiers or ‘...’ before string constant
In file included from src/mysql/mysql.h:1,
from src/main.h:4,
from src/main.c:1:
/usr/include/mysql/mysql.h:253: error: expected specifier-qualifier-list before string constant
/usr/include/mysql/mysql.h:342: error: expected specifier-qualifier-list before string constant
/usr/include/mysql/mysql.h:672: error: expected declaration specifiers or ‘...’ before string constant
make: *** [all] Error 1