[ 37%] Building CXX object kresources/birthdays/CMakeFiles/kcal_kabc.dir/resourcekabcconfig.o
/home/tpr/kde4/src/build/kdepim/kresources/birthdays/kabprefs_base.h:13: error: expected class-name before '{' token
/home/tpr/kde4/src/build/kdepim/kresources/birthdays/kabprefs_base.h:40: error: ISO C++ forbids declaration of 'ItemBool' with no type
/home/tpr/kde4/src/build/kdepim/kresources/birthdays/kabprefs_base.h:40: error: expected ';' before '*' token
/home/tpr/kde4/src/build/kdepim/kresources/birthdays/kabprefs_base.h:48: error: expected `;' before 'void'
/home/tpr/kde4/src/build/kdepim/kresources/birthdays/kabprefs_base.h:65: error: ISO C++ forbids declaration of 'ItemInt' with no type
/home/tpr/kde4/src/build/kdepim/kresources/birthdays/kabprefs_base.h:65: error: expected ';' before '*' token
/home/tpr/kde4/src/build/kdepim/kresources/birthdays/kabprefs_base.h:73: error: expected `;' before 'void'
/home/tpr/kde4/src/build/kdepim/kresources/birthdays/kabprefs_base.h:90: error: ISO C++ forbids declaration of 'ItemString' with no type
/home/tpr/kde4/src/build/kdepim/kresources/birthdays/kabprefs_base.h:90: error: expected ';' before '*' token
/home/tpr/kde4/src/build/kdepim/kresources/birthdays/kabprefs_base.h:98: error: expected `;' before 'void'
/home/tpr/kde4/src/build/kdepim/kresources/birthdays/kabprefs_base.h:115: error: ISO C++ forbids declaration of 'ItemString' with no type
/home/tpr/kde4/src/build/kdepim/kresources/birthdays/kabprefs_base.h:115: error: expected ';' before '*' token
/home/tpr/kde4/src/build/kdepim/kresources/birthdays/kabprefs_base.h:123: error: expected `;' before 'void'
/home/tpr/kde4/src/build/kdepim/kresources/birthdays/kabprefs_base.h:140: error: ISO C++ forbids declaration of 'ItemString' with no type
/home/tpr/kde4/src/build/kdepim/kresources/birthdays/kabprefs_base.h:140: error: expected ';' before '*' token
/home/tpr/kde4/src/build/kdepim/kresources/birthdays/kabprefs_base.h:148: error: expected `;' before 'void'
/home/tpr/kde4/src/build/kdepim/kresources/birthdays/kabprefs_base.h:165: error: ISO C++ forbids declaration of 'ItemBool' with no type
/home/tpr/kde4/src/build/kdepim/kresources/birthdays/kabprefs_base.h:165: error: expected ';' before '*' token
/home/tpr/kde4/src/build/kdepim/kresources/birthdays/kabprefs_base.h:173: error: expected `;' before 'void'
/home/tpr/kde4/src/build/kdepim/kresources/birthdays/kabprefs_base.h:190: error: ISO C++ forbids declaration of 'ItemString' with no type
/home/tpr/kde4/src/build/kdepim/kresources/birthdays/kabprefs_base.h:190: error: expected ';' before '*' token
/home/tpr/kde4/src/build/kdepim/kresources/birthdays/kabprefs_base.h:198: error: expected `;' before 'void'
/home/tpr/kde4/src/build/kdepim/kresources/birthdays/kabprefs_base.h:215: error: ISO C++ forbids declaration of 'ItemStringList' with no type
/home/tpr/kde4/src/build/kdepim/kresources/birthdays/kabprefs_base.h:215: error: expected ';' before '*' token
/home/tpr/kde4/src/build/kdepim/kresources/birthdays/kabprefs_base.h:223: error: expected `;' before 'void'
/home/tpr/kde4/src/build/kdepim/kresources/birthdays/kabprefs_base.h:240: error: ISO C++ forbids declaration of 'ItemBool' with no type
/home/tpr/kde4/src/build/kdepim/kresources/birthdays/kabprefs_base.h:240: error: expected ';' before '*' token
/home/tpr/kde4/src/build/kdepim/kresources/birthdays/kabprefs_base.h:248: error: expected `;' before 'void'
/home/tpr/kde4/src/build/kdepim/kresources/birthdays/kabprefs_base.h:265: error: ISO C++ forbids declaration of 'ItemBool' with no type
/home/tpr/kde4/src/build/kdepim/kresources/birthdays/kabprefs_base.h:265: error: expected ';' before '*' token
/home/tpr/kde4/src/build/kdepim/kresources/birthdays/kabprefs_base.h:273: error: expected `;' before 'void'
/home/tpr/kde4/src/build/kdepim/kresources/birthdays/kabprefs_base.h:290: error: ISO C++ forbids declaration of 'ItemIntList' with no type
/home/tpr/kde4/src/build/kdepim/kresources/birthdays/kabprefs_base.h:290: error: expected ';' before '*' token
/home/tpr/kde4/src/build/kdepim/kresources/birthdays/kabprefs_base.h:298: error: expected `;' before 'void'
/home/tpr/kde4/src/build/kdepim/kresources/birthdays/kabprefs_base.h:315: error: ISO C++ forbids declaration of 'ItemIntList' with no type
/home/tpr/kde4/src/build/kdepim/kresources/birthdays/kabprefs_base.h:315: error: expected ';' before '*' token
/home/tpr/kde4/src/build/kdepim/kresources/birthdays/kabprefs_base.h:323: error: expected `;' before 'void'
/home/tpr/kde4/src/build/kdepim/kresources/birthdays/kabprefs_base.h:340: error: ISO C++ forbids declaration of 'ItemString' with no type
/home/tpr/kde4/src/build/kdepim/kresources/birthdays/kabprefs_base.h:340: error: expected ';' before '*' token
/home/tpr/kde4/src/build/kdepim/kresources/birthdays/kabprefs_base.h:348: error: expected `;' before 'void'
/home/tpr/kde4/src/build/kdepim/kresources/birthdays/kabprefs_base.h:365: error: ISO C++ forbids declaration of 'ItemInt' with no type
/home/tpr/kde4/src/build/kdepim/kresources/birthdays/kabprefs_base.h:365: error: expected ';' before '*' token
/home/tpr/kde4/src/build/kdepim/kresources/birthdays/kabprefs_base.h:373: error: expected `;' before 'void'
/home/tpr/kde4/src/build/kdepim/kresources/birthdays/kabprefs_base.h:390: error: ISO C++ forbids declaration of 'ItemEnum' with no type
/home/tpr/kde4/src/build/kdepim/kresources/birthdays/kabprefs_base.h:390: error: expected ';' before '*' token
/home/tpr/kde4/src/build/kdepim/kresources/birthdays/kabprefs_base.h:398: error: expected `;' before 'void'
/home/tpr/kde4/src/build/kdepim/kresources/birthdays/kabprefs_base.h:415: error: ISO C++ forbids declaration of 'ItemStringList' with no type
/home/tpr/kde4/src/build/kdepim/kresources/birthdays/kabprefs_base.h:415: error: expected ';' before '*' token
/home/tpr/kde4/src/build/kdepim/kresources/birthdays/kabprefs_base.h:423: error: expected `;' before 'void'
/home/tpr/kde4/src/build/kdepim/kresources/birthdays/kabprefs_base.h:440: error: ISO C++ forbids declaration of 'ItemStringList' with no type
/home/tpr/kde4/src/build/kdepim/kresources/birthdays/kabprefs_base.h:440: error: expected ';' before '*' token
/home/tpr/kde4/src/build/kdepim/kresources/birthdays/kabprefs_base.h:445: error: expected `;' before 'protected'
/home/tpr/kde4/src/build/kdepim/kresources/birthdays/kabprefs_base.h:478: error: ISO C++ forbids declaration of 'ItemBool' with no type
/home/tpr/kde4/src/build/kdepim/kresources/birthdays/kabprefs_base.h:478: error: expected ';' before '*' token
/home/tpr/kde4/src/build/kdepim/kresources/birthdays/kabprefs_base.h:479: error: ISO C++ forbids declaration of 'ItemInt' with no type
/home/tpr/kde4/src/build/kdepim/kresources/birthdays/kabprefs_base.h:479: error: expected ';' before '*' token
/home/tpr/kde4/src/build/kdepim/kresources/birthdays/kabprefs_base.h:480: error: ISO C++ forbids declaration of 'ItemString' with no type
/home/tpr/kde4/src/build/kdepim/kresources/birthdays/kabprefs_base.h:480: error: expected ';' before '*' token
/home/tpr/kde4/src/build/kdepim/kresources/birthdays/kabprefs_base.h:481: error: ISO C++ forbids declaration of 'ItemString' with no type
/home/tpr/kde4/src/build/kdepim/kresources/birthdays/kabprefs_base.h:481: error: expected ';' before '*' token
/home/tpr/kde4/src/build/kdepim/kresources/birthdays/kabprefs_base.h:482: error: ISO C++ forbids declaration of 'ItemString' with no type
/home/tpr/kde4/src/build/kdepim/kresources/birthdays/kabprefs_base.h:482: error: expected ';' before '*' token
/home/tpr/kde4/src/build/kdepim/kresources/birthdays/kabprefs_base.h:483: error: ISO C++ forbids declaration of 'ItemBool' with no type
/home/tpr/kde4/src/build/kdepim/kresources/birthdays/kabprefs_base.h:483: error: expected ';' before '*' token
/home/tpr/kde4/src/build/kdepim/kresources/birthdays/kabprefs_base.h:484: error: ISO C++ forbids declaration of 'ItemString' with no type
/home/tpr/kde4/src/build/kdepim/kresources/birthdays/kabprefs_base.h:484: error: expected ';' before '*' token
/home/tpr/kde4/src/build/kdepim/kresources/birthdays/kabprefs_base.h:485: error: ISO C++ forbids declaration of 'ItemStringList' with no type
/home/tpr/kde4/src/build/kdepim/kresources/birthdays/kabprefs_base.h:485: error: expected ';' before '*' token
/home/tpr/kde4/src/build/kdepim/kresources/birthdays/kabprefs_base.h:486: error: ISO C++ forbids declaration of 'ItemBool' with no type
/home/tpr/kde4/src/build/kdepim/kresources/birthdays/kabprefs_base.h:486: error: expected ';' before '*' token
/home/tpr/kde4/src/build/kdepim/kresources/birthdays/kabprefs_base.h:487: error: ISO C++ forbids declaration of 'ItemBool' with no type
/home/tpr/kde4/src/build/kdepim/kresources/birthdays/kabprefs_base.h:487: error: expected ';' before '*' token
/home/tpr/kde4/src/build/kdepim/kresources/birthdays/kabprefs_base.h:488: error: ISO C++ forbids declaration of 'ItemIntList' with no type
/home/tpr/kde4/src/build/kdepim/kresources/birthdays/kabprefs_base.h:488: error: expected ';' before '*' token
/home/tpr/kde4/src/build/kdepim/kresources/birthdays/kabprefs_base.h:489: error: ISO C++ forbids declaration of 'ItemIntList' with no type
/home/tpr/kde4/src/build/kdepim/kresources/birthdays/kabprefs_base.h:489: error: expected ';' before '*' token
/home/tpr/kde4/src/build/kdepim/kresources/birthdays/kabprefs_base.h:490: error: ISO C++ forbids declaration of 'ItemString' with no type
/home/tpr/kde4/src/build/kdepim/kresources/birthdays/kabprefs_base.h:490: error: expected ';' before '*' token
/home/tpr/kde4/src/build/kdepim/kresources/birthdays/kabprefs_base.h:491: error: ISO C++ forbids declaration of 'ItemInt' with no type
/home/tpr/kde4/src/build/kdepim/kresources/birthdays/kabprefs_base.h:491: error: expected ';' before '*' token
/home/tpr/kde4/src/build/kdepim/kresources/birthdays/kabprefs_base.h:492: error: ISO C++ forbids declaration of 'ItemEnum' with no type
/home/tpr/kde4/src/build/kdepim/kresources/birthdays/kabprefs_base.h:492: error: expected ';' before '*' token
/home/tpr/kde4/src/build/kdepim/kresources/birthdays/kabprefs_base.h:493: error: ISO C++ forbids declaration of 'ItemStringList' with no type
/home/tpr/kde4/src/build/kdepim/kresources/birthdays/kabprefs_base.h:493: error: expected ';' before '*' token
/home/tpr/kde4/src/build/kdepim/kresources/birthdays/kabprefs_base.h:494: error: ISO C++ forbids declaration of 'ItemStringList' with no type
/home/tpr/kde4/src/build/kdepim/kresources/birthdays/kabprefs_base.h:494: error: expected ';' before '*' token
/home/tpr/kde4/src/build/kdepim/kresources/birthdays/kabprefs_base.h: In member function 'void KABPrefsBase::setAutomaticNameParsing(bool)':
/home/tpr/kde4/src/build/kdepim/kresources/birthdays/kabprefs_base.h:25: error: 'isImmutable' was not declared in this scope
/home/tpr/kde4/src/build/kdepim/kresources/birthdays/kabprefs_base.h: In member function 'void KABPrefsBase::setCurrentIncSearchField(int)':
/home/tpr/kde4/src/build/kdepim/kresources/birthdays/kabprefs_base.h:50: error: 'isImmutable' was not declared in this scope
/home/tpr/kde4/src/build/kdepim/kresources/birthdays/kabprefs_base.h: In member function 'void KABPrefsBase::setPhoneHookApplication(const QString&)':
/home/tpr/kde4/src/build/kdepim/kresources/birthdays/kabprefs_base.h:75: error: 'isImmutable' was not declared in this scope
/home/tpr/kde4/src/build/kdepim/kresources/birthdays/kabprefs_base.h: In member function 'void KABPrefsBase::setFaxHookApplication(const QString&)':
/home/tpr/kde4/src/build/kdepim/kresources/birthdays/kabprefs_base.h:100: error: 'isImmutable' was not declared in this scope
/home/tpr/kde4/src/build/kdepim/kresources/birthdays/kabprefs_base.h: In member function 'void KABPrefsBase::setSMSHookApplication(const QString&)':
/home/tpr/kde4/src/build/kdepim/kresources/birthdays/kabprefs_base.h:125: error: 'isImmutable' was not declared in this scope
/home/tpr/kde4/src/build/kdepim/kresources/birthdays/kabprefs_base.h: In member function 'void KABPrefsBase::setHonorSingleClick(bool)':
/home/tpr/kde4/src/build/kdepim/kresources/birthdays/kabprefs_base.h:150: error: 'isImmutable' was not declared in this scope
/home/tpr/kde4/src/build/kdepim/kresources/birthdays/kabprefs_base.h: In member function 'void KABPrefsBase::setCurrentView(const QString&)':
/home/tpr/kde4/src/build/kdepim/kresources/birthdays/kabprefs_base.h:175: error: 'isImmutable' was not declared in this scope
/home/tpr/kde4/src/build/kdepim/kresources/birthdays/kabprefs_base.h: In member function 'void KABPrefsBase::setViewNames(const QStringList&)':
/home/tpr/kde4/src/build/kdepim/kresources/birthdays/kabprefs_base.h:200: error: 'isImmutable' was not declared in this scope
/home/tpr/kde4/src/build/kdepim/kresources/birthdays/kabprefs_base.h: In member function 'void KABPrefsBase::setJumpButtonBarVisible(bool)':
/home/tpr/kde4/src/build/kdepim/kresources/birthdays/kabprefs_base.h:225: error: 'isImmutable' was not declared in this scope
/home/tpr/kde4/src/build/kdepim/kresources/birthdays/kabprefs_base.h: In member function 'void KABPrefsBase::setDetailsPageVisible(bool)':
/home/tpr/kde4/src/build/kdepim/kresources/birthdays/kabprefs_base.h:250: error: 'isImmutable' was not declared in this scope
/home/tpr/kde4/src/build/kdepim/kresources/birthdays/kabprefs_base.h: In member function 'void KABPrefsBase::setExtensionsSplitter(const QList<int>&)':
/home/tpr/kde4/src/build/kdepim/kresources/birthdays/kabprefs_base.h:275: error: 'isImmutable' was not declared in this scope
/home/tpr/kde4/src/build/kdepim/kresources/birthdays/kabprefs_base.h: In member function 'void KABPrefsBase::setDetailsSplitter(const QList<int>&)':
/home/tpr/kde4/src/build/kdepim/kresources/birthdays/kabprefs_base.h:300: error: 'isImmutable' was not declared in this scope
/home/tpr/kde4/src/build/kdepim/kresources/birthdays/kabprefs_base.h: In member function 'void KABPrefsBase::setCurrentExtension(const QString&)':
/home/tpr/kde4/src/build/kdepim/kresources/birthdays/kabprefs_base.h:325: error: 'isImmutable' was not declared in this scope
/home/tpr/kde4/src/build/kdepim/kresources/birthdays/kabprefs_base.h: In member function 'void KABPrefsBase::setCurrentFilter(int)':
/home/tpr/kde4/src/build/kdepim/kresources/birthdays/kabprefs_base.h:350: error: 'isImmutable' was not declared in this scope
/home/tpr/kde4/src/build/kdepim/kresources/birthdays/kabprefs_base.h: In member function 'void KABPrefsBase::setEditorType(int)':
/home/tpr/kde4/src/build/kdepim/kresources/birthdays/kabprefs_base.h:375: error: 'isImmutable' was not declared in this scope
/home/tpr/kde4/src/build/kdepim/kresources/birthdays/kabprefs_base.h: In member function 'void KABPrefsBase::setGlobalCustomFields(const QStringList&)':
/home/tpr/kde4/src/build/kdepim/kresources/birthdays/kabprefs_base.h:400: error: 'isImmutable' was not declared in this scope
/home/tpr/kde4/src/build/kdepim/kresources/birthdays/kabprefs_base.h: In member function 'void KABPrefsBase::setAdvancedCustomFields(const QStringList&)':
/home/tpr/kde4/src/build/kdepim/kresources/birthdays/kabprefs_base.h:425: error: 'isImmutable' was not declared in this scope
/home/tpr/kde4/src/kdepim/kaddressbook/common/kabprefs.h: In member function 'void KABPrefs::setLocationMapURL(const QString&)':
/home/tpr/kde4/src/kdepim/kaddressbook/common/kabprefs.h:43: error: 'isImmutable' was not declared in this scope
/home/tpr/kde4/src/kdepim/kaddressbook/common/kabprefs.h: In member function 'void KABPrefs::setLocationMapURLs(const QStringList&)':
/home/tpr/kde4/src/kdepim/kaddressbook/common/kabprefs.h:54: error: 'isImmutable' was not declared in this scope
/home/tpr/kde4/src/kdepim/kaddressbook/common/kabprefs.h: In member function 'QStringList KABPrefs::customCategories() const':
/home/tpr/kde4/src/kdepim/kaddressbook/common/kabprefs.h:65: error: 'mCustomCategories' was not declared in this scope
/home/tpr/kde4/src/kdepim/kaddressbook/common/kabprefs.h: In member function 'void KABPrefs::setCustomCategories(const QStringList&)':
/home/tpr/kde4/src/kdepim/kaddressbook/common/kabprefs.h:70: error: 'mCustomCategories' was not declared in this scope
/home/tpr/kde4/src/kdepim/kresources/birthdays/resourcekabcconfig.cpp: In constructor 'KCal::ResourceKABCConfig::ResourceKABCConfig(QWidget*)':
/home/tpr/kde4/src/kdepim/kresources/birthdays/resourcekabcconfig.cpp:70: error: no matching function for call to 'KPIM::CategorySelectWidget::CategorySelectWidget(KCal::ResourceKABCConfig* const, KABPrefs*&)'
/home/tpr/kde4/src/kdepim/libkdepim/categoryselectdialog.h:52: note: candidates are: KPIM::CategorySelectWidget::CategorySelectWidget(QWidget*, KPIM::KPimPrefs*)
/home/tpr/kde4/src/kdepim/libkdepim/categoryselectdialog.h:49: note: KPIM::CategorySelectWidget::CategorySelectWidget(const KPIM::CategorySelectWidget&)
make[2]: *** [kresources/birthdays/CMakeFiles/kcal_kabc.dir/resourcekabcconfig.o] Error 1
make[2]: *** Waiting for unfinished jobs....
make[1]: *** [kresources/birthdays/CMakeFiles/kcal_kabc.dir/all] Error 2
make[1]: *** Waiting for unfinished jobs....