All pastes #773610 Raw Edit

Miscellany

public text v1 · immutable
·published 2007-11-14 17:42 UTC
rendered paste body
[INFO] ----------------------------------------------------------------------------
[INFO] Building Main module
[INFO]    task-segment: [install]
[INFO] ----------------------------------------------------------------------------
[WARNING] While downloading javacc:javacc:3.2
  This artifact has been relocated to net.java.dev.javacc:javacc:3.2.


[INFO] [gt2-jjtree-javacc:generate {execution: default}]
Java Compiler Compiler Version 3.2 (Tree Builder)
(type "jjtree" with no arguments for help)
Reading from file /home/ak/geoserver_verification/2.4.x/modules/library/main/src/main/java/org/geotools/filter/parser/expr.jjt . . .
Annotated grammar generated successfully in /home/ak/geoserver_verification/2.4.x/modules/library/main/target/generated-sources/jjtree-javacc/org/geotools/filter/parser/expr.jj
Java Compiler Compiler Version 3.2 (Parser Generator)
(type "javacc" with no arguments for help)
Reading from file /home/ak/geoserver_verification/2.4.x/modules/library/main/target/generated-sources/jjtree-javacc/org/geotools/filter/parser/expr.jj . . .
Parser generated successfully.
[INFO] [resources:resources]
[INFO] Using default encoding to copy filtered resources.
[INFO] [compiler:compile]
[INFO] Compiling 7 source files to /home/ak/geoserver_verification/2.4.x/modules/library/main/target/classes
[INFO] [resources:testResources]
[INFO] Using default encoding to copy filtered resources.
[INFO] [compiler:testCompile]
[INFO] Nothing to compile - all classes are up to date
[INFO] [surefire:test]
[INFO] Surefire report directory: /home/ak/geoserver_verification/2.4.x/modules/library/main/target/surefire-reports

-------------------------------------------------------
 T E S T S
-------------------------------------------------------
Running org.geotools.filter.ExpressionTest
Tests run: 14, Failures: 0, Errors: 0, Skipped: 0, Time elapsed: 0.52 sec
Running org.geotools.filter.function.EqualIntervalFunctionTest
Tests run: 5, Failures: 0, Errors: 0, Skipped: 0, Time elapsed: 0.101 sec
Running org.geotools.feature.FlatFeatureFactorySpiTest
Tests run: 2, Failures: 0, Errors: 0, Skipped: 0, Time elapsed: 0.01 sec
Running org.geotools.filter.CapabilitiesTest
Tests run: 4, Failures: 0, Errors: 0, Skipped: 0, Time elapsed: 0.032 sec
Running org.geotools.styling.XmlnsNamespaceTest
Tests run: 1, Failures: 0, Errors: 0, Skipped: 0, Time elapsed: 0.196 sec
Running org.geotools.util.GeometryConverterFactoryTest
Tests run: 4, Failures: 0, Errors: 0, Skipped: 0, Time elapsed: 0.119 sec
Running org.geotools.data.TransactionTest
Tests run: 2, Failures: 0, Errors: 0, Skipped: 0, Time elapsed: 0.085 sec
Running org.geotools.filter.expression.SimpleFeaturePropertyAccessorFactoryTest
Tests run: 1, Failures: 0, Errors: 0, Skipped: 0, Time elapsed: 0.008 sec
Running org.geotools.filter.AttributeExpressionTest
Tests run: 1, Failures: 0, Errors: 0, Skipped: 0, Time elapsed: 0.008 sec
Running org.geotools.styling.visitor.DuplicatorStyleVisitorTest
Tests run: 1, Failures: 0, Errors: 0, Skipped: 0, Time elapsed: 0.02 sec
Running org.geotools.filter.visitor.DuplicatorFilterVisitorTest
Tests run: 1, Failures: 0, Errors: 0, Skipped: 0, Time elapsed: 0.008 sec
Running org.geotools.feature.DateUtilTest
01:15:00
01:15:00
Tests run: 3, Failures: 0, Errors: 0, Skipped: 0, Time elapsed: 0.03 sec
Running org.geotools.data.DefaultQueryTest
testGetFilter
testPropertyNames
testRetrieveAllProperties
testMaxFeatures
testGetHandle
testGetVersion
testToString
Tests run: 9, Failures: 0, Errors: 0, Skipped: 0, Time elapsed: 0.011 sec
Running org.geotools.data.DataUtilitiesTest
Nov 14, 2007 5:35:49 PM org.geotools.data.DefaultTransaction finalize
SEVERE: There's code leaving transaction unclosed. Call Transaction.close() after using them to ensure they do not hold state such as JDCB connections or file handles
Nov 14, 2007 5:35:49 PM org.geotools.data.DefaultTransaction finalize
SEVERE: Unclosed transaction handle is 'org.geotools.data.TransactionTest.testRemoveFeature Transaction'
Nov 14, 2007 5:35:49 PM org.geotools.data.DefaultTransaction finalize
SEVERE: There's code leaving transaction unclosed. Call Transaction.close() after using them to ensure they do not hold state such as JDCB connections or file handles
Nov 14, 2007 5:35:49 PM org.geotools.data.DefaultTransaction finalize
SEVERE: Unclosed transaction handle is 'org.geotools.data.TransactionTest.testAddFeature Transaction'
Tests run: 25, Failures: 3, Errors: 0, Skipped: 0, Time elapsed: 1.862 sec <<< FAILURE!
Running org.geotools.data.store.ReprojectingFeatureCollectionTest
Tests run: 1, Failures: 0, Errors: 0, Skipped: 0, Time elapsed: 0.111 sec
Running org.geotools.feature.FeatureTypeFactoryTest
Tests run: 1, Failures: 0, Errors: 0, Skipped: 0, Time elapsed: 0.009 sec
Running org.geotools.filter.DOMParserTest
Nov 14, 2007 5:35:51 PM org.geotools.feature.FeatureWrappedComplexTest testWrappedAccessIndex
INFO: simple is: Feature[ id=fid--37e046_1163f3b2478_-7fcb , testGeometry=POINT (1 2) , testBoolean=true , testCharacter=t , testByte=10 , testShort=101 , testInteger=1002 , testLong=10003 , testFloat=10000.4 , testDouble=100000.5 , testString=test string data ], and wrapped is: Feature[ id=fid--37e046_1163f3b2478_-7fcc , testGeometry=[POINT (1 2)] , testBoolean=[true] , testCharacter=[t] , testByte=[10] , testShort=[101] , testInteger=[1002] , testLong=[10003] , testFloat=[10000.4] , testDouble=[100000.5] , testString=[test string data] ]
Nov 14, 2007 5:35:51 PM org.geotools.feature.FeatureWrappedComplexTest testWrappedAccessIndex
INFO: intAtt is: [1002]
Tests run: 15, Failures: 0, Errors: 0, Skipped: 0, Time elapsed: 0.144 sec
Running org.geotools.feature.FeatureWrappedComplexTest
Tests run: 6, Failures: 0, Errors: 0, Skipped: 0, Time elapsed: 0.056 sec
Running org.geotools.data.memory.MemoryDataStoreTest
Tests run: 37, Failures: 0, Errors: 0, Skipped: 0, Time elapsed: 0.776 sec
Running org.geotools.geometry.jts.JTSTest
Tests run: 4, Failures: 0, Errors: 0, Skipped: 0, Time elapsed: 0.045 sec
Running org.geotools.filter.visitor.DuplicateFilterVisitorTest
Tests run: 3, Failures: 0, Errors: 0, Skipped: 0, Time elapsed: 0.009 sec
Running org.geotools.data.ArrayFeatureReaderTest
Tests run: 4, Failures: 0, Errors: 0, Skipped: 0, Time elapsed: 0.011 sec
Running org.geotools.styling.StyleAttributeExtractorTest
Tests run: 12, Failures: 0, Errors: 0, Skipped: 0, Time elapsed: 0.04 sec
Running org.geotools.filter.IsEqualsToImplTest
Tests run: 8, Failures: 0, Errors: 0, Skipped: 0, Time elapsed: 0.009 sec
Running org.geotools.feature.FeatureTypeTest
Tests run: 4, Failures: 0, Errors: 0, Skipped: 0, Time elapsed: 0.023 sec
Running org.geotools.feature.FeatureFlatTest
Tests run: 10, Failures: 0, Errors: 0, Skipped: 0, Time elapsed: 0.03 sec
Running org.geotools.util.NumericConverterFactoryTest
Tests run: 4, Failures: 0, Errors: 0, Skipped: 0, Time elapsed: 0.01 sec
Running org.geotools.filter.expression.AddImplTest
Tests run: 3, Failures: 0, Errors: 0, Skipped: 0, Time elapsed: 0.006 sec
Running org.geotools.feature.visitor.CalcResultTest
Tests run: 5, Failures: 0, Errors: 0, Skipped: 0, Time elapsed: 0.007 sec
Running org.geotools.filter.function.UniqueIntervalFunctionTest
Tests run: 5, Failures: 0, Errors: 0, Skipped: 0, Time elapsed: 0.018 sec
Running org.geotools.filter.visitor.PostPreProcessFilterSplitterVisitorFunctionTest
Nov 14, 2007 5:35:52 PM org.geotools.data.DefaultTransaction finalize
SEVERE: There's code leaving transaction unclosed. Call Transaction.close() after using them to ensure they do not hold state such as JDCB connections or file handles
Nov 14, 2007 5:35:52 PM org.geotools.data.DefaultTransaction finalize
SEVERE: Unclosed transaction handle is 'org.geotools.data.memory.MemoryDataStoreTest.testGetFeatureReaderFilterTransaction Transaction'
Nov 14, 2007 5:35:52 PM org.geotools.data.DefaultTransaction finalize
SEVERE: There's code leaving transaction unclosed. Call Transaction.close() after using them to ensure they do not hold state such as JDCB connections or file handles
Nov 14, 2007 5:35:52 PM org.geotools.data.DefaultTransaction finalize
SEVERE: Unclosed transaction handle is 'org.geotools.data.memory.MemoryDataStoreTest.testGetFeatureWriterTransaction Transaction'
Nov 14, 2007 5:35:52 PM org.geotools.data.DefaultTransaction finalize
SEVERE: There's code leaving transaction unclosed. Call Transaction.close() after using them to ensure they do not hold state such as JDCB connections or file handles
Nov 14, 2007 5:35:52 PM org.geotools.data.DefaultTransaction finalize
SEVERE: Unclosed transaction handle is 'org.geotools.data.memory.MemoryDataStoreTest.testGetFeatureWriterTransaction Transaction'
Nov 14, 2007 5:35:52 PM org.geotools.data.DefaultTransaction finalize
SEVERE: There's code leaving transaction unclosed. Call Transaction.close() after using them to ensure they do not hold state such as JDCB connections or file handles
Nov 14, 2007 5:35:52 PM org.geotools.data.DefaultTransaction finalize
SEVERE: Unclosed transaction handle is 'org.geotools.data.memory.MemoryDataStoreTest.testModifyInTransactionFidFilter Transaction'
Tests run: 2, Failures: 0, Errors: 0, Skipped: 0, Time elapsed: 0.039 sec
Nov 14, 2007 5:35:52 PM org.geotools.data.DefaultTransaction finalize
SEVERE: There's code leaving transaction unclosed. Call Transaction.close() after using them to ensure they do not hold state such as JDCB connections or file handles
Running org.geotools.filter.visitor.DefaultFilterVisitorTest
Nov 14, 2007 5:35:52 PM org.geotools.data.DefaultTransaction finalize
SEVERE: Unclosed transaction handle is 'org.geotools.data.memory.MemoryDataStoreTest.testGetFeatureStoreTransactionSupport Transaction'
Nov 14, 2007 5:35:52 PM org.geotools.data.DefaultTransaction finalize
SEVERE: There's code leaving transaction unclosed. Call Transaction.close() after using them to ensure they do not hold state such as JDCB connections or file handles
Nov 14, 2007 5:35:52 PM org.geotools.data.DefaultTransaction finalize
SEVERE: Unclosed transaction handle is 'org.geotools.data.memory.MemoryDataStoreTest.testGetFeatureStoreTransactionSupport Transaction'
Nov 14, 2007 5:35:52 PM org.geotools.data.DefaultTransaction finalize
SEVERE: There's code leaving transaction unclosed. Call Transaction.close() after using them to ensure they do not hold state such as JDCB connections or file handles
Nov 14, 2007 5:35:52 PM org.geotools.data.DefaultTransaction finalize
SEVERE: Unclosed transaction handle is 'org.geotools.data.memory.MemoryDataStoreTest.testFeatureEvents Transaction'
Nov 14, 2007 5:35:52 PM org.geotools.data.DefaultTransaction finalize
SEVERE: There's code leaving transaction unclosed. Call Transaction.close() after using them to ensure they do not hold state such as JDCB connections or file handles
Nov 14, 2007 5:35:52 PM org.geotools.data.DefaultTransaction finalize
SEVERE: Unclosed transaction handle is 'org.geotools.data.memory.MemoryDataStoreTest.testUnLockFeatures Transaction'
Nov 14, 2007 5:35:52 PM org.geotools.data.DefaultTransaction finalize
SEVERE: There's code leaving transaction unclosed. Call Transaction.close() after using them to ensure they do not hold state such as JDCB connections or file handles
Nov 14, 2007 5:35:52 PM org.geotools.data.DefaultTransaction finalize
SEVERE: Unclosed transaction handle is 'org.geotools.data.memory.MemoryDataStoreTest.testLockFeatureInteraction Transaction'
Nov 14, 2007 5:35:52 PM org.geotools.data.DefaultTransaction finalize
SEVERE: There's code leaving transaction unclosed. Call Transaction.close() after using them to ensure they do not hold state such as JDCB connections or file handles
Nov 14, 2007 5:35:52 PM org.geotools.data.DefaultTransaction finalize
SEVERE: Unclosed transaction handle is 'org.geotools.data.memory.MemoryDataStoreTest.testLockFeatureInteraction Transaction'
Tests run: 2, Failures: 0, Errors: 0, Skipped: 0, Time elapsed: 0.012 sec
Running org.geotools.filter.AttributeTest
Tests run: 1, Failures: 0, Errors: 0, Skipped: 0, Time elapsed: 0.008 sec
Running org.geotools.data.crs.ForceCoordinateSystemFeatureReaderTest
Tests run: 4, Failures: 0, Errors: 0, Skipped: 0, Time elapsed: 0.014 sec
Running org.geotools.filter.FunctionExpressionImplTest
Tests run: 11, Failures: 0, Errors: 0, Skipped: 0, Time elapsed: 0.029 sec
Running org.geotools.data.view.DefaultViewTest
Tests run: 4, Failures: 0, Errors: 0, Skipped: 0, Time elapsed: 0.017 sec
Running org.geotools.styling.UserLayerTest
Nov 14, 2007 5:35:53 PM org.geotools.styling.SLDTransformer <init>
INFO: Added [1] namespace entries resulting in [1] distinct entries
Nov 14, 2007 5:35:53 PM org.geotools.styling.SLDTransformer$SLDTranslator visitInlineFeatureType
INFO: Reducing CRS name [EPSG:4326] to its SRID
Nov 14, 2007 5:35:53 PM org.geotools.styling.SLDParser parseUserLayer
INFO: layer name: user-layer-1
Nov 14, 2007 5:35:53 PM org.geotools.styling.SLDTransformer$SLDTranslator visitInlineFeatureType
INFO: Reducing CRS name [EPSG:4326] to its SRID
Nov 14, 2007 5:35:53 PM org.geotools.styling.SLDParser parseUserLayer
INFO: layer name: LayerWithRemoteOWS
Tests run: 2, Failures: 0, Errors: 0, Skipped: 0, Time elapsed: 0.067 sec
Running org.geotools.styling.TextSymbolTest
Tests run: 1, Failures: 0, Errors: 0, Skipped: 0, Time elapsed: 0.008 sec
Running org.geotools.filter.expression.SimpleFeaturePropertyAccessorTest
Tests run: 6, Failures: 0, Errors: 0, Skipped: 0, Time elapsed: 0.009 sec
Running org.geotools.filter.FilterFilterTest
Tests run: 4, Failures: 0, Errors: 0, Skipped: 0, Time elapsed: 0.185 sec
Running org.geotools.filter.FilterFactoryBeforeTest
Tests run: 3, Failures: 0, Errors: 0, Skipped: 0, Time elapsed: 0.006 sec
Running org.geotools.filter.expression.ValueTest
Tests run: 3, Failures: 0, Errors: 0, Skipped: 0, Time elapsed: 0.005 sec
Running org.geotools.filter.FilterAttributeExtractorTest
Tests run: 8, Failures: 0, Errors: 0, Skipped: 0, Time elapsed: 0.022 sec
Running org.geotools.geometry.jts.LiteShapeTest
Tests run: 3, Failures: 0, Errors: 0, Skipped: 0, Time elapsed: 0.037 sec
Running org.geotools.data.FeatureLockTest
Tests run: 5, Failures: 0, Errors: 0, Skipped: 0, Time elapsed: 0.007 sec
Running org.geotools.styling.StyleObjectTest
Tests run: 18, Failures: 0, Errors: 0, Skipped: 0, Time elapsed: 0.021 sec
Running org.geotools.util.TemporalConverterFactoryTest
Tests run: 8, Failures: 0, Errors: 0, Skipped: 0, Time elapsed: 0.013 sec
Running org.geotools.filter.ExpressionBuilderTest
Tests run: 8, Failures: 0, Errors: 0, Skipped: 0, Time elapsed: 0.033 sec
Running org.geotools.util.BooleanConverterFactoryTest
Tests run: 2, Failures: 0, Errors: 0, Skipped: 0, Time elapsed: 0.008 sec
Running org.geotools.data.DiffWriterTest
Tests run: 3, Failures: 0, Errors: 0, Skipped: 0, Time elapsed: 0.009 sec
Running org.geotools.filter.BetweenTest
Tests run: 1, Failures: 0, Errors: 0, Skipped: 0, Time elapsed: 0.005 sec
Running org.geotools.filter.function.Collection_FunctionsTest
Tests run: 9, Failures: 0, Errors: 0, Skipped: 0, Time elapsed: 0.039 sec
Running org.geotools.feature.FeatureCollectionTest
Tests run: 4, Failures: 0, Errors: 0, Skipped: 0, Time elapsed: 0.033 sec
Running org.geotools.geometry.text.WKTParserTest
Tests run: 5, Failures: 0, Errors: 0, Skipped: 0, Time elapsed: 0.021 sec
Running org.geotools.data.memory.MemoryFeatureCollectionTest
Tests run: 6, Failures: 0, Errors: 0, Skipped: 0, Time elapsed: 0.028 sec
Running org.geotools.filter.function.ClassificationFunctionTest
Tests run: 3, Failures: 0, Errors: 0, Skipped: 0, Time elapsed: 0.026 sec
Running org.geotools.filter.function.GeometryFunctionFilterTest
Tests run: 3, Failures: 0, Errors: 0, Skipped: 0, Time elapsed: 0.012 sec
Running org.geotools.filter.function.math.FilterFunction_Test
Tests run: 32, Failures: 0, Errors: 0, Skipped: 0, Time elapsed: 0.029 sec
Running org.geotools.filter.ParserTest
Tests run: 19, Failures: 0, Errors: 0, Skipped: 0, Time elapsed: 0.154 sec
Running org.geotools.filter.visitor.PostPreProcessFilterSplittingVisitorTest
Tests run: 16, Failures: 0, Errors: 0, Skipped: 0, Time elapsed: 0.037 sec
Running org.geotools.data.store.MaxFeaturesFeatureCollectionTest
Tests run: 2, Failures: 0, Errors: 0, Skipped: 0, Time elapsed: 0.013 sec
Running org.geotools.filter.FilterBuilderTest
Tests run: 4, Failures: 0, Errors: 0, Skipped: 0, Time elapsed: 0.01 sec
Running org.geotools.filter.function.StandardDeviationFunctionTest
Tests run: 4, Failures: 0, Errors: 0, Skipped: 0, Time elapsed: 0.012 sec
Running org.geotools.data.FilteringFeatureReaderTest
Tests run: 6, Failures: 0, Errors: 0, Skipped: 0, Time elapsed: 0.023 sec
Running org.geotools.filter.AreaFunctionTest
Tests run: 1, Failures: 0, Errors: 0, Skipped: 0, Time elapsed: 0.007 sec
Running org.geotools.filter.LiteralTest
Tests run: 1, Failures: 0, Errors: 0, Skipped: 0, Time elapsed: 0.005 sec
Running org.geotools.filter.FilterEqualsTest
Tests run: 10, Failures: 0, Errors: 0, Skipped: 0, Time elapsed: 0.023 sec
Running org.geotools.feature.visitor.VisitorCalculationTest
AV=50.5
Tests run: 12, Failures: 0, Errors: 0, Skipped: 0, Time elapsed: 0.083 sec
Running org.geotools.filter.visitor.PostPreProcessFilterSplittingVisitorSpatialTest
Tests run: 10, Failures: 0, Errors: 0, Skipped: 0, Time elapsed: 0.029 sec
Running org.geotools.filter.EnvironmentVariableResolverTest
Tests run: 1, Failures: 0, Errors: 0, Skipped: 0, Time elapsed: 0.01 sec
Running org.geotools.factory.CommonFactoryFinderTest
Tests run: 2, Failures: 0, Errors: 0, Skipped: 0, Time elapsed: 0.006 sec
Running org.geotools.feature.ChoiceAttrTypeTest
Tests run: 8, Failures: 0, Errors: 0, Skipped: 0, Time elapsed: 0.017 sec
Running org.geotools.filter.FilterBuilder2Test
Tests run: 6, Failures: 0, Errors: 0, Skipped: 0, Time elapsed: 0.021 sec
Running org.geotools.data.collection.CollectionDataStoreTest
Tests run: 7, Failures: 0, Errors: 0, Skipped: 0, Time elapsed: 0.032 sec
Running org.geotools.geometry.jts.CoordinateSequenceTransformerTest
Tests run: 1, Failures: 0, Errors: 0, Skipped: 0, Time elapsed: 0.061 sec
Running org.geotools.filter.FilterVisitorTest
Tests run: 4, Failures: 0, Errors: 0, Skipped: 0, Time elapsed: 0.01 sec
Running org.geotools.filter.MathTest
Tests run: 1, Failures: 0, Errors: 0, Skipped: 0, Time elapsed: 0.007 sec
Running org.geotools.styling.SLDStyleTest
Nov 14, 2007 5:35:54 PM org.geotools.data.DefaultTransaction finalize
SEVERE: There's code leaving transaction unclosed. Call Transaction.close() after using them to ensure they do not hold state such as JDCB connections or file handles
Nov 14, 2007 5:35:54 PM org.geotools.data.DefaultTransaction finalize
SEVERE: Unclosed transaction handle is 'org.geotools.data.collection.CollectionDataStoreTest.testGetFeatureReaderFilterTransaction Transaction'
Nov 14, 2007 5:35:54 PM org.geotools.styling.SLDParser parseUserLayer
INFO: layer name: UserLayer Name
Nov 14, 2007 5:35:54 PM org.geotools.styling.SLDParser parseUserLayer
INFO: layer name: Second_User_Layer
Tests run: 11, Failures: 0, Errors: 0, Skipped: 0, Time elapsed: 0.24 sec
Running org.geotools.filter.function.QuantileFunctionTest
testGetName
Tests run: 6, Failures: 0, Errors: 0, Skipped: 0, Time elapsed: 0.018 sec
Running org.geotools.filter.FilterTest
Tests run: 13, Failures: 0, Errors: 0, Skipped: 0, Time elapsed: 0.06 sec
Running org.geotools.feature.AttributeTypeTest
Tests run: 15, Failures: 0, Errors: 0, Skipped: 0, Time elapsed: 0.024 sec
Running org.geotools.styling.StyleFactoryImplTest
Tests run: 16, Failures: 0, Errors: 0, Skipped: 0, Time elapsed: 0.016 sec

Results :
Tests run: 532, Failures: 3, Errors: 0, Skipped: 0

[INFO] ------------------------------------------------------------------------
[ERROR] BUILD FAILURE
[INFO] ------------------------------------------------------------------------
[INFO] There are test failures.
[INFO] ------------------------------------------------------------------------
[INFO] For more information, run Maven with the -e switch
[INFO] ------------------------------------------------------------------------
[INFO] Total time: 59 seconds
[INFO] Finished at: Wed Nov 14 17:35:54 GMT 2007
[INFO] Final Memory: 27M/86M
[INFO] ------------------------------------------------------------------------