rendered paste bodyconvert : 3d.xml.in -> build/3d.xml
bcop'ing : build/3d.xml -> build/3d_options.h
bcop'ing : build/3d.xml -> build/3d_options.c
schema : build/3d.xml -> build/compiz-3d.schema
compiling : 3d.c -> build/3d.lo3d.c:39:25: error: compiz-core.h: No such file or directory
3d.c:40:25: error: compiz-cube.h: No such file or directory
In file included from 3d.c:41:
build/3d_options.h:23: error: expected '=', ',', ';', 'asm' or '__attribute__' before '*' token
build/3d_options.h:30: error: expected ')' before '*' token
build/3d_options.h:32: error: expected '=', ',', ';', 'asm' or '__attribute__' before '*' token
build/3d_options.h:50: error: expected ')' before '*' token
build/3d_options.h:52: error: expected '=', ',', ';', 'asm' or '__attribute__' before '*' token
build/3d_options.h:54: error: expected '=', ',', ';', 'asm' or '__attribute__' before '*' token
build/3d_options.h:55: error: expected '=', ',', ';', 'asm' or '__attribute__' before '*' token
build/3d_options.h:56: error: expected ')' before '*' token
build/3d_options.h:58: error: expected ')' before '*' token
build/3d_options.h:59: error: expected '=', ',', ';', 'asm' or '__attribute__' before '*' token
build/3d_options.h:60: error: expected ')' before '*' token
build/3d_options.h:62: error: expected ')' before '*' token
build/3d_options.h:63: error: expected '=', ',', ';', 'asm' or '__attribute__' before '*' token
build/3d_options.h:64: error: expected ')' before '*' token
build/3d_options.h:66: error: expected ')' before '*' token
build/3d_options.h:67: error: expected '=', ',', ';', 'asm' or '__attribute__' before '*' token
build/3d_options.h:68: error: expected ')' before '*' token
build/3d_options.h:70: error: expected '=', ',', ';', 'asm' or '__attribute__' before 'tdGetManualOnly'
build/3d_options.h:71: error: expected '=', ',', ';', 'asm' or '__attribute__' before '*' token
build/3d_options.h:72: error: expected ')' before '*' token
build/3d_options.h:74: error: expected ')' before '*' token
build/3d_options.h:75: error: expected '=', ',', ';', 'asm' or '__attribute__' before '*' token
build/3d_options.h:76: error: expected ')' before '*' token
build/3d_options.h:78: error: expected ')' before '*' token
build/3d_options.h:79: error: expected '=', ',', ';', 'asm' or '__attribute__' before '*' token
build/3d_options.h:80: error: expected ')' before '*' token
build/3d_options.h:82: error: expected '=', ',', ';', 'asm' or '__attribute__' before 'tdGetBevelTopleft'
build/3d_options.h:83: error: expected '=', ',', ';', 'asm' or '__attribute__' before '*' token
build/3d_options.h:84: error: expected ')' before '*' token
build/3d_options.h:86: error: expected '=', ',', ';', 'asm' or '__attribute__' before 'tdGetBevelTopright'
build/3d_options.h:87: error: expected '=', ',', ';', 'asm' or '__attribute__' before '*' token
build/3d_options.h:88: error: expected ')' before '*' token
build/3d_options.h:90: error: expected '=', ',', ';', 'asm' or '__attribute__' before 'tdGetBevelBottomleft'
build/3d_options.h:91: error: expected '=', ',', ';', 'asm' or '__attribute__' before '*' token
build/3d_options.h:92: error: expected ')' before '*' token
build/3d_options.h:94: error: expected '=', ',', ';', 'asm' or '__attribute__' before 'tdGetBevelBottomright'
build/3d_options.h:95: error: expected '=', ',', ';', 'asm' or '__attribute__' before '*' token
build/3d_options.h:96: error: expected ')' before '*' token
3d.c:55: error: expected specifier-qualifier-list before 'Bool'
3d.c:68: error: expected specifier-qualifier-list before 'PreparePaintScreenProc'
3d.c:110: error: expected '=', ',', ';', 'asm' or '__attribute__' before 'windowIs3D'
3d.c:129: error: expected ')' before '*' token
3d.c:190: error: expected '=', ',', ';', 'asm' or '__attribute__' before 'tdPaintWindow'
3d.c:224: error: expected '=', ',', ';', 'asm' or '__attribute__' before 'tdPaintWindowWithDepth'
3d.c:412: error: expected '=', ',', ';', 'asm' or '__attribute__' before 'tdPaintWindow'
3d.c:460: error: expected ')' before '*' token
3d.c:476: error: expected ')' before '*' token
3d.c:493: error: expected ')' before '*' token
3d.c:654: error: expected '=', ',', ';', 'asm' or '__attribute__' before 'tdPaintOutput'
3d.c:679: error: expected ')' before '*' token
3d.c:691: error: expected '=', ',', ';', 'asm' or '__attribute__' before '*' token
3d.c:698: error: expected '=', ',', ';', 'asm' or '__attribute__' before '*' token
3d.c:705: error: expected '=', ',', ';', 'asm' or '__attribute__' before '*' token
3d.c:712: error: expected '=', ',', ';', 'asm' or '__attribute__' before '*' token
3d.c:720: error: expected ')' before '*' token
3d.c:740: error: expected '=', ',', ';', 'asm' or '__attribute__' before 'tdInitDisplay'
3d.c:771: error: expected ')' before '*' token
3d.c:782: error: expected '=', ',', ';', 'asm' or '__attribute__' before 'tdInitScreen'
3d.c:824: error: expected ')' before '*' token
3d.c:844: error: expected '=', ',', ';', 'asm' or '__attribute__' before 'tdInitWindow'
3d.c:866: error: expected ')' before '*' token
3d.c:875: error: expected '=', ',', ';', 'asm' or '__attribute__' before 'tdInit'
3d.c:885: error: expected ')' before '*' token
3d.c:891: error: expected '=', ',', ';', 'asm' or '__attribute__' before 'tdInitObject'
3d.c:905: error: expected ')' before '*' token
3d.c:918: error: expected '=', ',', ';', 'asm' or '__attribute__' before 'tdVTable'
3d.c:929: error: expected '=', ',', ';', 'asm' or '__attribute__' before '*' token
make: *** [build/3d.lo] Error 1