TICKY_DIR_BIT -DHASXDMAUTH -D_BSD_SOURCE -DMALLOC_0_RETURNS_NULL -march=k8 -O2 -pipe -m3dnow -mmmx -msse -msse2 -msse3 -MT mbWrap.lo -MD -MP -MF ".deps/mbWrap.Tpo" -c -o mbWrap.lo mbWrap.c; \
then mv -f ".deps/mbWrap.Tpo" ".deps/mbWrap.Plo"; else rm -f ".deps/mbWrap.Tpo"; exit 1; fi
x86_64-pc-linux-gnu-gcc -DHAVE_CONFIG_H -I. -I. -I../../src -I../../include/X11 -I../../include -I../../include/X11 -I../../include -I../../include/X11 -I../../src/xcms -I../../src/xkb -I../../src/xlibi18n -I../../src -Wall -Wpointer-arith -Wstrict-prototypes -Wmissing-prototypes -Wmissing-declarations -Wnested-externs -fno-strict-aliasing -D_BSD_SOURCE -DHAS_FCHOWN -DHAS_STICKY_DIR_BIT -DHASXDMAUTH -D_BSD_SOURCE -DMALLOC_0_RETURNS_NULL -march=k8 -O2 -pipe -m3dnow -mmmx -msse -msse2 -msse3 -MT mbWMProps.lo -MD -MP -MF .deps/mbWMProps.Tpo -c mbWMProps.c -fPIC -DPIC -o .libs/mbWMProps.o
x86_64-pc-linux-gnu-gcc -DHAVE_CONFIG_H -I. -I. -I../../src -I../../include/X11 -I../../include -I../../include/X11 -I../../include -I../../include/X11 -I../../src/xcms -I../../src/xkb -I../../src/xlibi18n -I../../src -Wall -Wpointer-arith -Wstrict-prototypes -Wmissing-prototypes -Wmissing-declarations -Wnested-externs -fno-strict-aliasing -D_BSD_SOURCE -DHAS_FCHOWN -DHAS_STICKY_DIR_BIT -DHASXDMAUTH -D_BSD_SOURCE -DMALLOC_0_RETURNS_NULL -march=k8 -O2 -pipe -m3dnow -mmmx -msse -msse2 -msse3 -MT mbWMProps.lo -MD -MP -MF .deps/mbWMProps.Tpo -c mbWMProps.c -o mbWMProps.o >/dev/null 2>&1
if /bin/sh ../../libtool --tag=CC --mode=compile x86_64-pc-linux-gnu-gcc -DHAVE_CONFIG_H -I. -I. -I../../src -I../../include/X11 -I../../include -I../../include/X11 -I../../include -I../../include/X11 -I../../src/xcms -I../../src/xkb -I../../src/xlibi18n -I../../src -Wall -Wpointer-arith -Wstrict-prototypes -Wmissing-prototypes -Wmissing-declarations -Wnested-externs -fno-strict-aliasing -D_BSD_SOURCE -DHAS_FCHOWN -DHAS_STICKY_DIR_BIT -DHASXDMAUTH -D_BSD_SOURCE -DMALLOC_0_RETURNS_NULL -march=k8 -O2 -pipe -m3dnow -mmmx -msse -msse2 -msse3 -MT utf8WMProps.lo -MD -MP -MF ".deps/utf8WMProps.Tpo" -c -o utf8WMProps.lo utf8WMProps.c; \
then mv -f ".deps/utf8WMProps.Tpo" ".deps/utf8WMProps.Plo"; else rm -f ".deps/utf8WMProps.Tpo"; exit 1; fi
x86_64-pc-linux-gnu-gcc -DHAVE_CONFIG_H -I. -I. -I../../src -I../../include/X11 -I../../include -I../../include/X11 -I../../include -I../../include/X11 -I../../src/xcms -I../../src/xkb -I../../src/xlibi18n -I../../src -Wall -Wpointer-arith -Wstrict-prototypes -Wmissing-prototypes -Wmissing-declarations -Wnested-externs -fno-strict-aliasing -D_BSD_SOURCE -DHAS_FCHOWN -DHAS_STICKY_DIR_BIT -DHASXDMAUTH -D_BSD_SOURCE -DMALLOC_0_RETURNS_NULL -march=k8 -O2 -pipe -m3dnow -mmmx -msse -msse2 -msse3 -MT mbWrap.lo -MD -MP -MF .deps/mbWrap.Tpo -c mbWrap.c -fPIC -DPIC -o .libs/mbWrap.o
x86_64-pc-linux-gnu-gcc -DHAVE_CONFIG_H -I. -I. -I../../src -I../../include/X11 -I../../include -I../../include/X11 -I../../include -I../../include/X11 -I../../src/xcms -I../../src/xkb -I../../src/xlibi18n -I../../src -Wall -Wpointer-arith -Wstrict-prototypes -Wmissing-prototypes -Wmissing-declarations -Wnested-externs -fno-strict-aliasing -D_BSD_SOURCE -DHAS_FCHOWN -DHAS_STICKY_DIR_BIT -DHASXDMAUTH -D_BSD_SOURCE -DMALLOC_0_RETURNS_NULL -march=k8 -O2 -pipe -m3dnow -mmmx -msse -msse2 -msse3 -MT mbWrap.lo -MD -MP -MF .deps/mbWrap.Tpo -c mbWrap.c -o mbWrap.o >/dev/null 2>&1
if /bin/sh ../../libtool --tag=CC --mode=compile x86_64-pc-linux-gnu-gcc -DHAVE_CONFIG_H -I. -I. -I../../src -I../../include/X11 -I../../include -I../../include/X11 -I../../include -I../../include/X11 -I../../src/xcms -I../../src/xkb -I../../src/xlibi18n -I../../src -Wall -Wpointer-arith -Wstrict-prototypes -Wmissing-prototypes -Wmissing-declarations -Wnested-externs -fno-strict-aliasing -D_BSD_SOURCE -DHAS_FCHOWN -DHAS_STICKY_DIR_BIT -DHASXDMAUTH -D_BSD_SOURCE -DMALLOC_0_RETURNS_NULL -march=k8 -O2 -pipe -m3dnow -mmmx -msse -msse2 -msse3 -MT utf8Wrap.lo -MD -MP -MF ".deps/utf8Wrap.Tpo" -c -o utf8Wrap.lo utf8Wrap.c; \
then mv -f ".deps/utf8Wrap.Tpo" ".deps/utf8Wrap.Plo"; else rm -f ".deps/utf8Wrap.Tpo"; exit 1; fi
x86_64-pc-linux-gnu-gcc -DHAVE_CONFIG_H -I. -I. -I../../src -I../../include/X11 -I../../include -I../../include/X11 -I../../include -I../../include/X11 -I../../src/xcms -I../../src/xkb -I../../src/xlibi18n -I../../src -Wall -Wpointer-arith -Wstrict-prototypes -Wmissing-prototypes -Wmissing-declarations -Wnested-externs -fno-strict-aliasing -D_BSD_SOURCE -DHAS_FCHOWN -DHAS_STICKY_DIR_BIT -DHASXDMAUTH -D_BSD_SOURCE -DMALLOC_0_RETURNS_NULL -march=k8 -O2 -pipe -m3dnow -mmmx -msse -msse2 -msse3 -MT utf8WMProps.lo -MD -MP -MF .deps/utf8WMProps.Tpo -c utf8WMProps.c -fPIC -DPIC -o .libs/utf8WMProps.o
x86_64-pc-linux-gnu-gcc -DHAVE_CONFIG_H -I. -I. -I../../src -I../../include/X11 -I../../include -I../../include/X11 -I../../include -I../../include/X11 -I../../src/xcms -I../../src/xkb -I../../src/xlibi18n -I../../src -Wall -Wpointer-arith -Wstrict-prototypes -Wmissing-prototypes -Wmissing-declarations -Wnested-externs -fno-strict-aliasing -D_BSD_SOURCE -DHAS_FCHOWN -DHAS_STICKY_DIR_BIT -DHASXDMAUTH -D_BSD_SOURCE -DMALLOC_0_RETURNS_NULL -march=k8 -O2 -pipe -m3dnow -mmmx -msse -msse2 -msse3 -MT utf8WMProps.lo -MD -MP -MF .deps/utf8WMProps.Tpo -c utf8WMProps.c -o utf8WMProps.o >/dev/null 2>&1
if /bin/sh ../../libtool --tag=CC --mode=compile x86_64-pc-linux-gnu-gcc -DHAVE_CONFIG_H -I. -I. -I../../src -I../../include/X11 -I../../include -I../../include/X11 -I../../include -I../../include/X11 -I../../src/xcms -I../../src/xkb -I../../src/xlibi18n -I../../src -Wall -Wpointer-arith -Wstrict-prototypes -Wmissing-prototypes -Wmissing-declarations -Wnested-externs -fno-strict-aliasing -D_BSD_SOURCE -DHAS_FCHOWN -DHAS_STICKY_DIR_BIT -DHASXDMAUTH -D_BSD_SOURCE -DMALLOC_0_RETURNS_NULL -march=k8 -O2 -pipe -m3dnow -mmmx -msse -msse2 -msse3 -MT wcWrap.lo -MD -MP -MF ".deps/wcWrap.Tpo" -c -o wcWrap.lo wcWrap.c; \
then mv -f ".deps/wcWrap.Tpo" ".deps/wcWrap.Plo"; else rm -f ".deps/wcWrap.Tpo"; exit 1; fi
x86_64-pc-linux-gnu-gcc -DHAVE_CONFIG_H -I. -I. -I../../src -I../../include/X11 -I../../include -I../../include/X11 -I../../include -I../../include/X11 -I../../src/xcms -I../../src/xkb -I../../src/xlibi18n -I../../src -Wall -Wpointer-arith -Wstrict-prototypes -Wmissing-prototypes -Wmissing-declarations -Wnested-externs -fno-strict-aliasing -D_BSD_SOURCE -DHAS_FCHOWN -DHAS_STICKY_DIR_BIT -DHASXDMAUTH -D_BSD_SOURCE -DMALLOC_0_RETURNS_NULL -march=k8 -O2 -pipe -m3dnow -mmmx -msse -msse2 -msse3 -MT utf8Wrap.lo -MD -MP -MF .deps/utf8Wrap.Tpo -c utf8Wrap.c -fPIC -DPIC -o .libs/utf8Wrap.o
x86_64-pc-linux-gnu-gcc -DHAVE_CONFIG_H -I. -I. -I../../src -I../../include/X11 -I../../include -I../../include/X11 -I../../include -I../../include/X11 -I../../src/xcms -I../../src/xkb -I../../src/xlibi18n -I../../src -Wall -Wpointer-arith -Wstrict-prototypes -Wmissing-prototypes -Wmissing-declarations -Wnested-externs -fno-strict-aliasing -D_BSD_SOURCE -DHAS_FCHOWN -DHAS_STICKY_DIR_BIT -DHASXDMAUTH -D_BSD_SOURCE -DMALLOC_0_RETURNS_NULL -march=k8 -O2 -pipe -m3dnow -mmmx -msse -msse2 -msse3 -MT utf8Wrap.lo -MD -MP -MF .deps/utf8Wrap.Tpo -c utf8Wrap.c -o utf8Wrap.o >/dev/null 2>&1
x86_64-pc-linux-gnu-gcc -DHAVE_CONFIG_H -I. -I. -I../../src -I../../include/X11 -I../../include -I../../include/X11 -I../../include -I../../include/X11 -I../../src/xcms -I../../src/xkb -I../../src/xlibi18n -I../../src -Wall -Wpointer-arith -Wstrict-prototypes -Wmissing-prototypes -Wmissing-declarations -Wnested-externs -fno-strict-aliasing -D_BSD_SOURCE -DHAS_FCHOWN -DHAS_STICKY_DIR_BIT -DHASXDMAUTH -D_BSD_SOURCE -DMALLOC_0_RETURNS_NULL -march=k8 -O2 -pipe -m3dnow -mmmx -msse -msse2 -msse3 -MT wcWrap.lo -MD -MP -MF .deps/wcWrap.Tpo -c wcWrap.c -fPIC -DPIC -o .libs/wcWrap.o
x86_64-pc-linux-gnu-gcc -DHAVE_CONFIG_H -I. -I. -I../../src -I../../include/X11 -I../../include -I../../include/X11 -I../../include -I../../include/X11 -I../../src/xcms -I../../src/xkb -I../../src/xlibi18n -I../../src -Wall -Wpointer-arith -Wstrict-prototypes -Wmissing-prototypes -Wmissing-declarations -Wnested-externs -fno-strict-aliasing -D_BSD_SOURCE -DHAS_FCHOWN -DHAS_STICKY_DIR_BIT -DHASXDMAUTH -D_BSD_SOURCE -DMALLOC_0_RETURNS_NULL -march=k8 -O2 -pipe -m3dnow -mmmx -msse -msse2 -msse3 -MT wcWrap.lo -MD -MP -MF .deps/wcWrap.Tpo -c wcWrap.c -o wcWrap.o >/dev/null 2>&1
/bin/sh ../../libtool --tag=CC --mode=link x86_64-pc-linux-gnu-gcc -I../../include -I../../include/X11 -I../../include -I../../include/X11 -I../../src/xcms -I../../src/xkb -I../../src/xlibi18n -I../../src -Wall -Wpointer-arith -Wstrict-prototypes -Wmissing-prototypes -Wmissing-declarations -Wnested-externs -fno-strict-aliasing -D_BSD_SOURCE -DHAS_FCHOWN -DHAS_STICKY_DIR_BIT -DHASXDMAUTH -D_BSD_SOURCE -DMALLOC_0_RETURNS_NULL -march=k8 -O2 -pipe -m3dnow -mmmx -msse -msse2 -msse3 -o libi18n.la XDefaultIMIF.lo XDefaultOMIF.lo xim_trans.lo ICWrap.lo IMWrap.lo imKStoUCS.lo lcCT.lo lcCharSet.lo lcConv.lo lcDB.lo lcDynamic.lo lcFile.lo lcGeneric.lo lcInit.lo lcPrTxt.lo lcPubWrap.lo lcPublic.lo lcRM.lo lcStd.lo lcTxtPr.lo lcUTF8.lo lcUtil.lo lcWrap.lo mbWMProps.lo mbWrap.lo utf8WMProps.lo utf8Wrap.lo wcWrap.lo ../../modules/im/ximcp/libximcp.la ../../modules/lc/def/libxlcDef.la ../../modules/lc/gen/libxlibi18n.la ../../modules/lc/Utf8/libxlcUTF8Load.la ../../modules/lc/xlocale/libxlocale.la ../../modules/om/generic/libxomGeneric.la -ldl
rm -fr .libs/libi18n.lax
mkdir .libs/libi18n.lax
rm -fr .libs/libi18n.lax/libximcp.a
mkdir .libs/libi18n.lax/libximcp.a
(cd .libs/libi18n.lax/libximcp.a && x86_64-pc-linux-gnu-ar x /var/tmp/portage/libX11-1.0.2/work/libX11-1.0.2/src/xlibi18n/../../modules/im/ximcp/.libs/libximcp.a)
rm -fr .libs/libi18n.lax/libxlcDef.a
mkdir .libs/libi18n.lax/libxlcDef.a
(cd .libs/libi18n.lax/libxlcDef.a && x86_64-pc-linux-gnu-ar x /var/tmp/portage/libX11-1.0.2/work/libX11-1.0.2/src/xlibi18n/../../modules/lc/def/.libs/libxlcDef.a)
rm -fr .libs/libi18n.lax/libxlibi18n.a
mkdir .libs/libi18n.lax/libxlibi18n.a
(cd .libs/libi18n.lax/libxlibi18n.a && x86_64-pc-linux-gnu-ar x /var/tmp/portage/libX11-1.0.2/work/libX11-1.0.2/src/xlibi18n/../../modules/lc/gen/.libs/libxlibi18n.a)
rm -fr .libs/libi18n.lax/libxlcUTF8Load.a
mkdir .libs/libi18n.lax/libxlcUTF8Load.a
(cd .libs/libi18n.lax/libxlcUTF8Load.a && x86_64-pc-linux-gnu-ar x /var/tmp/portage/libX11-1.0.2/work/libX11-1.0.2/src/xlibi18n/../../modules/lc/Utf8/.libs/libxlcUTF8Load.a)
rm -fr .libs/libi18n.lax/libxlocale.a
mkdir .libs/libi18n.lax/libxlocale.a
(cd .libs/libi18n.lax/libxlocale.a && x86_64-pc-linux-gnu-ar x /var/tmp/portage/libX11-1.0.2/work/libX11-1.0.2/src/xlibi18n/../../modules/lc/xlocale/.libs/libxlocale.a)
rm -fr .libs/libi18n.lax/libxomGeneric.a
mkdir .libs/libi18n.lax/libxomGeneric.a
(cd .libs/libi18n.lax/libxomGeneric.a && x86_64-pc-linux-gnu-ar x /var/tmp/portage/libX11-1.0.2/work/libX11-1.0.2/src/xlibi18n/../../modules/om/generic/.libs/libxomGeneric.a)
x86_64-pc-linux-gnu-ar cru .libs/libi18n.a .libs/XDefaultIMIF.o .libs/XDefaultOMIF.o .libs/xim_trans.o .libs/ICWrap.o .libs/IMWrap.o .libs/imKStoUCS.o .libs/lcCT.o .libs/lcCharSet.o .libs/lcConv.o .libs/lcDB.o .libs/lcDynamic.o .libs/lcFile.o .libs/lcGeneric.o .libs/lcInit.o .libs/lcPrTxt.o .libs/lcPubWrap.o .libs/lcPublic.o .libs/lcRM.o .libs/lcStd.o .libs/lcTxtPr.o .libs/lcUTF8.o .libs/lcUtil.o .libs/lcWrap.o .libs/mbWMProps.o .libs/mbWrap.o .libs/utf8WMProps.o .libs/utf8Wrap.o .libs/wcWrap.o .libs/libi18n.lax/libximcp.a/imCallbk.o .libs/libi18n.lax/libximcp.a/imDefFlt.o .libs/libi18n.lax/libximcp.a/imDefIc.o .libs/libi18n.lax/libximcp.a/imDefIm.o .libs/libi18n.lax/libximcp.a/imDefLkup.o .libs/libi18n.lax/libximcp.a/imDispch.o .libs/libi18n.lax/libximcp.a/imEvToWire.o .libs/libi18n.lax/libximcp.a/imExten.o .libs/libi18n.lax/libximcp.a/imImSw.o .libs/libi18n.lax/libximcp.a/imInsClbk.o .libs/libi18n.lax/libximcp.a/imInt.o .libs/libi18n.lax/libximcp.a/imLcFlt.o .libs/libi18n.lax/libximcp.a/imLcGIc.o .libs/libi18n.lax/libximcp.a/imLcIc.o .libs/libi18n.lax/libximcp.a/imLcIm.o .libs/libi18n.lax/libximcp.a/imLcLkup.o .libs/libi18n.lax/libximcp.a/imLcPrs.o .libs/libi18n.lax/libximcp.a/imLcSIc.o .libs/libi18n.lax/libximcp.a/imRmAttr.o .libs/libi18n.lax/libximcp.a/imRm.o .libs/libi18n.lax/libximcp.a/imThaiFlt.o .libs/libi18n.lax/libximcp.a/imThaiIc.o .libs/libi18n.lax/libximcp.a/imThaiIm.o .libs/libi18n.lax/libximcp.a/imTrans.o .libs/libi18n.lax/libximcp.a/imTransR.o .libs/libi18n.lax/libximcp.a/imTrX.o .libs/libi18n.lax/libxlcDef.a/lcDefConv.o .libs/libi18n.lax/libxlibi18n.a/lcGenConv.o .libs/libi18n.lax/libxlcUTF8Load.a/lcUTF8Load.o .libs/libi18n.lax/libxlocale.a/lcEuc.o .libs/libi18n.lax/libxlocale.a/lcJis.o .libs/libi18n.lax/libxlocale.a/lcSjis.o .libs/libi18n.lax/libxomGeneric.a/omDefault.o .libs/libi18n.lax/libxomGeneric.a/omGeneric.o .libs/libi18n.lax/libxomGeneric.a/omImText.o .libs/libi18n.lax/libxomGeneric.a/omText.o .libs/libi18n.lax/libxomGeneric.a/omTextEsc.o .libs/libi18n.lax/libxomGeneric.a/omTextExt.o .libs/libi18n.lax/libxomGeneric.a/omTextPer.o .libs/libi18n.lax/libxomGeneric.a/omXChar.o
x86_64-pc-linux-gnu-ranlib .libs/libi18n.a
rm -fr .libs/libi18n.lax
creating libi18n.la
(cd .libs && rm -f libi18n.la && ln -s ../libi18n.la libi18n.la)
make[3]: Leaving directory `/var/tmp/portage/libX11-1.0.2/work/libX11-1.0.2/src/xlibi18n'
Making all in xkb
make[3]: Entering directory `/var/tmp/portage/libX11-1.0.2/work/libX11-1.0.2/src/xkb'
if /bin/sh ../../libtool --tag=CC --mode=compile x86_64-pc-linux-gnu-gcc -DHAVE_CONFIG_H -I. -I. -I../../src -I../../include/X11 -I../../include -I../../include/X11 -I../../include -I../../include/X11 -I../../src/xcms -I../../src/xkb -I../../src/xlibi18n -Wall -Wpointer-arith -Wstrict-prototypes -Wmissing-prototypes -Wmissing-declarations -Wnested-externs -fno-strict-aliasing -D_BSD_SOURCE -DHAS_FCHOWN -DHAS_STICKY_DIR_BIT -DHASXDMAUTH -D_BSD_SOURCE -DMALLOC_0_RETURNS_NULL -march=k8 -O2 -pipe -m3dnow -mmmx -msse -msse2 -msse3 -MT XKB.lo -MD -MP -MF ".deps/XKB.Tpo" -c -o XKB.lo XKB.c; \
then mv -f ".deps/XKB.Tpo" ".deps/XKB.Plo"; else rm -f ".deps/XKB.Tpo"; exit 1; fi
if /bin/sh ../../libtool --tag=CC --mode=compile x86_64-pc-linux-gnu-gcc -DHAVE_CONFIG_H -I. -I. -I../../src -I../../include/X11 -I../../include -I../../include/X11 -I../../include -I../../include/X11 -I../../src/xcms -I../../src/xkb -I../../src/xlibi18n -Wall -Wpointer-arith -Wstrict-prototypes -Wmissing-prototypes -Wmissing-declarations -Wnested-externs -fno-strict-aliasing -D_BSD_SOURCE -DHAS_FCHOWN -DHAS_STICKY_DIR_BIT -DHASXDMAUTH -D_BSD_SOURCE -DMALLOC_0_RETURNS_NULL -march=k8 -O2 -pipe -m3dnow -mmmx -msse -msse2 -msse3 -MT XKBBind.lo -MD -MP -MF ".deps/XKBBind.Tpo" -c -o XKBBind.lo XKBBind.c; \
then mv -f ".deps/XKBBind.Tpo" ".deps/XKBBind.Plo"; else rm -f ".deps/XKBBind.Tpo"; exit 1; fi
mkdir .libs
x86_64-pc-linux-gnu-gcc -DHAVE_CONFIG_H -I. -I. -I../../src -I../../include/X11 -I../../include -I../../include/X11 -I../../include -I../../include/X11 -I../../src/xcms -I../../src/xkb -I../../src/xlibi18n -Wall -Wpointer-arith -Wstrict-prototypes -Wmissing-prototypes -Wmissing-declarations -Wnested-externs -fno-strict-aliasing -D_BSD_SOURCE -DHAS_FCHOWN -DHAS_STICKY_DIR_BIT -DHASXDMAUTH -D_BSD_SOURCE -DMALLOC_0_RETURNS_NULL -march=k8 -O2 -pipe -m3dnow -mmmx -msse -msse2 -msse3 -MT XKBBind.lo -MD -MP -MF .deps/XKBBind.Tpo -c XKBBind.c -fPIC -DPIC -o .libs/XKBBind.o
In file included from XKBBind.c:37:
../../include/X11/XKBlib.h:33:35: X11/extensions/XKBstr.h: No such file or directory
In file included from XKBBind.c:37:
../../include/X11/XKBlib.h:218: error: `XkbActionMessageLength' undeclared here (not in a function)
../../include/X11/XKBlib.h:393: error: syntax error before "KeyCode"
../../include/X11/XKBlib.h:397: warning: function declaration isn't a prototype
../../include/X11/XKBlib.h:493: error: syntax error before "XkbMapNotifyEvent"
../../include/X11/XKBlib.h:495: warning: function declaration isn't a prototype
../../include/X11/XKBlib.h:499: error: syntax error before "XkbNamesNotifyEvent"
../../include/X11/XKBlib.h:501: warning: function declaration isn't a prototype
../../include/X11/XKBlib.h:520: error: syntax error before "XkbDescPtr"
../../include/X11/XKBlib.h:521: warning: function declaration isn't a prototype
../../include/X11/XKBlib.h:526: error: syntax error before "XkbDescPtr"
../../include/X11/XKBlib.h:527: warning: function declaration isn't a prototype
../../include/X11/XKBlib.h:543: error: syntax error before "XkbIndicatorMapPtr"
../../include/X11/XKBlib.h:545: warning: function declaration isn't a prototype
../../include/X11/XKBlib.h:555: error: syntax error before "XkbIndicatorMapPtr"
../../include/X11/XKBlib.h:557: warning: function declaration isn't a prototype
../../include/X11/XKBlib.h:565: error: syntax error before "XkbIndicatorMapPtr"
../../include/X11/XKBlib.h:566: warning: function declaration isn't a prototype
../../include/X11/XKBlib.h:577: error: syntax error before "XkbIndicatorMapPtr"
../../include/X11/XKBlib.h:578: warning: function declaration isn't a prototype
../../include/X11/XKBlib.h:627: error: syntax error before "unsigned"
../../include/X11/XKBlib.h:629: warning: function declaration isn't a prototype
../../include/X11/XKBlib.h:634: error: syntax error before "unsigned"
../../include/X11/XKBlib.h:635: warning: function declaration isn't a prototype
../../include/X11/XKBlib.h:639: error: syntax error before "unsigned"
../../include/X11/XKBlib.h:641: warning: function declaration isn't a prototype
../../include/X11/XKBlib.h:643: error: syntax error before "XkbAllocKeyboard"
../../include/X11/XKBlib.h:645: warning: type defaults to `int' in declaration of `XkbAllocKeyboard'
../../include/X11/XKBlib.h:645: warning: data definition has no type or storage class
../../include/X11/XKBlib.h:649: error: syntax error before "unsigned"
../../include/X11/XKBlib.h:651: warning: function declaration isn't a prototype
../../include/X11/XKBlib.h:655: error: syntax error before "unsigned"
../../include/X11/XKBlib.h:657: warning: function declaration isn't a prototype
../../include/X11/XKBlib.h:661: error: syntax error before "unsigned"
../../include/X11/XKBlib.h:663: warning: function declaration isn't a prototype
../../include/X11/XKBlib.h:667: error: syntax error before "unsigned"
../../include/X11/XKBlib.h:669: warning: function declaration isn't a prototype
../../include/X11/XKBlib.h:673: error: syntax error before "unsigned"
../../include/X11/XKBlib.h:675: warning: function declaration isn't a prototype
../../include/X11/XKBlib.h:677: error: syntax error before "XkbAddKeyType"
../../include/X11/XKBlib.h:679: error: syntax error before "Atom"
../../include/X11/XKBlib.h:683: warning: type defaults to `int' in declaration of `XkbAddKeyType'
../../include/X11/XKBlib.h:683: warning: function declaration isn't a prototype
../../include/X11/XKBlib.h:683: warning: data definition has no type or storage class
../../include/X11/XKBlib.h:687: warning: parameter names (without types) in function declaration
../../include/X11/XKBlib.h:691: warning: parameter names (without types) in function declaration
../../include/X11/XKBlib.h:693: error: syntax error before "XkbGetMap"
../../include/X11/XKBlib.h:697: warning: type defaults to `int' in declaration of `XkbGetMap'
../../include/X11/XKBlib.h:697: warning: data definition has no type or storage class
../../include/X11/XKBlib.h:702: error: syntax error before "XkbDescPtr"
../../include/X11/XKBlib.h:703: warning: function declaration isn't a prototype
../../include/X11/XKBlib.h:707: error: syntax error before "XkbDescPtr"
../../include/X11/XKBlib.h:709: warning: function declaration isn't a prototype
../../include/X11/XKBlib.h:720: error: syntax error before "XkbDescPtr"
../../include/X11/XKBlib.h:721: warning: function declaration isn't a prototype
../../include/X11/XKBlib.h:727: error: syntax error before "XkbDescPtr"
../../include/X11/XKBlib.h:728: warning: function declaration isn't a prototype
../../include/X11/XKBlib.h:734: error: syntax error before "XkbDescPtr"
../../include/X11/XKBlib.h:735: warning: function declaration isn't a prototype
../../include/X11/XKBlib.h:741: error: syntax error before "XkbDescPtr"
../../include/X11/XKBlib.h:742: warning: function declaration isn't a prototype
../../include/X11/XKBlib.h:747: error: syntax error before "XkbDescPtr"
../../include/X11/XKBlib.h:748: warning: function declaration isn't a prototype
../../include/X11/XKBlib.h:754: error: syntax error before "XkbDescPtr"
../../include/X11/XKBlib.h:755: warning: function declaration isn't a prototype
../../include/X11/XKBlib.h:761: error: syntax error before "XkbDescPtr"
../../include/X11/XKBlib.h:762: warning: function declaration isn't a prototype
../../include/X11/XKBlib.h:768: error: syntax error before "XkbDescPtr"
../../include/X11/XKBlib.h:769: warning: function declaration isn't a prototype
../../include/X11/XKBlib.h:773: error: syntax error before "unsigned"
../../include/X11/XKBlib.h:774: warning: function declaration isn't a prototype
../../include/X11/XKBlib.h:778: error: syntax error before "unsigned"
../../include/X11/XKBlib.h:780: warning: function declaration isn't a prototype
../../include/X11/XKBlib.h:785: error: syntax error before "XkbDescPtr"
../../include/X11/XKBlib.h:786: warning: function declaration isn't a prototype
../../include/X11/XKBlib.h:791: error: syntax error before "XkbDescPtr"
../../include/X11/XKBlib.h:792: warning: function declaration isn't a prototype
../../include/X11/XKBlib.h:796: error: syntax error before "XkbControlsNotifyEvent"
../../include/X11/XKBlib.h:798: warning: function declaration isn't a prototype
../../include/X11/XKBlib.h:805: error: syntax error before "unsigned"
../../include/X11/XKBlib.h:807: warning: function declaration isn't a prototype
../../include/X11/XKBlib.h:811: error: syntax error before "unsigned"
../../include/X11/XKBlib.h:813: warning: function declaration isn't a prototype
../../include/X11/XKBlib.h:818: error: syntax error before "XkbDescPtr"
../../include/X11/XKBlib.h:819: warning: function declaration isn't a prototype
../../include/X11/XKBlib.h:824: error: syntax error before "XkbDescPtr"
../../include/X11/XKBlib.h:826: warning: function declaration isn't a prototype
../../include/X11/XKBlib.h:828: error: syntax error before "XkbAddSymInterpret"
../../include/X11/XKBlib.h:831: error: syntax error before "int"
../../include/X11/XKBlib.h:833: warning: type defaults to `int' in declaration of `XkbAddSymInterpret'
../../include/X11/XKBlib.h:833: warning: function declaration isn't a prototype
../../include/X11/XKBlib.h:833: warning: data definition has no type or storage class
../../include/X11/XKBlib.h:837: error: syntax error before "unsigned"
../../include/X11/XKBlib.h:840: warning: function declaration isn't a prototype
../../include/X11/XKBlib.h:845: error: syntax error before "XkbDescPtr"
../../include/X11/XKBlib.h:846: warning: function declaration isn't a prototype
../../include/X11/XKBlib.h:853: error: syntax error before "XkbDescPtr"
../../include/X11/XKBlib.h:854: warning: function declaration isn't a prototype
../../include/X11/XKBlib.h:858: error: syntax error before "XkbDescPtr"
../../include/X11/XKBlib.h:860: warning: function declaration isn't a prototype
../../include/X11/XKBlib.h:864: error: syntax error before "unsigned"
../../include/X11/XKBlib.h:866: warning: function declaration isn't a prototype
../../include/X11/XKBlib.h:872: error: syntax error before "XkbStatePtr"
../../include/X11/XKBlib.h:873: warning: function declaration isn't a prototype
../../include/X11/XKBlib.h:878: error: syntax error before "XkbDescPtr"
../../include/X11/XKBlib.h:879: warning: function declaration isn't a prototype
../../include/X11/XKBlib.h:883: error: syntax error before "XkbDescPtr"
../../include/X11/XKBlib.h:885: warning: function declaration isn't a prototype
../../include/X11/XKBlib.h:925: warning: parameter names (without types) in function declaration
../../include/X11/XKBlib.h:930: error: syntax error before "int"
../../include/X11/XKBlib.h:931: warning: function declaration isn't a prototype
../../include/X11/XKBlib.h:935: error: syntax error before "int"
../../include/X11/XKBlib.h:939: warning: function declaration isn't a prototype
../../include/X11/XKBlib.h:943: error: syntax error before "int"
../../include/X11/XKBlib.h:945: warning: function declaration isn't a prototype
../../include/X11/XKBlib.h:947: error: syntax error before '*' token
../../include/X11/XKBlib.h:949: error: syntax error before "int"
../../include/X11/XKBlib.h:951: warning: type defaults to `int' in declaration of `XkbResizeKeyActions'
../../include/X11/XKBlib.h:951: warning: function declaration isn't a prototype
../../include/X11/XKBlib.h:951: warning: data definition has no type or storage class
../../include/X11/XKBlib.h:955: error: syntax error before "int"
../../include/X11/XKBlib.h:960: warning: function declaration isn't a prototype
../../include/X11/XKBlib.h:964: error: syntax error before "int"
../../include/X11/XKBlib.h:967: warning: function declaration isn't a prototype
../../include/X11/XKBlib.h:971: error: syntax error before "XkbListComponents"
../../include/X11/XKBlib.h:974: error: syntax error before "XkbComponentNamesPtr"
../../include/X11/XKBlib.h:976: warning: type defaults to `int' in declaration of `XkbListComponents'
../../include/X11/XKBlib.h:976: warning: function declaration isn't a prototype
../../include/X11/XKBlib.h:976: warning: data definition has no type or storage class
../../include/X11/XKBlib.h:980: warning: parameter names (without types) in function declaration
../../include/X11/XKBlib.h:982: error: syntax error before "XkbGetKeyboard"
../../include/X11/XKBlib.h:986: warning: type defaults to `int' in declaration of `XkbGetKeyboard'
../../include/X11/XKBlib.h:986: warning: data definition has no type or storage class
../../include/X11/XKBlib.h:988: error: syntax error before "XkbGetKeyboardByName"
../../include/X11/XKBlib.h:991: error: syntax error before "XkbComponentNamesPtr"
../../include/X11/XKBlib.h:995: warning: type defaults to `int' in declaration of `XkbGetKeyboardByName'
../../include/X11/XKBlib.h:995: warning: function declaration isn't a prototype
../../include/X11/XKBlib.h:995: warning: data definition has no type or storage class
../../include/X11/XKBlib.h:1001: error: syntax error before "int"
../../include/X11/XKBlib.h:1006: warning: function declaration isn't a prototype
../../include/X11/XKBlib.h:1010: error: syntax error before "KeyCode"
../../include/X11/XKBlib.h:1012: warning: function declaration isn't a prototype
../../include/X11/XKBlib.h:1016: error: syntax error before "KeyCode"
../../include/X11/XKBlib.h:1021: warning: function declaration isn't a prototype
../../include/X11/XKBlib.h:1025: error: syntax error before "XkbAddDeviceLedInfo"
../../include/X11/XKBlib.h:1027: error: syntax error before "unsigned"
../../include/X11/XKBlib.h:1029: warning: type defaults to `int' in declaration of `XkbAddDeviceLedInfo'
../../include/X11/XKBlib.h:1029: warning: function declaration isn't a prototype
../../include/X11/XKBlib.h:1029: warning: data definition has no type or storage class
../../include/X11/XKBlib.h:1033: error: syntax error before "unsigned"
../../include/X11/XKBlib.h:1034: warning: function declaration isn't a prototype
../../include/X11/XKBlib.h:1036: error: syntax error before "XkbAllocDeviceInfo"
../../include/X11/XKBlib.h:1040: warning: type defaults to `int' in declaration of `XkbAllocDeviceInfo'
../../include/X11/XKBlib.h:1040: warning: data definition has no type or storage class
../../include/X11/XKBlib.h:1044: error: syntax error before "unsigned"
../../include/X11/XKBlib.h:1046: warning: function declaration isn't a prototype
../../include/X11/XKBlib.h:1050: error: syntax error before "XkbExtensionDeviceNotifyEvent"
../../include/X11/XKBlib.h:1052: warning: function declaration isn't a prototype
../../include/X11/XKBlib.h:1054: error: syntax error before "XkbGetDeviceInfo"
../../include/X11/XKBlib.h:1060: warning: type defaults to `int' in declaration of `XkbGetDeviceInfo'
../../include/X11/XKBlib.h:1060: warning: data definition has no type or storage class
../../include/X11/XKBlib.h:1064: error: syntax error before "XkbDeviceInfoPtr"
../../include/X11/XKBlib.h:1066: warning: function declaration isn't a prototype
../../include/X11/XKBlib.h:1070: error: syntax error before "XkbDeviceInfoPtr"
../../include/X11/XKBlib.h:1074: warning: function declaration isn't a prototype
../../include/X11/XKBlib.h:1078: error: syntax error before "XkbDeviceInfoPtr"
../../include/X11/XKBlib.h:1082: warning: function declaration isn't a prototype
../../include/X11/XKBlib.h:1087: error: syntax error before "XkbDeviceInfoPtr"
../../include/X11/XKBlib.h:1088: warning: function declaration isn't a prototype
../../include/X11/XKBlib.h:1092: error: syntax error before "XkbDeviceInfoPtr"
../../include/X11/XKBlib.h:1094: warning: function declaration isn't a prototype
../../include/X11/XKBlib.h:1098: error: syntax error before "XkbDeviceInfoPtr"
../../include/X11/XKBlib.h:1102: warning: function declaration isn't a prototype
../../include/X11/XKBlib.h:1106: error: syntax error before "XkbDeviceInfoPtr"
../../include/X11/XKBlib.h:1109: warning: function declaration isn't a prototype
../../include/X11/XKBlib.h:1132: error: syntax error before "unsigned"
../../include/X11/XKBlib.h:1134: warning: function declaration isn't a prototype
../../include/X11/XKBlib.h:1138: error: syntax error before '*' token
../../include/X11/XKBlib.h:1140: warning: function declaration isn't a prototype
../../include/X11/XKBlib.h:1145: error: syntax error before "unsigned"
../../include/X11/XKBlib.h:1147: warning: function declaration isn't a prototype
XKBBind.c:44:37: X11/extensions/XKBproto.h: No such file or directory
In file included from XKBBind.c:45:
XKBlibint.h:77: error: syntax error before "XkbDescRec"
XKBlibint.h:77: warning: no semicolon at end of struct or union
XKBlibint.h:78: warning: type defaults to `int' in declaration of `changes'
XKBlibint.h:78: warning: data definition has no type or storage class
XKBlibint.h:82: error: syntax error before '}' token
XKBlibint.h:82: warning: type defaults to `int' in declaration of `XkbInfoRec'
XKBlibint.h:82: warning: type defaults to `int' in declaration of `XkbInfoPtr'
XKBlibint.h:82: warning: data definition has no type or storage class
XKBlibint.h:195: error: syntax error before '*' token
XKBlibint.h:198: warning: function declaration isn't a prototype
XKBBind.c: In function `XkbKeycodeToKeysym':
XKBBind.c:79: error: `XkbDescRec' undeclared (first use in this function)
XKBBind.c:79: error: (Each undeclared identifier is reported only once
XKBBind.c:79: error: for each function it appears in.)
XKBBind.c:79: error: `xkb' undeclared (first use in this function)
XKBBind.c:81: error: dereferencing pointer to incomplete type
XKBBind.c:84: error: dereferencing pointer to incomplete type
XKBBind.c:84: error: dereferencing pointer to incomplete type
XKBBind.c:84: error: dereferencing pointer to incomplete type
XKBBind.c:84: error: dereferencing pointer to incomplete type
XKBBind.c:84: error: dereferencing pointer to incomplete type
XKBBind.c:86: error: dereferencing pointer to incomplete type
XKBBind.c:90: warning: implicit declaration of function `XkbKeyNumGroups'
XKBBind.c:90: warning: nested extern declaration of `XkbKeyNumGroups'
XKBBind.c:92: warning: implicit declaration of function `XkbKeyGroupWidth'
XKBBind.c:92: warning: nested extern declaration of `XkbKeyGroupWidth'
XKBBind.c:96: error: `XkbGroup2Index' undeclared (first use in this function)
XKBBind.c:102: warning: implicit declaration of function `XkbKeySymEntry'
XKBBind.c:102: warning: nested extern declaration of `XkbKeySymEntry'
XKBBind.c: In function `XKeycodeToKeysym':
XKBBind.c:114: error: `XkbDescRec' undeclared (first use in this function)
XKBBind.c:114: error: `xkb' undeclared (first use in this function)
XKBBind.c:116: error: dereferencing pointer to incomplete type
XKBBind.c:119: error: dereferencing pointer to incomplete type
XKBBind.c:119: error: dereferencing pointer to incomplete type
XKBBind.c:119: error: dereferencing pointer to incomplete type
XKBBind.c:119: error: dereferencing pointer to incomplete type
XKBBind.c:119: error: dereferencing pointer to incomplete type
XKBBind.c:121: error: dereferencing pointer to incomplete type
XKBBind.c:129: warning: nested extern declaration of `XkbKeyNumGroups'
XKBBind.c:130: warning: nested extern declaration of `XkbKeyGroupWidth'
XKBBind.c:130: error: `XkbGroup1Index' undeclared (first use in this function)
XKBBind.c:135: error: `XkbGroup2Index' undeclared (first use in this function)
XKBBind.c:141: error: `XkbGroup3Index' undeclared (first use in this function)
XKBBind.c:147: error: `XkbGroup4Index' undeclared (first use in this function)
XKBBind.c: In function `XKeysymToKeycode':
XKBBind.c:161: error: dereferencing pointer to incomplete type
XKBBind.c:163: error: dereferencing pointer to incomplete type
XKBBind.c:163: error: dereferencing pointer to incomplete type
XKBBind.c:163: error: dereferencing pointer to incomplete type
XKBBind.c:163: error: dereferencing pointer to incomplete type
XKBBind.c:163: error: dereferencing pointer to incomplete type
XKBBind.c:167: error: syntax error before '*' token
XKBBind.c:170: warning: implicit declaration of function `XkbKeyNumSyms'
XKBBind.c:170: warning: nested extern declaration of `XkbKeyNumSyms'
XKBBind.c:170: error: `xkb' undeclared (first use in this function)
XKBBind.c:172: warning: implicit declaration of function `XkbKeySym'
XKBBind.c:172: warning: nested extern declaration of `XkbKeySym'
XKBBind.c: In function `_XkbComputeModmap':
XKBBind.c:184: error: syntax error before "xkb"
XKBBind.c:186: error: `xkb' undeclared (first use in this function)
XKBBind.c:186: error: dereferencing pointer to incomplete type
XKBBind.c:187: error: `XkbModifierMapMask' undeclared (first use in this function)
XKBBind.c: In function `XkbKeysymToModifiers':
XKBBind.c:195: error: `XkbDescRec' undeclared (first use in this function)
XKBBind.c:195: error: `xkb' undeclared (first use in this function)
XKBBind.c:200: error: dereferencing pointer to incomplete type
XKBBind.c:202: error: dereferencing pointer to incomplete type
XKBBind.c:202: error: dereferencing pointer to incomplete type
XKBBind.c:202: error: dereferencing pointer to incomplete type
XKBBind.c:202: error: dereferencing pointer to incomplete type
XKBBind.c:202: error: dereferencing pointer to incomplete type
XKBBind.c:204: error: dereferencing pointer to incomplete type
XKBBind.c:204: error: dereferencing pointer to incomplete type
XKBBind.c:207: error: dereferencing pointer to incomplete type
XKBBind.c:210: warning: implicit declaration of function `XkbKeySymsPtr'
XKBBind.c:210: warning: nested extern declaration of `XkbKeySymsPtr'
XKBBind.c:210: warning: assignment makes pointer from integer without a cast
XKBBind.c:211: warning: nested extern declaration of `XkbKeyNumSyms'
XKBBind.c: In function `XLookupKeysym':
XKBBind.c:225: error: dereferencing pointer to incomplete type
XKBBind.c:227: error: dereferencing pointer to incomplete type
XKBBind.c:227: error: dereferencing pointer to incomplete type
XKBBind.c:227: error: dereferencing pointer to incomplete type
XKBBind.c:227: error: dereferencing pointer to incomplete type
XKBBind.c:227: error: dereferencing pointer to incomplete type
XKBBind.c: In function `XkbLookupKeySym':
XKBBind.c:259: error: dereferencing pointer to incomplete type
XKBBind.c:261: error: dereferencing pointer to incomplete type
XKBBind.c:261: error: dereferencing pointer to incomplete type
XKBBind.c:261: error: dereferencing pointer to incomplete type
XKBBind.c:261: error: dereferencing pointer to incomplete type
XKBBind.c:261: error: dereferencing pointer to incomplete type
XKBBind.c:262: error: dereferencing pointer to incomplete type
XKBBind.c: At top level:
XKBBind.c:267: warning: type defaults to `int' in declaration of `XkbDescPtr'
XKBBind.c:267: error: syntax error before "xkb"
XKBBind.c:272: warning: function declaration isn't a prototype
XKBBind.c: In function `XkbTranslateKeyCode':
XKBBind.c:273: error: `XkbKeyTypeRec' undeclared (first use in this function)
XKBBind.c:273: error: `type' undeclared (first use in this function)
XKBBind.c:278: error: `mods_rtrn' undeclared (first use in this function)
XKBBind.c:281: warning: nested extern declaration of `XkbKeyNumGroups'
XKBBind.c:281: error: `xkb' undeclared (first use in this function)
XKBBind.c:281: error: `key' undeclared (first use in this function)
XKBBind.c:282: warning: implicit declaration of function `XkbKeycodeInRange'
XKBBind.c:282: warning: nested extern declaration of `XkbKeycodeInRange'
XKBBind.c:283: error: `keysym_rtrn' undeclared (first use in this function)
XKBBind.c:288: warning: nested extern declaration of `XkbKeySymsPtr'
XKBBind.c:288: warning: assignment makes pointer from integer without a cast
XKBBind.c:292: warning: implicit declaration of function `XkbGroupForCoreState'
XKBBind.c:292: warning: nested extern declaration of `XkbGroupForCoreState'
XKBBind.c:292: error: `mods' undeclared (first use in this function)
XKBBind.c:294: warning: implicit declaration of function `XkbKeyGroupInfo'
XKBBind.c:294: warning: nested extern declaration of `XkbKeyGroupInfo'
XKBBind.c:295: warning: implicit declaration of function `XkbOutOfRangeGroupAction'
XKBBind.c:295: warning: nested extern declaration of `XkbOutOfRangeGroupAction'
XKBBind.c:299: error: `XkbClampIntoRange' undeclared (first use in this function)
XKBBind.c:302: error: `XkbRedirectIntoRange' undeclared (first use in this function)
XKBBind.c:303: warning: implicit declaration of function `XkbOutOfRangeGroupNumber'
XKBBind.c:303: warning: nested extern declaration of `XkbOutOfRangeGroupNumber'
XKBBind.c:309: warning: implicit declaration of function `XkbKeyGroupsWidth'
XKBBind.c:309: warning: nested extern declaration of `XkbKeyGroupsWidth'
XKBBind.c:310: warning: implicit declaration of function `XkbKeyKeyType'
XKBBind.c:310: warning: nested extern declaration of `XkbKeyKeyType'
XKBBind.c:315: error: syntax error before "entry"
XKBBind.c:316: error: `entry' undeclared (first use in this function)
XKBBind.c: In function `XkbRefreshKeyboardMapping':
XKBBind.c:349: error: syntax error before "xkbi"
XKBBind.c:351: error: dereferencing pointer to incomplete type
XKBBind.c:355: error: `xkbi' undeclared (first use in this function)
XKBBind.c:357: error: `XkbEventCode' undeclared (first use in this function)
XKBBind.c:359: error: `XkbNewKeyboardNotify' undeclared (first use in this function)
XKBBind.c:363: error: `XkbMapNotify' undeclared (first use in this function)
XKBBind.c:364: error: `XkbMapChangesRec' undeclared (first use in this function)
XKBBind.c:364: error: syntax error before "changes"
XKBBind.c:370: error: `XkbAllClientInfoMask' undeclared (first use in this function)
XKBBind.c: In function `XRefreshKeyboardMapping':
XKBBind.c:393: error: `XkbMapChangesRec' undeclared (first use in this function)
XKBBind.c:393: error: syntax error before "changes"
XKBBind.c:399: error: dereferencing pointer to incomplete type
XKBBind.c:402: error: `xkbi' undeclared (first use in this function)
XKBBind.c:404: error: `XkbEventCode' undeclared (first use in this function)
XKBBind.c:415: error: `XkbAllClientInfoMask' undeclared (first use in this function)
XKBBind.c:419: error: request for member `changed' in something not a structure or union
XKBBind.c:419: error: `XkbKeySymsMask' undeclared (first use in this function)
XKBBind.c:421: error: request for member `first_key_sym' in something not a structure or union
XKBBind.c:422: error: request for member `num_key_syms' in something not a structure or union
XKBBind.c:426: error: request for member `first_key_sym' in something not a structure or union
XKBBind.c:427: error: request for member `num_key_syms' in something not a structure or union
XKBBind.c: In function `_XkbLoadDpy':
XKBBind.c:500: error: syntax error before "xkbi"
XKBBind.c:502: error: `XkbDescRec' undeclared (first use in this function)
XKBBind.c:502: error: `desc' undeclared (first use in this function)
XKBBind.c:507: error: `xkbi' undeclared (first use in this function)
XKBBind.c:508: error: `XkbAllClientInfoMask' undeclared (first use in this function)
XKBBind.c:509: error: `XkbUseCoreKbd' undeclared (first use in this function)
XKBBind.c:522: error: `XkbNewKeyboardNotify' undeclared (first use in this function)
XKBBind.c:523: error: `XkbNKN_KeycodesMask' undeclared (first use in this function)
XKBBind.c:523: error: `XkbNKN_DeviceIDMask' undeclared (first use in this function)
XKBBind.c:526: error: `XkbMapNotify' undeclared (first use in this function)
XKBBind.c: In function `_XkbReloadDpy':
XKBBind.c:537: error: syntax error before "xkbi"
XKBBind.c:538: error: `XkbDescRec' undeclared (first use in this function)
XKBBind.c:538: error: `desc' undeclared (first use in this function)
XKBBind.c:541: error: dereferencing pointer to incomplete type
XKBBind.c:544: error: `xkbi' undeclared (first use in this function)
XKBBind.c:548: error: `XkbAllComponentsMask' undeclared (first use in this function)
XKBBind.c:553: error: `XkbUseCoreKbd' undeclared (first use in this function)
XKBBind.c:555: error: `XkbAllClientInfoMask' undeclared (first use in this function)
XKBBind.c: In function `XkbTranslateKeySym':
XKBBind.c:585: error: syntax error before "xkb"
XKBBind.c:591: error: `xkb' undeclared (first use in this function)
XKBBind.c: In function `XLookupString':
XKBBind.c:676: error: dereferencing pointer to incomplete type
XKBBind.c:680: error: dereferencing pointer to incomplete type
XKBBind.c:688: warning: nested extern declaration of `XkbKeyNumGroups'
XKBBind.c:688: error: dereferencing pointer to incomplete type
XKBBind.c:691: warning: nested extern declaration of `XkbGroupForCoreState'
XKBBind.c:693: warning: implicit declaration of function `XkbBuildCoreState'
XKBBind.c:693: warning: nested extern declaration of `XkbBuildCoreState'
XKBBind.c:802: error: dereferencing pointer to incomplete type
XKBBind.c:803: error: dereferencing pointer to incomplete type
XKBBind.c: In function `XkbTranslateKeyCode':
XKBBind.c:316: warning: value computed is not used
XKBBind.c:316: warning: value computed is not used
make[3]: *** [XKBBind.lo] Error 1
make[3]: *** Waiting for unfinished jobs....
x86_64-pc-linux-gnu-gcc -DHAVE_CONFIG_H -I. -I. -I../../src -I../../include/X11 -I../../include -I../../include/X11 -I../../include -I../../include/X11 -I../../src/xcms -I../../src/xkb -I../../src/xlibi18n -Wall -Wpointer-arith -Wstrict-prototypes -Wmissing-prototypes -Wmissing-declarations -Wnested-externs -fno-strict-aliasing -D_BSD_SOURCE -DHAS_FCHOWN -DHAS_STICKY_DIR_BIT -DHASXDMAUTH -D_BSD_SOURCE -DMALLOC_0_RETURNS_NULL -march=k8 -O2 -pipe -m3dnow -mmmx -msse -msse2 -msse3 -MT XKB.lo -MD -MP -MF .deps/XKB.Tpo -c XKB.c -fPIC -DPIC -o .libs/XKB.o
XKB.c:36:37: X11/extensions/XKBproto.h: No such file or directory
In file included from XKBlibint.h:33,
from XKB.c:37:
../../include/X11/XKBlib.h:33:35: X11/extensions/XKBstr.h: No such file or directory
In file included from XKBlibint.h:33,
from XKB.c:37:
../../include/X11/XKBlib.h:218: error: `XkbActionMessageLength' undeclared here (not in a function)
../../include/X11/XKBlib.h:393: error: syntax error before "KeyCode"
../../include/X11/XKBlib.h:397: warning: function declaration isn't a prototype
../../include/X11/XKBlib.h:493: error: syntax error before "XkbMapNotifyEvent"
../../include/X11/XKBlib.h:495: warning: function declaration isn't a prototype
../../include/X11/XKBlib.h:499: error: syntax error before "XkbNamesNotifyEvent"
../../include/X11/XKBlib.h:501: warning: function declaration isn't a prototype
../../include/X11/XKBlib.h:520: error: syntax error before "XkbDescPtr"
../../include/X11/XKBlib.h:521: warning: function declaration isn't a prototype
../../include/X11/XKBlib.h:526: error: syntax error before "XkbDescPtr"
../../include/X11/XKBlib.h:527: warning: function declaration isn't a prototype
../../include/X11/XKBlib.h:543: error: syntax error before "XkbIndicatorMapPtr"
../../include/X11/XKBlib.h:545: warning: function declaration isn't a prototype
../../include/X11/XKBlib.h:555: error: syntax error before "XkbIndicatorMapPtr"
../../include/X11/XKBlib.h:557: warning: function declaration isn't a prototype
../../include/X11/XKBlib.h:565: error: syntax error before "XkbIndicatorMapPtr"
../../include/X11/XKBlib.h:566: warning: function declaration isn't a prototype
../../include/X11/XKBlib.h:577: error: syntax error before "XkbIndicatorMapPtr"
../../include/X11/XKBlib.h:578: warning: function declaration isn't a prototype
../../include/X11/XKBlib.h:627: error: syntax error before "unsigned"
../../include/X11/XKBlib.h:629: warning: function declaration isn't a prototype
../../include/X11/XKBlib.h:634: error: syntax error before "unsigned"
../../include/X11/XKBlib.h:635: warning: function declaration isn't a prototype
../../include/X11/XKBlib.h:639: error: syntax error before "unsigned"
../../include/X11/XKBlib.h:641: warning: function declaration isn't a prototype
../../include/X11/XKBlib.h:643: error: syntax error before "XkbAllocKeyboard"
../../include/X11/XKBlib.h:645: warning: type defaults to `int' in declaration of `XkbAllocKeyboard'
../../include/X11/XKBlib.h:645: warning: data definition has no type or storage class
../../include/X11/XKBlib.h:649: error: syntax error before "unsigned"
../../include/X11/XKBlib.h:651: warning: function declaration isn't a prototype
../../include/X11/XKBlib.h:655: error: syntax error before "unsigned"
../../include/X11/XKBlib.h:657: warning: function declaration isn't a prototype
../../include/X11/XKBlib.h:661: error: syntax error before "unsigned"
../../include/X11/XKBlib.h:663: warning: function declaration isn't a prototype
../../include/X11/XKBlib.h:667: error: syntax error before "unsigned"
../../include/X11/XKBlib.h:669: warning: function declaration isn't a prototype
../../include/X11/XKBlib.h:673: error: syntax error before "unsigned"
../../include/X11/XKBlib.h:675: warning: function declaration isn't a prototype
../../include/X11/XKBlib.h:677: error: syntax error before "XkbAddKeyType"
../../include/X11/XKBlib.h:679: error: syntax error before "Atom"
../../include/X11/XKBlib.h:683: warning: type defaults to `int' in declaration of `XkbAddKeyType'
../../include/X11/XKBlib.h:683: warning: function declaration isn't a prototype
../../include/X11/XKBlib.h:683: warning: data definition has no type or storage class
../../include/X11/XKBlib.h:687: warning: parameter names (without types) in function declaration
../../include/X11/XKBlib.h:691: warning: parameter names (without types) in function declaration
../../include/X11/XKBlib.h:693: error: syntax error before "XkbGetMap"
../../include/X11/XKBlib.h:697: warning: type defaults to `int' in declaration of `XkbGetMap'
../../include/X11/XKBlib.h:697: warning: data definition has no type or storage class
../../include/X11/XKBlib.h:702: error: syntax error before "XkbDescPtr"
../../include/X11/XKBlib.h:703: warning: function declaration isn't a prototype
../../include/X11/XKBlib.h:707: error: syntax error before "XkbDescPtr"
../../include/X11/XKBlib.h:709: warning: function declaration isn't a prototype
../../include/X11/XKBlib.h:720: error: syntax error before "XkbDescPtr"
../../include/X11/XKBlib.h:721: warning: function declaration isn't a prototype
../../include/X11/XKBlib.h:727: error: syntax error before "XkbDescPtr"
../../include/X11/XKBlib.h:728: warning: function declaration isn't a prototype
../../include/X11/XKBlib.h:734: error: syntax error before "XkbDescPtr"
../../include/X11/XKBlib.h:735: warning: function declaration isn't a prototype
../../include/X11/XKBlib.h:741: error: syntax error before "XkbDescPtr"
../../include/X11/XKBlib.h:742: warning: function declaration isn't a prototype
../../include/X11/XKBlib.h:747: error: syntax error before "XkbDescPtr"
../../include/X11/XKBlib.h:748: warning: function declaration isn't a prototype
../../include/X11/XKBlib.h:754: error: syntax error before "XkbDescPtr"
../../include/X11/XKBlib.h:755: warning: function declaration isn't a prototype
../../include/X11/XKBlib.h:761: error: syntax error before "XkbDescPtr"
../../include/X11/XKBlib.h:762: warning: function declaration isn't a prototype
../../include/X11/XKBlib.h:768: error: syntax error before "XkbDescPtr"
../../include/X11/XKBlib.h:769: warning: function declaration isn't a prototype
../../include/X11/XKBlib.h:773: error: syntax error before "unsigned"
../../include/X11/XKBlib.h:774: warning: function declaration isn't a prototype
../../include/X11/XKBlib.h:778: error: syntax error before "unsigned"
../../include/X11/XKBlib.h:780: warning: function declaration isn't a prototype
../../include/X11/XKBlib.h:785: error: syntax error before "XkbDescPtr"
../../include/X11/XKBlib.h:786: warning: function declaration isn't a prototype
../../include/X11/XKBlib.h:791: error: syntax error before "XkbDescPtr"
../../include/X11/XKBlib.h:792: warning: function declaration isn't a prototype
../../include/X11/XKBlib.h:796: error: syntax error before "XkbControlsNotifyEvent"
../../include/X11/XKBlib.h:798: warning: function declaration isn't a prototype
../../include/X11/XKBlib.h:805: error: syntax error before "unsigned"
../../include/X11/XKBlib.h:807: warning: function declaration isn't a prototype
../../include/X11/XKBlib.h:811: error: syntax error before "unsigned"
../../include/X11/XKBlib.h:813: warning: function declaration isn't a prototype
../../include/X11/XKBlib.h:818: error: syntax error before "XkbDescPtr"
../../include/X11/XKBlib.h:819: warning: function declaration isn't a prototype
../../include/X11/XKBlib.h:824: error: syntax error before "XkbDescPtr"
../../include/X11/XKBlib.h:826: warning: function declaration isn't a prototype
../../include/X11/XKBlib.h:828: error: syntax error before "XkbAddSymInterpret"
../../include/X11/XKBlib.h:831: error: syntax error before "int"
../../include/X11/XKBlib.h:833: warning: type defaults to `int' in declaration of `XkbAddSymInterpret'
../../include/X11/XKBlib.h:833: warning: function declaration isn't a prototype
../../include/X11/XKBlib.h:833: warning: data definition has no type or storage class
../../include/X11/XKBlib.h:837: error: syntax error before "unsigned"
../../include/X11/XKBlib.h:840: warning: function declaration isn't a prototype
../../include/X11/XKBlib.h:845: error: syntax error before "XkbDescPtr"
../../include/X11/XKBlib.h:846: warning: function declaration isn't a prototype
../../include/X11/XKBlib.h:853: error: syntax error before "XkbDescPtr"
../../include/X11/XKBlib.h:854: warning: function declaration isn't a prototype
../../include/X11/XKBlib.h:858: error: syntax error before "XkbDescPtr"
../../include/X11/XKBlib.h:860: warning: function declaration isn't a prototype
../../include/X11/XKBlib.h:864: error: syntax error before "unsigned"
../../include/X11/XKBlib.h:866: warning: function declaration isn't a prototype
../../include/X11/XKBlib.h:872: error: syntax error before "XkbStatePtr"
../../include/X11/XKBlib.h:873: warning: function declaration isn't a prototype
../../include/X11/XKBlib.h:878: error: syntax error before "XkbDescPtr"
../../include/X11/XKBlib.h:879: warning: function declaration isn't a prototype
../../include/X11/XKBlib.h:883: error: syntax error before "XkbDescPtr"
../../include/X11/XKBlib.h:885: warning: function declaration isn't a prototype
../../include/X11/XKBlib.h:925: warning: parameter names (without types) in function declaration
../../include/X11/XKBlib.h:930: error: syntax error before "int"
../../include/X11/XKBlib.h:931: warning: function declaration isn't a prototype
../../include/X11/XKBlib.h:935: error: syntax error before "int"
../../include/X11/XKBlib.h:939: warning: function declaration isn't a prototype
../../include/X11/XKBlib.h:943: error: syntax error before "int"
../../include/X11/XKBlib.h:945: warning: function declaration isn't a prototype
../../include/X11/XKBlib.h:947: error: syntax error before '*' token
../../include/X11/XKBlib.h:949: error: syntax error before "int"
../../include/X11/XKBlib.h:951: warning: type defaults to `int' in declaration of `XkbResizeKeyActions'
../../include/X11/XKBlib.h:951: warning: function declaration isn't a prototype
../../include/X11/XKBlib.h:951: warning: data definition has no type or storage class
../../include/X11/XKBlib.h:955: error: syntax error before "int"
../../include/X11/XKBlib.h:960: warning: function declaration isn't a prototype
../../include/X11/XKBlib.h:964: error: syntax error before "int"
../../include/X11/XKBlib.h:967: warning: function declaration isn't a prototype
../../include/X11/XKBlib.h:971: error: syntax error before "XkbListComponents"
../../include/X11/XKBlib.h:974: error: syntax error before "XkbComponentNamesPtr"
../../include/X11/XKBlib.h:976: warning: type defaults to `int' in declaration of `XkbListComponents'
../../include/X11/XKBlib.h:976: warning: function declaration isn't a prototype
../../include/X11/XKBlib.h:976: warning: data definition has no type or storage class
../../include/X11/XKBlib.h:980: warning: parameter names (without types) in function declaration
../../include/X11/XKBlib.h:982: error: syntax error before "XkbGetKeyboard"
../../include/X11/XKBlib.h:986: warning: type defaults to `int' in declaration of `XkbGetKeyboard'
../../include/X11/XKBlib.h:986: warning: data definition has no type or storage class
../../include/X11/XKBlib.h:988: error: syntax error before "XkbGetKeyboardByName"
../../include/X11/XKBlib.h:991: error: syntax error before "XkbComponentNamesPtr"
../../include/X11/XKBlib.h:995: warning: type defaults to `int' in declaration of `XkbGetKeyboardByName'
../../include/X11/XKBlib.h:995: warning: function declaration isn't a prototype
../../include/X11/XKBlib.h:995: warning: data definition has no type or storage class
../../include/X11/XKBlib.h:1001: error: syntax error before "int"
../../include/X11/XKBlib.h:1006: warning: function declaration isn't a prototype
../../include/X11/XKBlib.h:1010: error: syntax error before "KeyCode"
../../include/X11/XKBlib.h:1012: warning: function declaration isn't a prototype
../../include/X11/XKBlib.h:1016: error: syntax error before "KeyCode"
../../include/X11/XKBlib.h:1021: warning: function declaration isn't a prototype
../../include/X11/XKBlib.h:1025: error: syntax error before "XkbAddDeviceLedInfo"
../../include/X11/XKBlib.h:1027: error: syntax error before "unsigned"
../../include/X11/XKBlib.h:1029: warning: type defaults to `int' in declaration of `XkbAddDeviceLedInfo'
../../include/X11/XKBlib.h:1029: warning: function declaration isn't a prototype
../../include/X11/XKBlib.h:1029: warning: data definition has no type or storage class
../../include/X11/XKBlib.h:1033: error: syntax error before "unsigned"
../../include/X11/XKBlib.h:1034: warning: function declaration isn't a prototype
../../include/X11/XKBlib.h:1036: error: syntax error before "XkbAllocDeviceInfo"
../../include/X11/XKBlib.h:1040: warning: type defaults to `int' in declaration of `XkbAllocDeviceInfo'
../../include/X11/XKBlib.h:1040: warning: data definition has no type or storage class
../../include/X11/XKBlib.h:1044: error: syntax error before "unsigned"
../../include/X11/XKBlib.h:1046: warning: function declaration isn't a prototype
../../include/X11/XKBlib.h:1050: error: syntax error before "XkbExtensionDeviceNotifyEvent"
../../include/X11/XKBlib.h:1052: warning: function declaration isn't a prototype
../../include/X11/XKBlib.h:1054: error: syntax error before "XkbGetDeviceInfo"
../../include/X11/XKBlib.h:1060: warning: type defaults to `int' in declaration of `XkbGetDeviceInfo'
../../include/X11/XKBlib.h:1060: warning: data definition has no type or storage class
../../include/X11/XKBlib.h:1064: error: syntax error before "XkbDeviceInfoPtr"
../../include/X11/XKBlib.h:1066: warning: function declaration isn't a prototype
../../include/X11/XKBlib.h:1070: error: syntax error before "XkbDeviceInfoPtr"
../../include/X11/XKBlib.h:1074: warning: function declaration isn't a prototype
../../include/X11/XKBlib.h:1078: error: syntax error before "XkbDeviceInfoPtr"
../../include/X11/XKBlib.h:1082: warning: function declaration isn't a prototype
../../include/X11/XKBlib.h:1087: error: syntax error before "XkbDeviceInfoPtr"
../../include/X11/XKBlib.h:1088: warning: function declaration isn't a prototype
../../include/X11/XKBlib.h:1092: error: syntax error before "XkbDeviceInfoPtr"
../../include/X11/XKBlib.h:1094: warning: function declaration isn't a prototype
../../include/X11/XKBlib.h:1098: error: syntax error before "XkbDeviceInfoPtr"
../../include/X11/XKBlib.h:1102: warning: function declaration isn't a prototype
../../include/X11/XKBlib.h:1106: error: syntax error before "XkbDeviceInfoPtr"
../../include/X11/XKBlib.h:1109: warning: function declaration isn't a prototype
../../include/X11/XKBlib.h:1132: error: syntax error before "unsigned"
../../include/X11/XKBlib.h:1134: warning: function declaration isn't a prototype
../../include/X11/XKBlib.h:1138: error: syntax error before '*' token
../../include/X11/XKBlib.h:1140: warning: function declaration isn't a prototype
../../include/X11/XKBlib.h:1145: error: syntax error before "unsigned"
../../include/X11/XKBlib.h:1147: warning: function declaration isn't a prototype
In file included from XKB.c:37:
XKBlibint.h:77: error: syntax error before "XkbDescRec"
XKBlibint.h:77: warning: no semicolon at end of struct or union
XKBlibint.h:78: warning: type defaults to `int' in declaration of `changes'
XKBlibint.h:78: warning: data definition has no type or storage class
XKBlibint.h:82: error: syntax error before '}' token
XKBlibint.h:82: warning: type defaults to `int' in declaration of `XkbInfoRec'
XKBlibint.h:82: warning: type defaults to `int' in declaration of `XkbInfoPtr'
XKBlibint.h:82: warning: data definition has no type or storage class
XKBlibint.h:195: error: syntax error before '*' token
XKBlibint.h:198: warning: function declaration isn't a prototype
XKB.c: In function `XkbQueryExtension':
XKB.c:53: error: dereferencing pointer to incomplete type
XKB.c:55: error: dereferencing pointer to incomplete type
XKB.c:57: error: dereferencing pointer to incomplete type
XKB.c:59: error: dereferencing pointer to incomplete type
XKB.c:61: error: dereferencing pointer to incomplete type
XKB.c: In function `XkbLibraryVersion':
XKB.c:70: error: `XkbMajorVersion' undeclared (first use in this function)
XKB.c:70: error: (Each undeclared identifier is reported only once
XKB.c:70: error: for each function it appears in.)
XKB.c:81: error: `XkbMinorVersion' undeclared (first use in this function)
XKB.c: In function `XkbSelectEvents':
XKB.c:91: error: syntax error before '*' token
XKB.c:98: error: `xkbi' undeclared (first use in this function)
XKB.c:101: error: `sz_xkbSelectEventsReq' undeclared (first use in this function)
XKB.c:101: error: `req' undeclared (first use in this function)
XKB.c:101: error: `xkbSelectEventsReq' undeclared (first use in this function)
XKB.c:101: error: syntax error before ')' token
XKB.c:101: error: `X_kbSelectEvents' undeclared (first use in this function)
XKB.c:108: error: `XkbMapNotifyMask' undeclared (first use in this function)
XKB.c:109: error: `XkbAllMapComponentsMask' undeclared (first use in this function)
XKB.c:113: error: `XkbAllMapEventsMask' undeclared (first use in this function)
XKB.c:114: error: `XkbAllClientInfoMask' undeclared (first use in this function)
XKB.c:119: error: `XkbNewKeyboardNotifyMask' undeclared (first use in this function)
XKB.c:121: error: `XkbAllNewKeyboardEventsMask' undeclared (first use in this function)
XKB.c: In function `XkbSelectEventDetails':
XKB.c:142: error: syntax error before '*' token
XKB.c:156: error: `xkbi' undeclared (first use in this function)
XKB.c:159: error: `sz_xkbSelectEventsReq' undeclared (first use in this function)
XKB.c:159: error: `req' undeclared (first use in this function)
XKB.c:159: error: `xkbSelectEventsReq' undeclared (first use in this function)
XKB.c:159: error: syntax error before ')' token
XKB.c:159: error: `X_kbSelectEvents' undeclared (first use in this function)
XKB.c:164: error: `XkbMapNotify' undeclared (first use in this function)
XKB.c:173: error: `XkbAllClientInfoMask' undeclared (first use in this function)
XKB.c:174: error: `XkbMapNotifyMask' undeclared (first use in this function)
XKB.c:182: error: `XkbNewKeyboardNotify' undeclared (first use in this function)
XKB.c:186: error: `XkbAllNewKeyboardEventsMask' undeclared (first use in this function)
XKB.c:187: error: `XkbStateNotify' undeclared (first use in this function)
XKB.c:188: error: `XkbNamesNotify' undeclared (first use in this function)
XKB.c:189: error: `XkbAccessXNotify' undeclared (first use in this function)
XKB.c:190: error: `XkbExtensionDeviceNotify' undeclared (first use in this function)
XKB.c:194: error: `XkbControlsNotify' undeclared (first use in this function)
XKB.c:195: error: `XkbIndicatorStateNotify' undeclared (first use in this function)
XKB.c:196: error: `XkbIndicatorMapNotify' undeclared (first use in this function)
XKB.c:200: error: `XkbBellNotify' undeclared (first use in this function)
XKB.c:201: error: `XkbActionMessage' undeclared (first use in this function)
XKB.c:202: error: `XkbCompatMapNotify' undeclared (first use in this function)
XKB.c: In function `XkbLockModifiers':
XKB.c:233: error: syntax error before '*' token
XKB.c:240: error: `xkbi' undeclared (first use in this function)
XKB.c:241: error: `sz_xkbLatchLockStateReq' undeclared (first use in this function)
XKB.c:241: error: `req' undeclared (first use in this function)
XKB.c:241: error: `xkbLatchLockStateReq' undeclared (first use in this function)
XKB.c:241: error: syntax error before ')' token
XKB.c:241: error: `X_kbLatchLockState' undeclared (first use in this function)
XKB.c: In function `XkbLatchModifiers':
XKB.c:264: error: syntax error before '*' token
XKB.c:271: error: `xkbi' undeclared (first use in this function)
XKB.c:272: error: `sz_xkbLatchLockStateReq' undeclared (first use in this function)
XKB.c:272: error: `req' undeclared (first use in this function)
XKB.c:272: error: `xkbLatchLockStateReq' undeclared (first use in this function)
XKB.c:272: error: syntax error before ')' token
XKB.c:272: error: `X_kbLatchLockState' undeclared (first use in this function)
XKB.c: In function `XkbLockGroup':
XKB.c:294: error: syntax error before '*' token
XKB.c:301: error: `xkbi' undeclared (first use in this function)
XKB.c:302: error: `sz_xkbLatchLockStateReq' undeclared (first use in this function)
XKB.c:302: error: `req' undeclared (first use in this function)
XKB.c:302: error: `xkbLatchLockStateReq' undeclared (first use in this function)
XKB.c:302: error: syntax error before ')' token
XKB.c:302: error: `X_kbLatchLockState' undeclared (first use in this function)
XKB.c: In function `XkbLatchGroup':
XKB.c:322: error: syntax error before '*' token
XKB.c:329: error: `xkbi' undeclared (first use in this function)
XKB.c:330: error: `sz_xkbLatchLockStateReq' undeclared (first use in this function)
XKB.c:330: error: `req' undeclared (first use in this function)
XKB.c:330: error: `xkbLatchLockStateReq' undeclared (first use in this function)
XKB.c:330: error: syntax error before ')' token
XKB.c:330: error: `X_kbLatchLockState' undeclared (first use in this function)
XKB.c: In function `XkbSetXlibControls':
XKB.c:357: error: dereferencing pointer to incomplete type
XKB.c:358: error: dereferencing pointer to incomplete type
XKB.c:359: error: dereferencing pointer to incomplete type
XKB.c: In function `XkbGetXlibControls':
XKB.c:369: error: dereferencing pointer to incomplete type
XKB.c: In function `XkbSetDebuggingFlags':
XKB.c:392: error: syntax error before '*' token
XKB.c:393: error: `xkbSetDebuggingFlagsReply' undeclared (first use in this function)
XKB.c:400: error: `xkbi' undeclared (first use in this function)
XKB.c:401: error: `sz_xkbSetDebuggingFlagsReq' undeclared (first use in this function)
XKB.c:401: error: `req' undeclared (first use in this function)
XKB.c:401: error: `xkbSetDebuggingFlagsReq' undeclared (first use in this function)
XKB.c:401: error: syntax error before ')' token
XKB.c:401: error: `X_kbSetDebuggingFlags' undeclared (first use in this function)
XKB.c:417: error: `rep' undeclared (first use in this function)
XKB.c: At top level:
XKB.c:432: error: syntax error before "xkb"
XKB.c:435: warning: function declaration isn't a prototype
XKB.c: In function `XkbComputeEffectiveMap':
XKB.c:438: error: `XkbKTMapEntryPtr' undeclared (first use in this function)
XKB.c:438: error: syntax error before "entry"
XKB.c:440: error: `xkb' undeclared (first use in this function)
XKB.c:440: error: `type' undeclared (first use in this function)
XKB.c:448: error: `entry' undeclared (first use in this function)
XKB.c:466: error: `map_rtrn' undeclared (first use in this function)
XKB.c: At top level:
XKB.c:478: error: syntax error before "XkbStatePtr"
XKB.c:479: warning: function declaration isn't a prototype
XKB.c: In function `XkbGetState':
XKB.c:480: error: syntax error before '*' token
XKB.c:481: error: `xkbGetStateReply' undeclared (first use in this function)
XKB.c:484: error: `dpy' undeclared (first use in this function)
XKB.c:488: error: `xkbi' undeclared (first use in this function)
XKB.c:489: error: `sz_xkbGetStateReq' undeclared (first use in this function)
XKB.c:489: error: `req' undeclared (first use in this function)
XKB.c:489: error: `xkbGetStateReq' undeclared (first use in this function)
XKB.c:489: error: syntax error before ')' token
XKB.c:489: error: `X_kbGetState' undeclared (first use in this function)
XKB.c:492: error: `deviceSpec' undeclared (first use in this function)
XKB.c:493: error: `rep' undeclared (first use in this function)
XKB.c:498: error: `rtrn' undeclared (first use in this function)
XKB.c: In function `XkbSetDetectableAutoRepeat':
XKB.c:520: error: syntax error before '*' token
XKB.c:521: error: `xkbPerClientFlagsReply' undeclared (first use in this function)
XKB.c:528: error: `xkbi' undeclared (first use in this function)
XKB.c:529: error: `sz_xkbPerClientFlagsReq' undeclared (first use in this function)
XKB.c:529: error: `req' undeclared (first use in this function)
XKB.c:529: error: `xkbPerClientFlagsReq' undeclared (first use in this function)
XKB.c:529: error: syntax error before ')' token
XKB.c:529: error: `X_kbPerClientFlags' undeclared (first use in this function)
XKB.c:532: error: `XkbUseCoreKbd' undeclared (first use in this function)
XKB.c:533: error: `XkbPCF_DetectableAutoRepeatMask' undeclared (first use in this function)
XKB.c:538: error: `rep' undeclared (first use in this function)
XKB.c: In function `XkbGetDetectableAutoRepeat':
XKB.c:553: error: syntax error before '*' token
XKB.c:554: error: `xkbPerClientFlagsReply' undeclared (first use in this function)
XKB.c:561: error: `xkbi' undeclared (first use in this function)
XKB.c:562: error: `sz_xkbPerClientFlagsReq' undeclared (first use in this function)
XKB.c:562: error: `req' undeclared (first use in this function)
XKB.c:562: error: `xkbPerClientFlagsReq' undeclared (first use in this function)
XKB.c:562: error: syntax error before ')' token
XKB.c:562: error: `X_kbPerClientFlags' undeclared (first use in this function)
XKB.c:565: error: `XkbUseCoreKbd' undeclared (first use in this function)
XKB.c:569: error: `rep' undeclared (first use in this function)
XKB.c:577: error: `XkbPCF_DetectableAutoRepeatMask' undeclared (first use in this function)
XKB.c: In function `XkbSetAutoResetControls':
XKB.c:587: error: syntax error before '*' token
XKB.c:588: error: `xkbPerClientFlagsReply' undeclared (first use in this function)
XKB.c:595: error: `xkbi' undeclared (first use in this function)
XKB.c:596: error: `sz_xkbPerClientFlagsReq' undeclared (first use in this function)
XKB.c:596: error: `req' undeclared (first use in this function)
XKB.c:596: error: `xkbPerClientFlagsReq' undeclared (first use in this function)
XKB.c:596: error: syntax error before ')' token
XKB.c:596: error: `X_kbPerClientFlags' undeclared (first use in this function)
XKB.c:599: error: `XkbPCF_AutoResetControlsMask' undeclared (first use in this function)
XKB.c:600: error: `XkbUseCoreKbd' undeclared (first use in this function)
XKB.c:605: error: `rep' undeclared (first use in this function)
XKB.c: In function `XkbGetAutoResetControls':
XKB.c:622: error: syntax error before '*' token
XKB.c:623: error: `xkbPerClientFlagsReply' undeclared (first use in this function)
XKB.c:630: error: `xkbi' undeclared (first use in this function)
XKB.c:631: error: `sz_xkbPerClientFlagsReq' undeclared (first use in this function)
XKB.c:631: error: `req' undeclared (first use in this function)
XKB.c:631: error: `xkbPerClientFlagsReq' undeclared (first use in this function)
XKB.c:631: error: syntax error before ')' token
XKB.c:631: error: `X_kbPerClientFlags' undeclared (first use in this function)
XKB.c:634: error: `XkbUseCoreKbd' undeclared (first use in this function)
XKB.c:638: error: `rep' undeclared (first use in this function)
XKB.c:649: error: `XkbPCF_AutoResetControlsMask' undeclared (first use in this function)
XKB.c: In function `XkbSetPerClientControls':
XKB.c:657: error: syntax error before '*' token
XKB.c:658: error: `xkbPerClientFlagsReply' undeclared (first use in this function)
XKB.c:664: error: `XkbPCF_GrabsUseXKBStateMask' undeclared (first use in this function)
XKB.c:664: error: `XkbPCF_LookupStateWhenGrabbed' undeclared (first use in this function)
XKB.c:664: error: `XkbPCF_SendEventUsesXKBState' undeclared (first use in this function)
XKB.c:667: error: `xkbi' undeclared (first use in this function)
XKB.c:668: error: `sz_xkbPerClientFlagsReq' undeclared (first use in this function)
XKB.c:668: error: `req' undeclared (first use in this function)
XKB.c:668: error: `xkbPerClientFlagsReq' undeclared (first use in this function)
XKB.c:668: error: syntax error before ')' token
XKB.c:668: error: `X_kbPerClientFlags' undeclared (first use in this function)
XKB.c:672: error: `XkbUseCoreKbd' undeclared (first use in this function)
XKB.c:675: error: `rep' undeclared (first use in this function)
XKB.c: In function `XkbGetPerClientControls':
XKB.c:690: error: syntax error before '*' token
XKB.c:691: error: `xkbPerClientFlagsReply' undeclared (first use in this function)
XKB.c:696: error: `XkbPCF_GrabsUseXKBStateMask' undeclared (first use in this function)
XKB.c:696: error: `XkbPCF_LookupStateWhenGrabbed' undeclared (first use in this function)
XKB.c:696: error: `XkbPCF_SendEventUsesXKBState' undeclared (first use in this function)
XKB.c:699: error: `xkbi' undeclared (first use in this function)
XKB.c:700: error: `sz_xkbPerClientFlagsReq' undeclared (first use in this function)
XKB.c:700: error: `req' undeclared (first use in this function)
XKB.c:700: error: `xkbPerClientFlagsReq' undeclared (first use in this function)
XKB.c:700: error: syntax error before ')' token
XKB.c:700: error: `X_kbPerClientFlags' undeclared (first use in this function)
XKB.c:703: error: `XkbUseCoreKbd' undeclared (first use in this function)
XKB.c:707: error: `rep' undeclared (first use in this function)
XKB.c: In function `XkbOpenDisplay':
XKB.c:740: error: `XkbMajorVersion' undeclared (first use in this function)
XKB.c:741: error: `XkbMinorVersion' undeclared (first use in this function)
XKB.c: In function `XkbComputeEffectiveMap':
XKB.c:449: warning: value computed is not used
make[3]: *** [XKB.lo] Error 1
make[3]: Leaving directory `/var/tmp/portage/libX11-1.0.2/work/libX11-1.0.2/src/xkb'
make[2]: *** [all-recursive] Error 1
make[2]: Leaving directory `/var/tmp/portage/libX11-1.0.2/work/libX11-1.0.2/src'
make[1]: *** [all] Error 2
make[1]: Leaving directory `/var/tmp/portage/libX11-1.0.2/work/libX11-1.0.2/src'
make: *** [all-recursive] Error 1
!!! ERROR: x11-libs/libX11-1.0.2 failed.
Call stack:
ebuild.sh, line 1545: Called dyn_compile
ebuild.sh, line 940: Called src_compile
ebuild.sh, line 1254: Called x-modular_src_compile
x-modular.eclass, line 329: Called x-modular_src_make
x-modular.eclass, line 324: Called die
!!! emake failed
!!! If you need support, post the topmost build error, and the call stack if relevant.
localhost ~ #