localhost ~ # emerge xorg-x11
Calculating dependencies... done!
>>> Emerging (1 of 58) x11-apps/setxkbmap-1.0.2 to /
>>> checking ebuild checksums ;-)
>>> checking auxfile checksums ;-)
>>> checking miscfile checksums ;-)
>>> checking setxkbmap-1.0.2.tar.bz2 ;-)
>>> Unpacking source...
>>> Unpacking setxkbmap-1.0.2.tar.bz2 to /var/tmp/portage/setxkbmap-1.0.2/work
>>> Source unpacked.
>>> Compiling source in /var/tmp/portage/setxkbmap-1.0.2/work/setxkbmap-1.0.2 ...
* econf: updating setxkbmap-1.0.2/config.guess with /usr/share/gnuconfig/config.guess
* econf: updating setxkbmap-1.0.2/config.sub with /usr/share/gnuconfig/config.sub
./configure --prefix=/usr --host=x86_64-pc-linux-gnu --mandir=/usr/share/man --infodir=/usr/share/info --datadir=/usr/share --sysconfdir=/etc --localstatedir=/var/lib --prefix=/usr --datadir=/usr/share --libdir=/usr/lib64 --build=x86_64-pc-linux-gnu
checking for a BSD-compatible install... /bin/install -c
checking whether build environment is sane... yes
checking for gawk... gawk
checking whether make sets $(MAKE)... yes
checking whether to enable maintainer-specific portions of Makefiles... no
checking for x86_64-pc-linux-gnu-gcc... x86_64-pc-linux-gnu-gcc
checking for C compiler default output file name... a.out
checking whether the C compiler works... yes
checking whether we are cross compiling... no
checking for suffix of executables...
checking for suffix of object files... o
checking whether we are using the GNU C compiler... yes
checking whether x86_64-pc-linux-gnu-gcc accepts -g... yes
checking for x86_64-pc-linux-gnu-gcc option to accept ANSI C... none needed
checking for style of include used by make... GNU
checking dependency style of x86_64-pc-linux-gnu-gcc... gcc3
checking for a BSD-compatible install... /bin/install -c
checking for x86_64-pc-linux-gnu-pkg-config... no
checking for pkg-config... /usr/bin/pkg-config
checking pkg-config is at least version 0.9.0... yes
checking for SETXKBMAP... yes
checking build system type... x86_64-pc-linux-gnu
checking host system type... x86_64-pc-linux-gnu
configure: creating ./config.status
config.status: creating Makefile
config.status: creating config.h
config.status: executing depfiles commands
make all-am
make[1]: Entering directory `/var/tmp/portage/setxkbmap-1.0.2/work/setxkbmap-1.0.2'
if x86_64-pc-linux-gnu-gcc -DHAVE_CONFIG_H -I. -I. -I. -D__XKBDEFRULES__='"xorg"' -DDFLT_XKB_CONFIG_ROOT=\"/usr/share/X11/xkb\" -march=k8 -O2 -pipe -m3dnow -mmmx -msse -msse2 -msse3 -MT setxkbmap-setxkbmap.o -MD -MP -MF ".deps/setxkbmap-setxkbmap.Tpo" -c -o setxkbmap-setxkbmap.o `test -f 'setxkbmap.c' || echo './'`setxkbmap.c; \
then mv -f ".deps/setxkbmap-setxkbmap.Tpo" ".deps/setxkbmap-setxkbmap.Po"; else rm -f ".deps/setxkbmap-setxkbmap.Tpo"; exit 1; fi
sed -e 's|__vendorversion__|"setxkbmap 1.0.2" "X Version 11"|' -e 's|__xorgversion__|"setxkbmap 1.0.2" "X Version 11"|' -e 's|__xservername__|Xorg|g' -e 's|__xconfigfile__|xorg.conf|g' -e 's|__projectroot__|/usr|g' -e 's|__apploaddir__||' -e 's|__appmansuffix__|1x|g' -e 's|__libmansuffix__|3x|g' -e 's|__adminmansuffix__|8|g' -e 's|__miscmansuffix__|7|g' -e 's|__filemansuffix__|5x|g' < setxkbmap.man > setxkbmap.1x
setxkbmap.c:34:22: X11/Xlib.h: No such file or directory
setxkbmap.c:35:21: X11/Xos.h: No such file or directory
setxkbmap.c:36:24: X11/XKBlib.h: No such file or directory
setxkbmap.c:37:36: X11/extensions/XKBfile.h: No such file or directory
setxkbmap.c:38:38: X11/extensions/XKBconfig.h: No such file or directory
setxkbmap.c:39:37: X11/extensions/XKBrules.h: No such file or directory
setxkbmap.c:85: error: syntax error before "print"
setxkbmap.c:85: error: `False' undeclared here (not in a function)
setxkbmap.c:85: warning: data definition has no type or storage class
setxkbmap.c:86: error: syntax error before "synch"
setxkbmap.c:86: warning: data definition has no type or storage class
setxkbmap.c:89: error: syntax error before '*' token
setxkbmap.c:89: warning: data definition has no type or storage class
setxkbmap.c:104: error: syntax error before "cfgDflts"
setxkbmap.c:104: warning: data definition has no type or storage class
setxkbmap.c:105: error: syntax error before "cfgResult"
setxkbmap.c:105: warning: data definition has no type or storage class
setxkbmap.c:107: error: syntax error before "rules"
setxkbmap.c:107: warning: initialization makes integer from pointer without a cast
setxkbmap.c:107: warning: data definition has no type or storage class
setxkbmap.c:108: error: syntax error before "rdefs"
setxkbmap.c:108: warning: data definition has no type or storage class
setxkbmap.c:110: error: syntax error before "clearOptions"
setxkbmap.c:110: warning: data definition has no type or storage class
setxkbmap.c:119: error: syntax error before "xkb"
setxkbmap.c:119: warning: initialization makes integer from pointer without a cast
setxkbmap.c:119: warning: data definition has no type or storage class
setxkbmap.c:143: error: syntax error before "addToList"
setxkbmap.c:143: warning: data definition has no type or storage class
setxkbmap.c:145: error: syntax error before "wantRules"
setxkbmap.c:147: error: syntax error before "setOptString"
setxkbmap.c:147: warning: data definition has no type or storage class
setxkbmap.c:149: error: syntax error before "getDisplay"
setxkbmap.c:149: warning: data definition has no type or storage class
setxkbmap.c:150: error: syntax error before "getServerValues"
setxkbmap.c:150: warning: data definition has no type or storage class
setxkbmap.c:152: error: syntax error before "addStringToOptions"
setxkbmap.c:152: warning: data definition has no type or storage class
setxkbmap.c:154: error: syntax error before "applyConfig"
setxkbmap.c:154: warning: data definition has no type or storage class
setxkbmap.c:155: error: syntax error before "applyRules"
setxkbmap.c:155: warning: data definition has no type or storage class
setxkbmap.c:156: error: syntax error before "applyComponentNames"
setxkbmap.c:156: warning: data definition has no type or storage class
setxkbmap.c:162: error: syntax error before "addToList"
setxkbmap.c: In function `addToList':
setxkbmap.c:169: error: `True' undeclared (first use in this function)
setxkbmap.c:169: error: (Each undeclared identifier is reported only once
setxkbmap.c:169: error: for each function it appears in.)
setxkbmap.c: At top level:
setxkbmap.c:226: error: syntax error before "wantRules"
setxkbmap.c: In function `dumpNames':
setxkbmap.c:228: error: `wantRules' undeclared (first use in this function)
setxkbmap.c:238: error: `wantCNames' undeclared (first use in this function)
setxkbmap.c: At top level:
setxkbmap.c:281: error: syntax error before "setOptString"
setxkbmap.c: In function `setOptString':
setxkbmap.c:291: error: `True' undeclared (first use in this function)
setxkbmap.c: In function `parseArgs':
setxkbmap.c:319: error: `Bool' undeclared (first use in this function)
setxkbmap.c:319: error: syntax error before "ok"
setxkbmap.c:322: error: `ok' undeclared (first use in this function)
setxkbmap.c:322: error: `True' undeclared (first use in this function)
setxkbmap.c: At top level:
setxkbmap.c:416: error: syntax error before "getDisplay"
setxkbmap.c: In function `getDisplay':
setxkbmap.c:420: error: `XkbMajorVersion' undeclared (first use in this function)
setxkbmap.c:421: error: `XkbMinorVersion' undeclared (first use in this function)
setxkbmap.c:422: warning: assignment makes pointer from integer without a cast
setxkbmap.c:429: error: `XkbOD_BadLibraryVersion' undeclared (first use in this function)
setxkbmap.c:435: error: `XkbOD_ConnectionRefused' undeclared (first use in this function)
setxkbmap.c:438: error: `XkbOD_NonXkbServer' undeclared (first use in this function)
setxkbmap.c:441: error: `XkbOD_BadServerVersion' undeclared (first use in this function)
setxkbmap.c:454: error: `True' undeclared (first use in this function)
setxkbmap.c: At top level:
setxkbmap.c:461: error: syntax error before "getServerValues"
setxkbmap.c: In function `getServerValues':
setxkbmap.c:463: error: `XkbRF_VarDefsRec' undeclared (first use in this function)
setxkbmap.c:463: error: syntax error before "vd"
setxkbmap.c:466: error: `vd' undeclared (first use in this function)
setxkbmap.c:467: error: `_XKB_RF_NAMES_PROP_ATOM' undeclared (first use in this function)
setxkbmap.c:488: error: `True' undeclared (first use in this function)
setxkbmap.c: At top level:
setxkbmap.c:525: error: syntax error before "addStringToOptions"
setxkbmap.c: In function `addStringToOptions':
setxkbmap.c:528: error: `Bool' undeclared (first use in this function)
setxkbmap.c:528: error: syntax error before "ok"
setxkbmap.c:533: error: `ok' undeclared (first use in this function)
setxkbmap.c: At top level:
setxkbmap.c:584: error: syntax error before "applyConfig"
setxkbmap.c: In function `applyConfig':
setxkbmap.c:587: error: `Bool' undeclared (first use in this function)
setxkbmap.c:587: error: syntax error before "ok"
setxkbmap.c:591: error: `ok' undeclared (first use in this function)
setxkbmap.c:591: error: `XkbCFDflts' undeclared (first use in this function)
setxkbmap.c:597: error: request for member `rules_file' in something not a structure or union
setxkbmap.c:598: error: request for member `rules_file' in something not a structure or union
setxkbmap.c:599: error: request for member `rules_file' in something not a structure or union
setxkbmap.c:601: error: request for member `model' in something not a structure or union
setxkbmap.c:602: error: request for member `model' in something not a structure or union
setxkbmap.c:603: error: request for member `model' in something not a structure or union
setxkbmap.c:605: error: request for member `layout' in something not a structure or union
setxkbmap.c:606: error: request for member `layout' in something not a structure or union
setxkbmap.c:607: error: request for member `layout' in something not a structure or union
setxkbmap.c:609: error: request for member `variant' in something not a structure or union
setxkbmap.c:610: error: request for member `variant' in something not a structure or union
setxkbmap.c:611: error: request for member `variant' in something not a structure or union
setxkbmap.c:613: error: request for member `options' in something not a structure or union
setxkbmap.c:614: error: request for member `options' in something not a structure or union
setxkbmap.c:615: error: request for member `options' in something not a structure or union
setxkbmap.c:617: error: request for member `keymap' in something not a structure or union
setxkbmap.c:618: error: request for member `keymap' in something not a structure or union
setxkbmap.c:619: error: request for member `keymap' in something not a structure or union
setxkbmap.c:621: error: request for member `keycodes' in something not a structure or union
setxkbmap.c:622: error: request for member `keycodes' in something not a structure or union
setxkbmap.c:623: error: request for member `keycodes' in something not a structure or union
setxkbmap.c:625: error: request for member `geometry' in something not a structure or union
setxkbmap.c:626: error: request for member `geometry' in something not a structure or union
setxkbmap.c:627: error: request for member `geometry' in something not a structure or union
setxkbmap.c:629: error: request for member `symbols' in something not a structure or union
setxkbmap.c:630: error: request for member `symbols' in something not a structure or union
setxkbmap.c:631: error: request for member `symbols' in something not a structure or union
setxkbmap.c:633: error: request for member `types' in something not a structure or union
setxkbmap.c:634: error: request for member `types' in something not a structure or union
setxkbmap.c:635: error: request for member `types' in something not a structure or union
setxkbmap.c:637: error: request for member `compat' in something not a structure or union
setxkbmap.c:638: error: request for member `compat' in something not a structure or union
setxkbmap.c:639: error: request for member `compat' in something not a structure or union
setxkbmap.c:643: error: `True' undeclared (first use in this function)
setxkbmap.c: At top level:
setxkbmap.c:649: error: syntax error before "applyRules"
setxkbmap.c: In function `applyRules':
setxkbmap.c:656: error: `XkbComponentNamesRec' undeclared (first use in this function)
setxkbmap.c:656: error: syntax error before "rnames"
setxkbmap.c:661: error: request for member `model' in something not a structure or union
setxkbmap.c:662: error: request for member `layout' in something not a structure or union
setxkbmap.c:663: error: request for member `variant' in something not a structure or union
setxkbmap.c:665: error: request for member `options' in something not a structure or union
setxkbmap.c:665: error: request for member `options' in something not a structure or union
setxkbmap.c:672: error: `True' undeclared (first use in this function)
setxkbmap.c:689: error: `rnames' undeclared (first use in this function)
setxkbmap.c: At top level:
setxkbmap.c:728: error: syntax error before "checkName"
setxkbmap.c: In function `checkName':
setxkbmap.c:731: error: `Bool' undeclared (first use in this function)
setxkbmap.c:731: error: syntax error before "ret"
setxkbmap.c:734: error: `True' undeclared (first use in this function)
setxkbmap.c:742: error: `ret' undeclared (first use in this function)
setxkbmap.c: At top level:
setxkbmap.c:787: error: syntax error before "applyComponentNames"
setxkbmap.c: In function `applyComponentNames':
setxkbmap.c:804: error: `True' undeclared (first use in this function)
setxkbmap.c:807: error: `XkbComponentNamesRec' undeclared (first use in this function)
setxkbmap.c:807: error: syntax error before "cmdNames"
setxkbmap.c:808: error: `cmdNames' undeclared (first use in this function)
setxkbmap.c:814: error: `XkbUseCoreKbd' undeclared (first use in this function)
setxkbmap.c:815: error: `XkbGBN_AllComponentsMask' undeclared (first use in this function)
setxkbmap.c:816: error: `XkbGBN_GeometryMask' undeclared (first use in this function)
setxkbmap.c:822: error: request for member `model' in something not a structure or union
setxkbmap.c:822: error: request for member `layout' in something not a structure or union
make[1]: *** [setxkbmap-setxkbmap.o] Error 1
make[1]: Leaving directory `/var/tmp/portage/setxkbmap-1.0.2/work/setxkbmap-1.0.2'
make: *** [all] Error 2
!!! ERROR: x11-apps/setxkbmap-1.0.2 failed.
Call stack:
ebuild.sh, line 1545: Called dyn_compile
ebuild.sh, line 940: Called src_compile
ebuild.sh, line 1254: Called x-modular_src_compile
x-modular.eclass, line 329: Called x-modular_src_make
x-modular.eclass, line 324: Called die
!!! emake failed
!!! If you need support, post the topmost build error, and the call stack if relevant.
localhost ~ #