rendered paste bodyif /bin/sh ../../libtool --silent --mode=compile --tag=CXX g++ -DHAVE_CONFIG_H -I. -I. -I../.. -I../../amarok/src/amarokcore -I../../amarok/src/amarokcore -I../../amarok/src/analyzers -I../../amarok/src/engine -I../../amarok/src/plugin -I../../amarok/src/statusbar -I../../amarok/src/mediadevice -I../../amarok/src -I/usr/include/kde/arts -I/usr/include/taglib -I../../amarok/src/sqlite -I/include -I/usr/include/kde -I/usr/share/qt3/include -I. -DQT_THREAD_SUPPORT -D_REENTRANT -Wno-long-long -Wundef -ansi -D_XOPEN_SOURCE=500 -D_BSD_SOURCE -Wcast-align -Wconversion -Wchar-subscripts -Wall -W -Wpointer-arith -O2 -Wformat-security -Wmissing-format-attribute -Wno-non-virtual-dtor -fno-exceptions -fno-check-new -fno-common -DQT_CLEAN_NAMESPACE -DQT_NO_ASCII_CAST -DQT_NO_STL -DQT_NO_COMPAT -DQT_NO_TRANSLATION -MT moodbar.lo -MD -MP -MF ".deps/moodbar.Tpo" \
-c -o moodbar.lo `test -f 'moodbar.cpp' || echo './'`moodbar.cpp; \
then mv -f ".deps/moodbar.Tpo" ".deps/moodbar.Plo"; \
else rm -f ".deps/moodbar.Tpo"; exit 1; \
fi
moodbar.cpp:50:27: geddei/geddei.h: No such file or directory
moodbar.cpp:51: error: namespace `Geddei' undeclared
moodbar.cpp:53:32: geddei/signaltypes.h: No such file or directory
moodbar.cpp:54: error: namespace `SignalTypes' undeclared
moodbar.cpp: In member function `virtual bool amaroK::CreateMood::doJob()':
moodbar.cpp:85: error: `ProcessorGroup' undeclared (first use this function)
moodbar.cpp:85: error: (Each undeclared identifier is reported only once for
each function it appears in.)
moodbar.cpp:85: error: syntax error before `;' token
moodbar.cpp:86: error: `Processor' undeclared (first use this function)
moodbar.cpp:86: error: `proc' undeclared (first use this function)
moodbar.cpp:86: error: `ProcessorFactory' undeclared (first use this function)
moodbar.cpp:86: error: syntax error before `::' token
moodbar.cpp:89: error: `g' undeclared (first use this function)
moodbar.cpp:92: error: `Properties' undeclared (first use this function)
moodbar.cpp:94: error: `SubProcessorFactory' undeclared (first use this
function)
moodbar.cpp:94: error: syntax error before `::' token
moodbar.cpp:98: error: `MultiProcessor' undeclared (first use this function)
moodbar.cpp:98: error: `W' undeclared (first use this function)
moodbar.cpp:98: error: syntax error before `(' token
moodbar.cpp:99: error: `N' undeclared (first use this function)
moodbar.cpp:99: error: syntax error before `(' token
moodbar.cpp:100: error: syntax error before `::' token
make[4]: *** [moodbar.lo] Error 1
make[4]: se sale del directorio `/mnt/Home/jon/src/amarok-1.4.0/amarok/src'
make[3]: *** [all-recursive] Error 1
make[3]: se sale del directorio `/mnt/Home/jon/src/amarok-1.4.0/amarok/src'
make[2]: *** [all-recursive] Error 1
make[2]: se sale del directorio `/mnt/Home/jon/src/amarok-1.4.0/amarok'
make[1]: *** [all-recursive] Error 1
make[1]: se sale del directorio `/mnt/Home/jon/src/amarok-1.4.0'