host:/home/rtorrent/rtorrent# make
cd . && /bin/sh /home/rtorrent/rtorrent/missing --run autoheader
rm -f stamp-h1
touch config.h.in
cd . && /bin/sh ./config.status config.h
config.status: creating config.h
config.status: config.h is unchanged
make all-recursive
make[1]: Entering directory `/home/rtorrent/rtorrent'
Making all in doc
make[2]: Entering directory `/home/rtorrent/rtorrent/doc'
make[2]: Nothing to be done for `all'.
make[2]: Leaving directory `/home/rtorrent/rtorrent/doc'
Making all in src
make[2]: Entering directory `/home/rtorrent/rtorrent/src'
Making all in core
make[3]: Entering directory `/home/rtorrent/rtorrent/src/core'
g++ -DHAVE_CONFIG_H -I. -I../.. -I. -I./.. -I../.. -O2 -Wall -g -DDEBUG -I/usr/local/include -I/usr/include/sigc++-2.0 -I/usr/lib/sigc++-2.0/include -I/usr/local/include -MT curl_get.o -MD -MP -MF .deps/curl_get.Tpo -c -o curl_get.o curl_get.cc
mv -f .deps/curl_get.Tpo .deps/curl_get.Po
g++ -DHAVE_CONFIG_H -I. -I../.. -I. -I./.. -I../.. -O2 -Wall -g -DDEBUG -I/usr/local/include -I/usr/include/sigc++-2.0 -I/usr/lib/sigc++-2.0/include -I/usr/local/include -MT curl_stack.o -MD -MP -MF .deps/curl_stack.Tpo -c -o curl_stack.o curl_stack.cc
mv -f .deps/curl_stack.Tpo .deps/curl_stack.Po
g++ -DHAVE_CONFIG_H -I. -I../.. -I. -I./.. -I../.. -O2 -Wall -g -DDEBUG -I/usr/local/include -I/usr/include/sigc++-2.0 -I/usr/lib/sigc++-2.0/include -I/usr/local/include -MT dht_manager.o -MD -MP -MF .deps/dht_manager.Tpo -c -o dht_manager.o dht_manager.cc
dht_manager.cc:42:33: error: torrent/dht_manager.h: No such file or directory
./../rpc/parse_commands.h:110: error: âclass torrent::Object::list_const_iteratorâ has not been declared
./../rpc/parse_commands.h:110: error: âclass torrent::Object::list_const_iteratorâ has not been declared
./../rpc/parse_commands.h: In function âtorrent::Object rpc::call_command_d_range(const char*, core::Download*, int, int)â:
./../rpc/parse_commands.h:116: error: invalid type argument of âunary *â
download.h: In member function âtorrent::TrackerList* core::Download::tracker_list()â:
download.h:91: error: cannot convert âtorrent::TrackerListâ to âtorrent::TrackerList*â in return
download.h: In member function âuint32_t core::Download::tracker_list_size() constâ:
download.h:92: error: base operand of â->â has non-pointer type âtorrent::TrackerListâ
dht_manager.cc: In member function âvoid core::DhtManager::load_dht_cache()â:
dht_manager.cc:81: error: âdht_managerâ is not a member of âtorrentâ
dht_manager.cc: In member function âvoid core::DhtManager::start_dht()â:
dht_manager.cc:95: error: âdht_managerâ is not a member of âtorrentâ
dht_manager.cc:95: error: âdht_managerâ is not a member of âtorrentâ
dht_manager.cc:107: error: âdht_managerâ is not a member of âtorrentâ
dht_manager.cc:108: error: âdht_managerâ is not a member of âtorrentâ
dht_manager.cc: In member function âvoid core::DhtManager::stop_dht()â:
dht_manager.cc:131: error: âdht_managerâ is not a member of âtorrentâ
dht_manager.cc:134: error: âdht_managerâ is not a member of âtorrentâ
dht_manager.cc: In member function âvoid core::DhtManager::save_dht_cache()â:
dht_manager.cc:140: error: âdht_managerâ is not a member of âtorrentâ
dht_manager.cc:151: error: âdht_managerâ is not a member of âtorrentâ
dht_manager.cc: In member function âvoid core::DhtManager::update()â:
dht_manager.cc:182: error: âdht_managerâ is not a member of âtorrentâ
dht_manager.cc: In member function âbool core::DhtManager::log_statistics(bool)â:
dht_manager.cc:207: error: âtorrent::DhtManagerâ has not been declared
dht_manager.cc:207: error: expected `;' before âstatsâ
dht_manager.cc:211: error: âstatsâ was not declared in this scope
dht_manager.cc:214: error: âdht_managerâ is not a member of âtorrentâ
dht_manager.cc:217: error: âdht_managerâ is not a member of âtorrentâ
dht_manager.cc:220: error: âstatsâ was not declared in this scope
dht_manager.cc:231: error: âstatsâ was not declared in this scope
dht_manager.cc:232: error: âdht_managerâ is not a member of âtorrentâ
dht_manager.cc:235: error: âstatsâ was not declared in this scope
dht_manager.cc:243: error: âstatsâ was not declared in this scope
dht_manager.cc:251: error: âstatsâ was not declared in this scope
dht_manager.cc: In member function âtorrent::Object core::DhtManager::dht_statistics()â:
dht_manager.cc:285: error: âdht_managerâ is not a member of âtorrentâ
dht_manager.cc:287: error: âdht_managerâ is not a member of âtorrentâ
dht_manager.cc:288: error: âtorrent::DhtManagerâ has not been declared
dht_manager.cc:288: error: expected `;' before âstatsâ
dht_manager.cc:290: error: âstatsâ was not declared in this scope
make[3]: *** [dht_manager.o] Error 1
make[3]: Leaving directory `/home/rtorrent/rtorrent/src/core'
make[2]: *** [all-recursive] Error 1
make[2]: Leaving directory `/home/rtorrent/rtorrent/src'
make[1]: *** [all-recursive] Error 1
make[1]: Leaving directory `/home/rtorrent/rtorrent'
make: *** [all] Error 2
host:/home/rtorrent/rtorrent#