Using mirdef_amd64.h ...
gcc -c -static -fPIC SHA-256.c
SHA-256.c: In function ‘SHA256_memory’:
SHA-256.c:164: warning: incompatible implicit declaration of built-in function ‘memset’
gcc -c -static -fPIC base64.c
base64.c: In function ‘b64toh’:
base64.c:28: warning: incompatible implicit declaration of built-in function ‘strlen’
base64.c: In function ‘htob64’:
base64.c:91: warning: incompatible implicit declaration of built-in function ‘strlen’
gcc -c -static -fPIC blowfish.c
blowfish.c: In function ‘encrypt_string’:
blowfish.c:146: warning: incompatible implicit declaration of built-in function ‘malloc’
blowfish.c:147: warning: incompatible implicit declaration of built-in function ‘strncpy’
blowfish.c:148: warning: incompatible implicit declaration of built-in function ‘memset’
blowfish.c:149: warning: incompatible implicit declaration of built-in function ‘strlen’
blowfish.c: In function ‘decrypt_string’:
blowfish.c:186: warning: incompatible implicit declaration of built-in function ‘malloc’
blowfish.c:187: warning: incompatible implicit declaration of built-in function ‘strncpy’
blowfish.c:188: warning: incompatible implicit declaration of built-in function ‘memset’
blowfish.c:189: warning: incompatible implicit declaration of built-in function ‘strlen’
blowfish.c: In function ‘encrypt_key’:
blowfish.c:212: warning: incompatible implicit declaration of built-in function ‘strcpy’
blowfish.c:214: warning: incompatible implicit declaration of built-in function ‘strlen’
gcc -c -static -fPIC cfgopts.c
gcc -static -c -fPIC DH1080.c
DH1080.c: In function ‘DH1080_gen’:
DH1080.c:63: warning: incompatible implicit declaration of built-in function ‘memset’
DH1080.c:77: warning: incompatible implicit declaration of built-in function ‘memset’
DH1080.c: In function ‘DH1080_comp’:
DH1080.c:120: warning: incompatible implicit declaration of built-in function ‘strspn’
DH1080.c:120: warning: incompatible implicit declaration of built-in function ‘strlen’
DH1080.c:122: warning: incompatible implicit declaration of built-in function ‘memset’
DH1080.c:139: warning: incompatible implicit declaration of built-in function ‘memset’
gcc -fPIC -shared DH1080.o miracl.a SHA-256.o base64.o -o DH1080.so
gcc -I. -I/usr/lib/glib -I/usr/lib/glib/include -I/usr/lib/glib/glib -I/home/captainorange/irssi-0.8.12 -I/home/captainorange/irssi-0.8.12/src -I/home/captainorange/irssi-0.8.12/src/core -I/home/captainorange/irssi-0.8.12/src/fe-common/core -static -O2 -Wall -c FiSH.c -fPIC -DPIC -o FiSH.o
In file included from module.h:1,
from FiSH.h:12,
from FiSH.c:3:
/home/captainorange/irssi-0.8.12/src/common.h:49:18: error: glib.h: No such file or directory
In file included from module.h:1,
from FiSH.h:12,
from FiSH.c:3:
/home/captainorange/irssi-0.8.12/src/common.h:72: error: expected declaration specifiers or ‘...’ before ‘GIOChannel’
/home/captainorange/irssi-0.8.12/src/common.h:74: error: expected ‘)’ before ‘*’ token
/home/captainorange/irssi-0.8.12/src/common.h:76: error: expected ‘)’ before ‘*’ token
In file included from /home/captainorange/irssi-0.8.12/src/core/servers.h:4,
from module.h:2,
from FiSH.h:12,
from FiSH.c:3:
/home/captainorange/irssi-0.8.12/src/core/modules.h:49: error: expected specifier-qualifier-list before ‘GSList’
/home/captainorange/irssi-0.8.12/src/core/modules.h:52: error: expected ‘=’, ‘,’, ‘;’, ‘asm’ or ‘__attribute__’ before ‘*’ token
In file included from /home/captainorange/irssi-0.8.12/src/core/servers.h:26,
from module.h:2,
from FiSH.h:12,
from FiSH.c:3:
/home/captainorange/irssi-0.8.12/src/core/server-connect-rec.h:31: error: expected specifier-qualifier-list before ‘GIOChannel’
In file included from /home/captainorange/irssi-0.8.12/src/core/servers.h:31,
from module.h:2,
from FiSH.h:12,
from FiSH.c:3:
/home/captainorange/irssi-0.8.12/src/core/server-rec.h:25: error: expected specifier-qualifier-list before ‘GIOChannel’
In file included from module.h:2,
from FiSH.h:12,
from FiSH.c:3:
/home/captainorange/irssi-0.8.12/src/core/servers.h:37: error: expected ‘=’, ‘,’, ‘;’, ‘asm’ or ‘__attribute__’ before ‘*’ token
/home/captainorange/irssi-0.8.12/src/core/servers.h:76: error: expected declaration specifiers or ‘...’ before ‘GHashTable’
In file included from module.h:3,
from FiSH.h:12,
from FiSH.c:3:
/home/captainorange/irssi-0.8.12/src/core/settings.h:99: error: expected ‘=’, ‘,’, ‘;’, ‘asm’ or ‘__attribute__’ before ‘*’ token
In file included from /home/captainorange/irssi-0.8.12/src/core/window-item-def.h:6,
from /home/captainorange/irssi-0.8.12/src/fe-common/core/fe-windows.h:4,
from /home/captainorange/irssi-0.8.12/src/fe-common/core/printtext.h:4,
from module.h:4,
from FiSH.h:12,
from FiSH.c:3:
/home/captainorange/irssi-0.8.12/src/core/window-item-rec.h:5: error: expected specifier-qualifier-list before ‘GHashTable’
In file included from /home/captainorange/irssi-0.8.12/src/fe-common/core/fe-windows.h:5,
from /home/captainorange/irssi-0.8.12/src/fe-common/core/printtext.h:4,
from module.h:4,
from FiSH.h:12,
from FiSH.c:3:
/home/captainorange/irssi-0.8.12/src/fe-common/core/command-history.h:9: error: expected specifier-qualifier-list before ‘GList’
In file included from /home/captainorange/irssi-0.8.12/src/fe-common/core/printtext.h:4,
from module.h:4,
from FiSH.h:12,
from FiSH.c:3:
/home/captainorange/irssi-0.8.12/src/fe-common/core/fe-windows.h:26: error: expected specifier-qualifier-list before ‘GSList’
/home/captainorange/irssi-0.8.12/src/fe-common/core/fe-windows.h:55: error: expected ‘=’, ‘,’, ‘;’, ‘asm’ or ‘__attribute__’ before ‘*’ token
/home/captainorange/irssi-0.8.12/src/fe-common/core/fe-windows.h:86: error: expected ‘=’, ‘,’, ‘;’, ‘asm’ or ‘__attribute__’ before ‘*’ token
In file included from /home/captainorange/irssi-0.8.12/src/fe-common/core/formats.h:4,
from /home/captainorange/irssi-0.8.12/src/fe-common/core/printtext.h:5,
from module.h:4,
from FiSH.h:12,
from FiSH.c:3:
/home/captainorange/irssi-0.8.12/src/fe-common/core/themes.h:26: error: expected specifier-qualifier-list before ‘GHashTable’
/home/captainorange/irssi-0.8.12/src/fe-common/core/themes.h:37: error: expected ‘=’, ‘,’, ‘;’, ‘asm’ or ‘__attribute__’ before ‘*’ token
/home/captainorange/irssi-0.8.12/src/fe-common/core/themes.h:39: error: expected ‘=’, ‘,’, ‘;’, ‘asm’ or ‘__attribute__’ before ‘*’ token
In file included from /home/captainorange/irssi-0.8.12/src/fe-common/core/printtext.h:5,
from module.h:4,
from FiSH.h:12,
from FiSH.c:3:
/home/captainorange/irssi-0.8.12/src/fe-common/core/formats.h:136: error: expected ‘)’ before ‘*’ token
In file included from module.h:7,
from FiSH.h:12,
from FiSH.c:3:
/home/captainorange/irssi-0.8.12/src/core/commands.h:15: error: expected specifier-qualifier-list before ‘GSList’
/home/captainorange/irssi-0.8.12/src/core/commands.h:19: error: expected specifier-qualifier-list before ‘GSList’
/home/captainorange/irssi-0.8.12/src/core/commands.h:65: error: expected ‘=’, ‘,’, ‘;’, ‘asm’ or ‘__attribute__’ before ‘*’ token
/home/captainorange/irssi-0.8.12/src/core/commands.h:162: error: expected declaration specifiers or ‘...’ before ‘gpointer’
In file included from /home/captainorange/irssi-0.8.12/src/core/query-rec.h:3,
from /home/captainorange/irssi-0.8.12/src/core/queries.h:16,
from module.h:8,
from FiSH.h:12,
from FiSH.c:3:
/home/captainorange/irssi-0.8.12/src/core/window-item-rec.h:5: error: expected specifier-qualifier-list before ‘GHashTable’
In file included from module.h:8,
from FiSH.h:12,
from FiSH.c:3:
/home/captainorange/irssi-0.8.12/src/core/queries.h:19: error: expected ‘=’, ‘,’, ‘;’, ‘asm’ or ‘__attribute__’ before ‘*’ token
In file included from /home/captainorange/irssi-0.8.12/src/core/channel-rec.h:3,
from /home/captainorange/irssi-0.8.12/src/core/channels.h:16,
from module.h:9,
from FiSH.h:12,
from FiSH.c:3:
/home/captainorange/irssi-0.8.12/src/core/window-item-rec.h:5: error: expected specifier-qualifier-list before ‘GHashTable’
In file included from module.h:9,
from FiSH.h:12,
from FiSH.c:3:
/home/captainorange/irssi-0.8.12/src/core/channels.h:19: error: expected ‘=’, ‘,’, ‘;’, ‘asm’ or ‘__attribute__’ before ‘*’ token
In file included from FiSH.h:12,
from FiSH.c:3:
module.h: In function ‘irc_send_cmdv’:
module.h:25: error: expected declaration specifiers before ‘G_GNUC_PRINTF’
In file included from FiSH.c:3:
FiSH.h:26: error: storage class specified for parameter ‘DH1080_received’
FiSH.h:28: error: parameter ‘default_iniKey’ is initialized
FiSH.h:29: error: parameter ‘blow_ini’ is initialized
FiSH.h:32: error: parameter ‘unsetiniFlag’ is initialized
FiSH.h:32: error: parameter ‘keyx_query_created’ is initialized
FiSH.c:9: error: expected ‘=’, ‘,’, ‘;’, ‘asm’ or ‘__attribute__’ before ‘{’ token
FiSH.c:45: error: expected ‘=’, ‘,’, ‘;’, ‘asm’ or ‘__attribute__’ before ‘{’ token
FiSH.c:131: error: expected ‘=’, ‘,’, ‘;’, ‘asm’ or ‘__attribute__’ before ‘{’ token
FiSH.c:163: error: expected ‘=’, ‘,’, ‘;’, ‘asm’ or ‘__attribute__’ before ‘{’ token
FiSH.c:223: error: expected ‘=’, ‘,’, ‘;’, ‘asm’ or ‘__attribute__’ before ‘{’ token
FiSH.c:252: error: expected ‘=’, ‘,’, ‘;’, ‘asm’ or ‘__attribute__’ before ‘{’ token
FiSH.c:263: error: expected ‘=’, ‘,’, ‘;’, ‘asm’ or ‘__attribute__’ before ‘{’ token
FiSH.c:274: error: expected ‘=’, ‘,’, ‘;’, ‘asm’ or ‘__attribute__’ before ‘{’ token
FiSH.c:281: error: expected ‘=’, ‘,’, ‘;’, ‘asm’ or ‘__attribute__’ before ‘{’ token
FiSH.c:316: error: expected ‘=’, ‘,’, ‘;’, ‘asm’ or ‘__attribute__’ before ‘{’ token
FiSH.c:358: error: expected ‘=’, ‘,’, ‘;’, ‘asm’ or ‘__attribute__’ before ‘{’ token
FiSH.c:399: error: expected ‘=’, ‘,’, ‘;’, ‘asm’ or ‘__attribute__’ before ‘{’ token
FiSH.c:415: error: expected ‘=’, ‘,’, ‘;’, ‘asm’ or ‘__attribute__’ before ‘{’ token
FiSH.c:523: error: expected ‘=’, ‘,’, ‘;’, ‘asm’ or ‘__attribute__’ before ‘{’ token
FiSH.c:540: error: expected ‘=’, ‘,’, ‘;’, ‘asm’ or ‘__attribute__’ before ‘{’ token
FiSH.c:600: error: expected ‘=’, ‘,’, ‘;’, ‘asm’ or ‘__attribute__’ before ‘{’ token
FiSH.c:627: error: expected ‘=’, ‘,’, ‘;’, ‘asm’ or ‘__attribute__’ before ‘{’ token
FiSH.c:670: error: expected ‘=’, ‘,’, ‘;’, ‘asm’ or ‘__attribute__’ before ‘{’ token
FiSH.c:698: error: expected ‘=’, ‘,’, ‘;’, ‘asm’ or ‘__attribute__’ before ‘{’ token
FiSH.c:750: error: expected ‘=’, ‘,’, ‘;’, ‘asm’ or ‘__attribute__’ before ‘{’ token
FiSH.c:772: error: expected ‘=’, ‘,’, ‘;’, ‘asm’ or ‘__attribute__’ before ‘{’ token
FiSH.c:801: error: expected ‘=’, ‘,’, ‘;’, ‘asm’ or ‘__attribute__’ before ‘{’ token
FiSH.c:805: error: expected ‘=’, ‘,’, ‘;’, ‘asm’ or ‘__attribute__’ before ‘{’ token
FiSH.c:817: error: expected ‘=’, ‘,’, ‘;’, ‘asm’ or ‘__attribute__’ before ‘{’ token
FiSH.c:832: error: expected ‘=’, ‘,’, ‘;’, ‘asm’ or ‘__attribute__’ before ‘{’ token
FiSH.c:913: error: expected ‘=’, ‘,’, ‘;’, ‘asm’ or ‘__attribute__’ before ‘{’ token
FiSH.c:952: error: expected ‘=’, ‘,’, ‘;’, ‘asm’ or ‘__attribute__’ before ‘{’ token
FiSH.c:971: error: expected ‘=’, ‘,’, ‘;’, ‘asm’ or ‘__attribute__’ before ‘{’ token
FiSH.c:981: error: expected ‘=’, ‘,’, ‘;’, ‘asm’ or ‘__attribute__’ before ‘{’ token
FiSH.c:987: error: expected ‘=’, ‘,’, ‘;’, ‘asm’ or ‘__attribute__’ before ‘{’ token
FiSH.c:997: error: old-style parameter declarations in prototyped function definition
FiSH.c:997: error: expected ‘{’ at end of input
make: *** [amd64] Error 1