[32;01m*[0m Determining the location of the kernel source code
[32;01m*[0m Found kernel source directory:
[32;01m*[0m /usr/src/linux
[32;01m*[0m Found kernel object directory:
[32;01m*[0m /lib/modules/2.6.22-gentoo-r9/build
[32;01m*[0m Found sources for kernel version:
[32;01m*[0m 2.6.22-gentoo-r9
[32;01m*[0m Checking for suitable kernel configuration options...
[A[72C [34;01m[ [32;01mok[34;01m ][0m
>>> Unpacking source...
>>> Unpacking rt61-1.1.0-b2.tar.gz to /var/tmp/portage/net-wireless/rt61-1.1.0_beta2/work
>>> Source unpacked.
>>> Compiling source in /var/tmp/portage/net-wireless/rt61-1.1.0_beta2/work/rt61-1.1.0-b2 ...
[32;01m*[0m Preparing rt61 module
make[1]: Entering directory `/usr/src/linux-2.6.22-gentoo-r9'
CC [M] /var/tmp/portage/net-wireless/rt61-1.1.0_beta2/work/rt61-1.1.0-b2/Module/rtmp_main.o
CC [M] /var/tmp/portage/net-wireless/rt61-1.1.0_beta2/work/rt61-1.1.0-b2/Module/mlme.o
/var/tmp/portage/net-wireless/rt61-1.1.0_beta2/work/rt61-1.1.0-b2/Module/rtmp_main.c: In function 'RT61_open':
/var/tmp/portage/net-wireless/rt61-1.1.0_beta2/work/rt61-1.1.0-b2/Module/rtmp_main.c:405: warning: 'deprecated_irq_flag' is deprecated (declared at include/linux/interrupt.h:66)
/var/tmp/portage/net-wireless/rt61-1.1.0_beta2/work/rt61-1.1.0-b2/Module/rtmp_main.c: In function 'rt61_resume':
/var/tmp/portage/net-wireless/rt61-1.1.0_beta2/work/rt61-1.1.0-b2/Module/rtmp_main.c:1000: warning: ignoring return value of 'pci_enable_device', declared with attribute warn_unused_result
/var/tmp/portage/net-wireless/rt61-1.1.0_beta2/work/rt61-1.1.0-b2/Module/rtmp_main.c: In function 'rt61_init_module':
/var/tmp/portage/net-wireless/rt61-1.1.0_beta2/work/rt61-1.1.0-b2/Module/rtmp_main.c:1044: warning: implicit declaration of function 'pci_module_init'
/var/tmp/portage/net-wireless/rt61-1.1.0_beta2/work/rt61-1.1.0-b2/Module/mlme.c: In function 'MlmeEnqueueForRecv':
/var/tmp/portage/net-wireless/rt61-1.1.0_beta2/work/rt61-1.1.0-b2/Module/mlme.c:3297: warning: format '%ld' expects type 'long int', but argument 2 has type 'size_t'
CC [M] /var/tmp/portage/net-wireless/rt61-1.1.0_beta2/work/rt61-1.1.0-b2/Module/connect.o
CC [M] /var/tmp/portage/net-wireless/rt61-1.1.0_beta2/work/rt61-1.1.0-b2/Module/sync.o
CC [M] /var/tmp/portage/net-wireless/rt61-1.1.0_beta2/work/rt61-1.1.0-b2/Module/assoc.o
CC [M] /var/tmp/portage/net-wireless/rt61-1.1.0_beta2/work/rt61-1.1.0-b2/Module/auth.o
CC [M] /var/tmp/portage/net-wireless/rt61-1.1.0_beta2/work/rt61-1.1.0-b2/Module/auth_rsp.o
CC [M] /var/tmp/portage/net-wireless/rt61-1.1.0_beta2/work/rt61-1.1.0-b2/Module/rtmp_data.o
CC [M] /var/tmp/portage/net-wireless/rt61-1.1.0_beta2/work/rt61-1.1.0-b2/Module/rtmp_init.o
/var/tmp/portage/net-wireless/rt61-1.1.0_beta2/work/rt61-1.1.0-b2/Module/rtmp_data.c: In function 'RTMPHandleRxDoneInterrupt':
/var/tmp/portage/net-wireless/rt61-1.1.0_beta2/work/rt61-1.1.0-b2/Module/rtmp_data.c:477: error: 'struct sk_buff' has no member named 'mac'
/var/tmp/portage/net-wireless/rt61-1.1.0_beta2/work/rt61-1.1.0-b2/Module/rtmp_init.c: In function 'RTMPReadParametersFromFile':
/var/tmp/portage/net-wireless/rt61-1.1.0_beta2/work/rt61-1.1.0-b2/Module/rtmp_init.c:2486: warning: format '%02x' expects type 'unsigned int *', but argument 3 has type 'u8 *'
/var/tmp/portage/net-wireless/rt61-1.1.0_beta2/work/rt61-1.1.0-b2/Module/rtmp_init.c:2486: warning: format '%02x' expects type 'unsigned int *', but argument 4 has type 'u8 *'
/var/tmp/portage/net-wireless/rt61-1.1.0_beta2/work/rt61-1.1.0-b2/Module/rtmp_init.c:2486: warning: format '%02x' expects type 'unsigned int *', but argument 5 has type 'u8 *'
/var/tmp/portage/net-wireless/rt61-1.1.0_beta2/work/rt61-1.1.0-b2/Module/rtmp_init.c:2486: warning: format '%02x' expects type 'unsigned int *', but argument 6 has type 'u8 *'
/var/tmp/portage/net-wireless/rt61-1.1.0_beta2/work/rt61-1.1.0-b2/Module/rtmp_init.c:2486: warning: format '%02x' expects type 'unsigned int *', but argument 7 has type 'u8 *'
/var/tmp/portage/net-wireless/rt61-1.1.0_beta2/work/rt61-1.1.0-b2/Module/rtmp_init.c:2486: warning: format '%02x' expects type 'unsigned int *', but argument 8 has type 'u8 *'
/var/tmp/portage/net-wireless/rt61-1.1.0_beta2/work/rt61-1.1.0-b2/Module/rtmp_data.c: In function 'RTMPCheckDHCPFrame':
/var/tmp/portage/net-wireless/rt61-1.1.0_beta2/work/rt61-1.1.0-b2/Module/rtmp_data.c:4318: warning: unused variable 'dest_port'
/var/tmp/portage/net-wireless/rt61-1.1.0_beta2/work/rt61-1.1.0-b2/Module/rtmp_data.c:4317: warning: unused variable 'is_udp'
/var/tmp/portage/net-wireless/rt61-1.1.0_beta2/work/rt61-1.1.0-b2/Module/rtmp_data.c:4316: warning: unused variable 'is_ipv4'
/var/tmp/portage/net-wireless/rt61-1.1.0_beta2/work/rt61-1.1.0-b2/Module/rtmp_data.c:4315: warning: unused variable 'is_ip'
make[3]: *** [/var/tmp/portage/net-wireless/rt61-1.1.0_beta2/work/rt61-1.1.0-b2/Module/rtmp_data.o] Error 1
make[3]: *** Waiting for unfinished jobs....
make[2]: *** [_module_/var/tmp/portage/net-wireless/rt61-1.1.0_beta2/work/rt61-1.1.0-b2/Module] Error 2
make[1]: *** [modules] Error 2
make[1]: Leaving directory `/usr/src/linux-2.6.22-gentoo-r9'
rt61.ko failed to build!
make: *** [module] Error 1
!!! ERROR: net-wireless/rt61-1.1.0_beta2 failed.
Call stack:
ebuild.sh, line 1614: Called dyn_compile
ebuild.sh, line 971: Called qa_call 'src_compile'
environment, line 4033: Called src_compile
rt61-1.1.0_beta2.ebuild, line 35: Called linux-mod_src_compile
linux-mod.eclass, line 518: Called die
!!! Unable to make KERNDIR=/usr/src/linux KERNOUT=/lib/modules/2.6.22-gentoo-r9/build clean module.
!!! If you need support, post the topmost build error, and the call stack if relevant.
!!! A complete build log is located at '/var/tmp/portage/net-wireless/rt61-1.1.0_beta2/temp/build.log'.