app_rxfax.c: In function âphase_e_handlerâ:
app_rxfax.c:103: error: ât30_stats_tâ has no member named ây_resolutionâ
app_rxfax.c:119: error: ât30_stats_tâ has no member named âx_resolutionâ
app_rxfax.c:119: error: ât30_stats_tâ has no member named ây_resolutionâ
app_rxfax.c:129: error: ât30_stats_tâ has no member named ây_resolutionâ
app_rxfax.c: In function âphase_d_handlerâ:
app_rxfax.c:152: error: ât30_stats_tâ has no member named âwidthâ
app_rxfax.c:152: error: ât30_stats_tâ has no member named âlengthâ
app_rxfax.c:153: error: ât30_stats_tâ has no member named âx_resolutionâ
app_rxfax.c:153: error: ât30_stats_tâ has no member named ây_resolutionâ
app_rxfax.c: In function ârxfax_execâ:
app_rxfax.c:177: error: âfax_state_tâ undeclared (first use in this function)
app_rxfax.c:177: error: (Each undeclared identifier is reported only once
app_rxfax.c:177: error: for each function it appears in.)
app_rxfax.c:177: error: expected â;â before âfaxâ
app_rxfax.c:289: error: âfaxâ undeclared (first use in this function)
app_rxfax.c:289: error: too few arguments to function âfax_initâ
app_rxfax.c:304: error: âT30_SUPPORT_T4_1D_COMPRESSIONâ undeclared (first use in this function)
app_rxfax.c:304: error: âT30_SUPPORT_T4_2D_COMPRESSIONâ undeclared (first use in this function)
app_rxfax.c:304: error: âT30_SUPPORT_T6_COMPRESSIONâ undeclared (first use in this function)
app_rxfax.c:309: warning: assignment discards qualifiers from pointer target type
app_rxfax.c:311: error: âT30_SUPPORT_V29â undeclared (first use in this function)
app_rxfax.c:311: error: âT30_SUPPORT_V27TERâ undeclared (first use in this function)
app_rxfax.c:313: error: âT30_SUPPORT_V17â undeclared (first use in this function)
app_rxfax.c:313: error: âT30_SUPPORT_V34â undeclared (first use in this function)
make[1]: *** [app_rxfax.o] Error 1
make[1]: Leaving directory `/usr/src/agx-ast-addons'
make: *** [all] Error 2