All pastes #770611 Raw Edit

Anonymous

public text v1 · immutable
·published 2007-11-12 13:20 UTC
rendered paste body
[  0%] Built target handbook
[  0%] Built target handbook
[  0%] Built target handbook
[  0%] Built target handbook
[  1%] Built target dvi
Linking CXX shared module ../../lib/strigita_ico.so
Linking CXX shared module ../../lib/gsthumbnail.so
[  1%] Built target ico
Linking CXX executable kcolorchooser
[  2%] Built target gsthumbnail
Linking CXX executable kruler
[  3%] Built target kcolorchooser
Linking CXX shared library ../lib/libkolourpaint4_lgpl.so
[  4%] Built target kruler
Linking CXX shared library ../lib/libokularcore.so
[  5%] Built target kolourpaint4_lgpl
Linking CXX executable okular
[  6%] Built target okular
[  8%] Built target spectreOkular
Linking CXX shared module ../../../../lib/kio_msits.so
[ 13%] Built target okularcore
Linking CXX executable kbackgroundsnapshot
[ 13%] Built target kio_msits
Scanning dependencies of target ksnapshot
[ 13%] Building CXX object ksnapshot/CMakeFiles/ksnapshot.dir/main.o
[ 14%] Built target kbackgroundsnapshot
Linking CXX shared library ../../lib/libgwenviewlib.so
Linking CXX executable ksnapshot
[ 16%] Built target ksnapshot
Scanning dependencies of target kolourpaint4
[ 25%] Built target gwenviewlib
Linking CXX shared module ../lib/libokularpart.so
[ 25%] Building CXX object kolourpaint/CMakeFiles/kolourpaint4.dir/mainWindow/kpMainWindow_File.o
[ 35%] Built target okularpart
[ 35%] Building CXX object okular/generators/poppler/CMakeFiles/okularGenerator_poppler.dir/generator_pdf.o
In file included from /home/kde4/kdesvn/kdegraphics/okular/generators/poppler/generator_pdf.cpp:11:
/home/kde4/kdesvn/kdegraphics/okular/generators/poppler/generator_pdf.h:16:25: error: poppler-qt4.h: No such file or directory
/home/kde4/kdesvn/kdegraphics/okular/generators/poppler/generator_pdf.h:107: error: ‘Poppler’ has not been declared
/home/kde4/kdesvn/kdegraphics/okular/generators/poppler/generator_pdf.h:107: error: expected ‘,’ or ‘...’ before ‘*’ token
/home/kde4/kdesvn/kdegraphics/okular/generators/poppler/generator_pdf.h:109: error: ‘Poppler’ has not been declared
/home/kde4/kdesvn/kdegraphics/okular/generators/poppler/generator_pdf.h:109: error: expected ‘,’ or ‘...’ before ‘*’ token
/home/kde4/kdesvn/kdegraphics/okular/generators/poppler/generator_pdf.h:111: error: ‘Poppler’ has not been declared
/home/kde4/kdesvn/kdegraphics/okular/generators/poppler/generator_pdf.h:111: error: expected ‘,’ or ‘...’ before ‘*’ token
/home/kde4/kdesvn/kdegraphics/okular/generators/poppler/generator_pdf.h:115: error: ‘Poppler’ was not declared in this scope
/home/kde4/kdesvn/kdegraphics/okular/generators/poppler/generator_pdf.h:115: error: template argument 1 is invalid
/home/kde4/kdesvn/kdegraphics/okular/generators/poppler/generator_pdf.h:118: error: ‘Poppler’ has not been declared
/home/kde4/kdesvn/kdegraphics/okular/generators/poppler/generator_pdf.h:118: error: ISO C++ forbids declaration of ‘Document’ with no type
/home/kde4/kdesvn/kdegraphics/okular/generators/poppler/generator_pdf.h:118: error: expected ‘;’ before ‘*’ token
/home/kde4/kdesvn/kdegraphics/okular/generators/poppler/generator_pdf.h:156: error: ‘Poppler’ was not declared in this scope
/home/kde4/kdesvn/kdegraphics/okular/generators/poppler/generator_pdf.h:156: error: template argument 1 is invalid
/home/kde4/kdesvn/kdegraphics/okular/generators/poppler/generator_pdf.cpp:51: error: ‘Poppler’ has not been declared
/home/kde4/kdesvn/kdegraphics/okular/generators/poppler/generator_pdf.cpp:51: error: expected `)' before ‘*’ token
/home/kde4/kdesvn/kdegraphics/okular/generators/poppler/generator_pdf.cpp:91: error: ‘Poppler’ has not been declared
/home/kde4/kdesvn/kdegraphics/okular/generators/poppler/generator_pdf.cpp:91: error: ISO C++ forbids declaration of ‘EmbeddedFile’ with no type
/home/kde4/kdesvn/kdegraphics/okular/generators/poppler/generator_pdf.cpp:91: error: expected ‘;’ before ‘*’ token
/home/kde4/kdesvn/kdegraphics/okular/generators/poppler/generator_pdf.cpp: In member function ‘virtual QString PDFEmbeddedFile::name() const’:
/home/kde4/kdesvn/kdegraphics/okular/generators/poppler/generator_pdf.cpp:57: error: ‘ef’ was not declared in this scope
/home/kde4/kdesvn/kdegraphics/okular/generators/poppler/generator_pdf.cpp: In member function ‘virtual QString PDFEmbeddedFile::description() const’:
/home/kde4/kdesvn/kdegraphics/okular/generators/poppler/generator_pdf.cpp:62: error: ‘ef’ was not declared in this scope
/home/kde4/kdesvn/kdegraphics/okular/generators/poppler/generator_pdf.cpp: In member function ‘virtual QByteArray PDFEmbeddedFile::data() const’:
/home/kde4/kdesvn/kdegraphics/okular/generators/poppler/generator_pdf.cpp:67: error: ‘ef’ was not declared in this scope
/home/kde4/kdesvn/kdegraphics/okular/generators/poppler/generator_pdf.cpp: In member function ‘virtual QDateTime PDFEmbeddedFile::modificationDate() const’:
/home/kde4/kdesvn/kdegraphics/okular/generators/poppler/generator_pdf.cpp:82: error: ‘ef’ was not declared in this scope
/home/kde4/kdesvn/kdegraphics/okular/generators/poppler/generator_pdf.cpp: In member function ‘virtual QDateTime PDFEmbeddedFile::creationDate() const’:
/home/kde4/kdesvn/kdegraphics/okular/generators/poppler/generator_pdf.cpp:87: error: ‘ef’ was not declared in this scope
/home/kde4/kdesvn/kdegraphics/okular/generators/poppler/generator_pdf.cpp: At global scope:
/home/kde4/kdesvn/kdegraphics/okular/generators/poppler/generator_pdf.cpp:124: error: expected ‘,’ or ‘...’ before ‘::’ token
/home/kde4/kdesvn/kdegraphics/okular/generators/poppler/generator_pdf.cpp:124: error: ISO C++ forbids declaration of ‘Poppler’ with no type
/home/kde4/kdesvn/kdegraphics/okular/generators/poppler/generator_pdf.cpp: In function ‘void fillViewportFromLinkDestination(Okular::DocumentViewport&, int)’:
/home/kde4/kdesvn/kdegraphics/okular/generators/poppler/generator_pdf.cpp:129: error: ‘destination’ was not declared in this scope
/home/kde4/kdesvn/kdegraphics/okular/generators/poppler/generator_pdf.cpp:146: error: ‘Poppler’ is not a class or namespace
/home/kde4/kdesvn/kdegraphics/okular/generators/poppler/generator_pdf.cpp:146: error: ‘page’ was not declared in this scope
/home/kde4/kdesvn/kdegraphics/okular/generators/poppler/generator_pdf.cpp:146: error: ‘pdfdoc’ was not declared in this scope
/home/kde4/kdesvn/kdegraphics/okular/generators/poppler/generator_pdf.cpp:148: error: type ‘<type error>’ argument given to ‘delete’, expected pointer
/home/kde4/kdesvn/kdegraphics/okular/generators/poppler/generator_pdf.cpp: At global scope:
/home/kde4/kdesvn/kdegraphics/okular/generators/poppler/generator_pdf.cpp:124: warning: unused parameter ‘Poppler’
/home/kde4/kdesvn/kdegraphics/okular/generators/poppler/generator_pdf.cpp:169: error: expected ‘,’ or ‘...’ before ‘::’ token
/home/kde4/kdesvn/kdegraphics/okular/generators/poppler/generator_pdf.cpp:169: error: ISO C++ forbids declaration of ‘Poppler’ with no type
/home/kde4/kdesvn/kdegraphics/okular/generators/poppler/generator_pdf.cpp: In function ‘Okular::Action* createLinkFromPopplerLink(int)’:
/home/kde4/kdesvn/kdegraphics/okular/generators/poppler/generator_pdf.cpp:172: error: ‘Poppler’ is not a class or namespace
/home/kde4/kdesvn/kdegraphics/okular/generators/poppler/generator_pdf.cpp:172: error: expected initializer before ‘*’ token
/home/kde4/kdesvn/kdegraphics/okular/generators/poppler/generator_pdf.cpp:173: error: ‘Poppler’ is not a class or namespace
/home/kde4/kdesvn/kdegraphics/okular/generators/poppler/generator_pdf.cpp:173: error: expected initializer before ‘*’ token
/home/kde4/kdesvn/kdegraphics/okular/generators/poppler/generator_pdf.cpp:174: error: ‘Poppler’ is not a class or namespace
/home/kde4/kdesvn/kdegraphics/okular/generators/poppler/generator_pdf.cpp:174: error: expected initializer before ‘*’ token
/home/kde4/kdesvn/kdegraphics/okular/generators/poppler/generator_pdf.cpp:175: error: ‘Poppler’ is not a class or namespace
/home/kde4/kdesvn/kdegraphics/okular/generators/poppler/generator_pdf.cpp:175: error: expected initializer before ‘*’ token
/home/kde4/kdesvn/kdegraphics/okular/generators/poppler/generator_pdf.cpp:181: error: ‘popplerLink’ was not declared in this scope
/home/kde4/kdesvn/kdegraphics/okular/generators/poppler/generator_pdf.cpp:183: error: ‘Poppler’ is not a class or namespace
/home/kde4/kdesvn/kdegraphics/okular/generators/poppler/generator_pdf.cpp:186: error: ‘Poppler’ is not a class or namespace
/home/kde4/kdesvn/kdegraphics/okular/generators/poppler/generator_pdf.cpp:187: error: ‘popplerLinkGoto’ was not declared in this scope
/home/kde4/kdesvn/kdegraphics/okular/generators/poppler/generator_pdf.cpp:187: error: ISO C++ forbids declaration of ‘type name’ with no type
/home/kde4/kdesvn/kdegraphics/okular/generators/poppler/generator_pdf.cpp:187: error: expected `>' before ‘Poppler’
/home/kde4/kdesvn/kdegraphics/okular/generators/poppler/generator_pdf.cpp:187: error: expected `(' before ‘Poppler’
/home/kde4/kdesvn/kdegraphics/okular/generators/poppler/generator_pdf.cpp:187: error: ‘Poppler’ is not a class or namespace
/home/kde4/kdesvn/kdegraphics/okular/generators/poppler/generator_pdf.cpp:187: error: expected primary-expression before ‘>’ token
/home/kde4/kdesvn/kdegraphics/okular/generators/poppler/generator_pdf.cpp:187: error: expected `)' before ‘;’ token
/home/kde4/kdesvn/kdegraphics/okular/generators/poppler/generator_pdf.cpp:188: error: ‘pdfdoc’ was not declared in this scope
/home/kde4/kdesvn/kdegraphics/okular/generators/poppler/generator_pdf.cpp:192: error: ‘Poppler’ is not a class or namespace
/home/kde4/kdesvn/kdegraphics/okular/generators/poppler/generator_pdf.cpp:193: error: ‘popplerLinkExecute’ was not declared in this scope
/home/kde4/kdesvn/kdegraphics/okular/generators/poppler/generator_pdf.cpp:193: error: ISO C++ forbids declaration of ‘type name’ with no type
/home/kde4/kdesvn/kdegraphics/okular/generators/poppler/generator_pdf.cpp:193: error: expected `>' before ‘Poppler’
/home/kde4/kdesvn/kdegraphics/okular/generators/poppler/generator_pdf.cpp:193: error: expected `(' before ‘Poppler’
/home/kde4/kdesvn/kdegraphics/okular/generators/poppler/generator_pdf.cpp:193: error: ‘Poppler’ is not a class or namespace
/home/kde4/kdesvn/kdegraphics/okular/generators/poppler/generator_pdf.cpp:193: error: expected primary-expression before ‘>’ token
/home/kde4/kdesvn/kdegraphics/okular/generators/poppler/generator_pdf.cpp:193: error: expected `)' before ‘;’ token
/home/kde4/kdesvn/kdegraphics/okular/generators/poppler/generator_pdf.cpp:197: error: ‘Poppler’ is not a class or namespace
/home/kde4/kdesvn/kdegraphics/okular/generators/poppler/generator_pdf.cpp:198: error: ‘popplerLinkBrowse’ was not declared in this scope
/home/kde4/kdesvn/kdegraphics/okular/generators/poppler/generator_pdf.cpp:198: error: ISO C++ forbids declaration of ‘type name’ with no type
/home/kde4/kdesvn/kdegraphics/okular/generators/poppler/generator_pdf.cpp:198: error: expected `>' before ‘Poppler’
/home/kde4/kdesvn/kdegraphics/okular/generators/poppler/generator_pdf.cpp:198: error: expected `(' before ‘Poppler’
/home/kde4/kdesvn/kdegraphics/okular/generators/poppler/generator_pdf.cpp:198: error: ‘Poppler’ is not a class or namespace
/home/kde4/kdesvn/kdegraphics/okular/generators/poppler/generator_pdf.cpp:198: error: expected primary-expression before ‘>’ token
/home/kde4/kdesvn/kdegraphics/okular/generators/poppler/generator_pdf.cpp:198: error: expected `)' before ‘;’ token
/home/kde4/kdesvn/kdegraphics/okular/generators/poppler/generator_pdf.cpp:202: error: ‘Poppler’ is not a class or namespace
/home/kde4/kdesvn/kdegraphics/okular/generators/poppler/generator_pdf.cpp:203: error: ‘popplerLinkAction’ was not declared in this scope
/home/kde4/kdesvn/kdegraphics/okular/generators/poppler/generator_pdf.cpp:203: error: ISO C++ forbids declaration of ‘type name’ with no type
/home/kde4/kdesvn/kdegraphics/okular/generators/poppler/generator_pdf.cpp:203: error: expected `>' before ‘Poppler’
/home/kde4/kdesvn/kdegraphics/okular/generators/poppler/generator_pdf.cpp:203: error: expected `(' before ‘Poppler’
/home/kde4/kdesvn/kdegraphics/okular/generators/poppler/generator_pdf.cpp:203: error: ‘Poppler’ is not a class or namespace
/home/kde4/kdesvn/kdegraphics/okular/generators/poppler/generator_pdf.cpp:203: error: expected primary-expression before ‘>’ token
/home/kde4/kdesvn/kdegraphics/okular/generators/poppler/generator_pdf.cpp:203: error: expected `)' before ‘;’ token
/home/kde4/kdesvn/kdegraphics/okular/generators/poppler/generator_pdf.cpp:236: error: ‘Poppler’ is not a class or namespace
/home/kde4/kdesvn/kdegraphics/okular/generators/poppler/generator_pdf.cpp: At global scope:
/home/kde4/kdesvn/kdegraphics/okular/generators/poppler/generator_pdf.cpp:169: warning: unused parameter ‘Poppler’
/home/kde4/kdesvn/kdegraphics/okular/generators/poppler/generator_pdf.cpp:244: error: ‘Poppler’ was not declared in this scope
/home/kde4/kdesvn/kdegraphics/okular/generators/poppler/generator_pdf.cpp:244: error: template argument 1 is invalid
/home/kde4/kdesvn/kdegraphics/okular/generators/poppler/generator_pdf.cpp:244: error: expected ‘,’ or ‘...’ before ‘::’ token
/home/kde4/kdesvn/kdegraphics/okular/generators/poppler/generator_pdf.cpp:244: error: ISO C++ forbids declaration of ‘Poppler’ with no type
/opt/kde4/qt4/include/QtCore/qglobal.h: In instantiation of ‘QForeachContainer<const int>’:
/home/kde4/kdesvn/kdegraphics/okular/generators/poppler/generator_pdf.cpp:251:   instantiated from here
/opt/kde4/qt4/include/QtCore/qglobal.h:1838: error: ‘const int’ is not a class, struct, or union type
/opt/kde4/qt4/include/QtCore/qglobal.h:1838: error: ‘const int’ is not a class, struct, or union type
/home/kde4/kdesvn/kdegraphics/okular/generators/poppler/generator_pdf.cpp: In function ‘QLinkedList<Okular::ObjectRect*> generateLinks(const int&, int, int, int)’:
/home/kde4/kdesvn/kdegraphics/okular/generators/poppler/generator_pdf.cpp:251: error: ‘class QForeachContainer<const int>’ has no member named ‘i’
/home/kde4/kdesvn/kdegraphics/okular/generators/poppler/generator_pdf.cpp:251: error: ‘class QForeachContainer<const int>’ has no member named ‘e’
/home/kde4/kdesvn/kdegraphics/okular/generators/poppler/generator_pdf.cpp:251: error: ‘class QForeachContainer<const int>’ has no member named ‘i’
/home/kde4/kdesvn/kdegraphics/okular/generators/poppler/generator_pdf.cpp:251: error: ‘Poppler’ is not a class or namespace
/home/kde4/kdesvn/kdegraphics/okular/generators/poppler/generator_pdf.cpp:251: error: expected initializer before ‘*’ token
/home/kde4/kdesvn/kdegraphics/okular/generators/poppler/generator_pdf.cpp:253: error: ‘popplerLink’ was not declared in this scope
/home/kde4/kdesvn/kdegraphics/okular/generators/poppler/generator_pdf.cpp:266: error: ‘pdfdoc’ was not declared in this scope
/home/kde4/kdesvn/kdegraphics/okular/generators/poppler/generator_pdf.cpp: At global scope:
/home/kde4/kdesvn/kdegraphics/okular/generators/poppler/generator_pdf.cpp:244: warning: unused parameter ‘Poppler’
/home/kde4/kdesvn/kdegraphics/okular/generators/poppler/generator_pdf.cpp: In constructor ‘PDFGenerator::PDFGenerator()’:
/home/kde4/kdesvn/kdegraphics/okular/generators/poppler/generator_pdf.cpp:292: error: class ‘PDFGenerator’ does not have any field named ‘pdfdoc’
/home/kde4/kdesvn/kdegraphics/okular/generators/poppler/generator_pdf.cpp: In member function ‘virtual bool PDFGenerator::loadDocument(const QString&, QVector<Okular::Page*>&)’:
/home/kde4/kdesvn/kdegraphics/okular/generators/poppler/generator_pdf.cpp:322: error: ‘pdfdoc’ was not declared in this scope
/home/kde4/kdesvn/kdegraphics/okular/generators/poppler/generator_pdf.cpp:329: error: ‘pdfdoc’ was not declared in this scope
/home/kde4/kdesvn/kdegraphics/okular/generators/poppler/generator_pdf.cpp:329: error: ‘Poppler’ has not been declared
/home/kde4/kdesvn/kdegraphics/okular/generators/poppler/generator_pdf.cpp: In member function ‘bool PDFGenerator::init(QVector<Okular::Page*>&, const QString&)’:
/home/kde4/kdesvn/kdegraphics/okular/generators/poppler/generator_pdf.cpp:365: error: ‘pdfdoc’ was not declared in this scope
/home/kde4/kdesvn/kdegraphics/okular/generators/poppler/generator_pdf.cpp:422: error: ‘pdfdoc’ was not declared in this scope
/home/kde4/kdesvn/kdegraphics/okular/generators/poppler/generator_pdf.cpp:424: error: type ‘<type error>’ argument given to ‘delete’, expected pointer
/home/kde4/kdesvn/kdegraphics/okular/generators/poppler/generator_pdf.cpp:430: error: ‘pdfdoc’ was not declared in this scope
/home/kde4/kdesvn/kdegraphics/okular/generators/poppler/generator_pdf.cpp: In member function ‘virtual bool PDFGenerator::doCloseDocument()’:
/home/kde4/kdesvn/kdegraphics/okular/generators/poppler/generator_pdf.cpp:449: error: ‘pdfdoc’ was not declared in this scope
/home/kde4/kdesvn/kdegraphics/okular/generators/poppler/generator_pdf.cpp: In member function ‘void PDFGenerator::loadPages(QVector<Okular::Page*>&, int, bool)’:
/home/kde4/kdesvn/kdegraphics/okular/generators/poppler/generator_pdf.cpp:469: error: ‘Poppler’ has not been declared
/home/kde4/kdesvn/kdegraphics/okular/generators/poppler/generator_pdf.cpp:469: error: ‘p’ was not declared in this scope
/home/kde4/kdesvn/kdegraphics/okular/generators/poppler/generator_pdf.cpp:469: error: ‘pdfdoc’ was not declared in this scope
/home/kde4/kdesvn/kdegraphics/okular/generators/poppler/generator_pdf.cpp:476: error: ‘Poppler’ has not been declared
/home/kde4/kdesvn/kdegraphics/okular/generators/poppler/generator_pdf.cpp:477: error: ‘Poppler’ has not been declared
/home/kde4/kdesvn/kdegraphics/okular/generators/poppler/generator_pdf.cpp:478: error: ‘Poppler’ has not been declared
/home/kde4/kdesvn/kdegraphics/okular/generators/poppler/generator_pdf.cpp:479: error: ‘Poppler’ has not been declared
/home/kde4/kdesvn/kdegraphics/okular/generators/poppler/generator_pdf.cpp:511: error: type ‘<type error>’ argument given to ‘delete’, expected pointer
/home/kde4/kdesvn/kdegraphics/okular/generators/poppler/generator_pdf.cpp: In member function ‘virtual const Okular::DocumentInfo* PDFGenerator::generateDocumentInfo()’:
/home/kde4/kdesvn/kdegraphics/okular/generators/poppler/generator_pdf.cpp:528: error: ‘pdfdoc’ was not declared in this scope
/home/kde4/kdesvn/kdegraphics/okular/generators/poppler/generator_pdf.cpp:572: error: ‘pdfdoc’ was not declared in this scope
/home/kde4/kdesvn/kdegraphics/okular/generators/poppler/generator_pdf.cpp: In member function ‘virtual const Okular::DocumentSynopsis* PDFGenerator::generateDocumentSynopsis()’:
/home/kde4/kdesvn/kdegraphics/okular/generators/poppler/generator_pdf.cpp:583: error: ‘pdfdoc’ was not declared in this scope
/home/kde4/kdesvn/kdegraphics/okular/generators/poppler/generator_pdf.cpp:587: error: ‘pdfdoc’ was not declared in this scope
/home/kde4/kdesvn/kdegraphics/okular/generators/poppler/generator_pdf.cpp: At global scope:
/home/kde4/kdesvn/kdegraphics/okular/generators/poppler/generator_pdf.cpp:599: error: ‘Poppler’ has not been declared
/home/kde4/kdesvn/kdegraphics/okular/generators/poppler/generator_pdf.cpp:600: error: expected ‘,’ or ‘;’ before ‘{’ token
/home/kde4/kdesvn/kdegraphics/okular/generators/poppler/generator_pdf.cpp:644: error: expected ‘,’ or ‘...’ before ‘::’ token
/home/kde4/kdesvn/kdegraphics/okular/generators/poppler/generator_pdf.cpp:644: error: ISO C++ forbids declaration of ‘Poppler’ with no type
/home/kde4/kdesvn/kdegraphics/okular/generators/poppler/generator_pdf.cpp: In function ‘Okular::FontInfo::EmbedType embedTypeForPopplerFontInfo(int)’:
/home/kde4/kdesvn/kdegraphics/okular/generators/poppler/generator_pdf.cpp:647: error: ‘fi’ was not declared in this scope
/home/kde4/kdesvn/kdegraphics/okular/generators/poppler/generator_pdf.cpp: At global scope:
/home/kde4/kdesvn/kdegraphics/okular/generators/poppler/generator_pdf.cpp:644: warning: unused parameter ‘Poppler’
/home/kde4/kdesvn/kdegraphics/okular/generators/poppler/generator_pdf.cpp: In member function ‘virtual QList<Okular::FontInfo> PDFGenerator::fontsForPage(int)’:
/home/kde4/kdesvn/kdegraphics/okular/generators/poppler/generator_pdf.cpp:665: error: ‘Poppler’ was not declared in this scope
/home/kde4/kdesvn/kdegraphics/okular/generators/poppler/generator_pdf.cpp:665: error: template argument 1 is invalid
/home/kde4/kdesvn/kdegraphics/okular/generators/poppler/generator_pdf.cpp:665: error: invalid type in declaration before ‘;’ token
/home/kde4/kdesvn/kdegraphics/okular/generators/poppler/generator_pdf.cpp:667: error: ‘pdfdoc’ was not declared in this scope
/opt/kde4/qt4/include/QtCore/qglobal.h: At global scope:
/opt/kde4/qt4/include/QtCore/qglobal.h: In instantiation of ‘QForeachContainer<int>’:
/home/kde4/kdesvn/kdegraphics/okular/generators/poppler/generator_pdf.cpp:670:   instantiated from here
/opt/kde4/qt4/include/QtCore/qglobal.h:1838: error: ‘int’ is not a class, struct, or union type
/opt/kde4/qt4/include/QtCore/qglobal.h:1838: error: ‘int’ is not a class, struct, or union type
/home/kde4/kdesvn/kdegraphics/okular/generators/poppler/generator_pdf.cpp: In member function ‘virtual QList<Okular::FontInfo> PDFGenerator::fontsForPage(int)’:
/home/kde4/kdesvn/kdegraphics/okular/generators/poppler/generator_pdf.cpp:670: error: ‘class QForeachContainer<int>’ has no member named ‘i’
/home/kde4/kdesvn/kdegraphics/okular/generators/poppler/generator_pdf.cpp:670: error: ‘class QForeachContainer<int>’ has no member named ‘e’
/home/kde4/kdesvn/kdegraphics/okular/generators/poppler/generator_pdf.cpp:670: error: ‘class QForeachContainer<int>’ has no member named ‘i’
/home/kde4/kdesvn/kdegraphics/okular/generators/poppler/generator_pdf.cpp:670: error: ‘Poppler’ is not a class or namespace
/home/kde4/kdesvn/kdegraphics/okular/generators/poppler/generator_pdf.cpp:670: error: expected initializer before ‘&’ token
/home/kde4/kdesvn/kdegraphics/okular/generators/poppler/generator_pdf.cpp:673: error: ‘font’ was not declared in this scope
/home/kde4/kdesvn/kdegraphics/okular/generators/poppler/generator_pdf.cpp:674: error: ‘convertPopplerFontInfoTypeToOkularFontInfoType’ cannot be used as a function
/home/kde4/kdesvn/kdegraphics/okular/generators/poppler/generator_pdf.cpp: In member function ‘virtual const QList<Okular::EmbeddedFile*>* PDFGenerator::embeddedFiles() const’:
/home/kde4/kdesvn/kdegraphics/okular/generators/poppler/generator_pdf.cpp:689: error: ‘Poppler’ was not declared in this scope
/home/kde4/kdesvn/kdegraphics/okular/generators/poppler/generator_pdf.cpp:689: error: template argument 1 is invalid
/home/kde4/kdesvn/kdegraphics/okular/generators/poppler/generator_pdf.cpp:689: error: invalid type in declaration before ‘=’ token
/home/kde4/kdesvn/kdegraphics/okular/generators/poppler/generator_pdf.cpp:689: error: ‘pdfdoc’ was not declared in this scope
/home/kde4/kdesvn/kdegraphics/okular/generators/poppler/generator_pdf.cpp:690: error: ‘class QForeachContainer<const int>’ has no member named ‘i’
/home/kde4/kdesvn/kdegraphics/okular/generators/poppler/generator_pdf.cpp:690: error: ‘class QForeachContainer<const int>’ has no member named ‘e’
/home/kde4/kdesvn/kdegraphics/okular/generators/poppler/generator_pdf.cpp:690: error: ‘class QForeachContainer<const int>’ has no member named ‘i’
/home/kde4/kdesvn/kdegraphics/okular/generators/poppler/generator_pdf.cpp:690: error: ‘Poppler’ is not a class or namespace
/home/kde4/kdesvn/kdegraphics/okular/generators/poppler/generator_pdf.cpp:690: error: ‘pef’ was not declared in this scope
/home/kde4/kdesvn/kdegraphics/okular/generators/poppler/generator_pdf.cpp:690: error: ‘class QForeachContainer<const int>’ has no member named ‘i’
/home/kde4/kdesvn/kdegraphics/okular/generators/poppler/generator_pdf.cpp: In member function ‘virtual bool PDFGenerator::isAllowed(Okular::Permission) const’:
/home/kde4/kdesvn/kdegraphics/okular/generators/poppler/generator_pdf.cpp:708: error: ‘pdfdoc’ was not declared in this scope
/home/kde4/kdesvn/kdegraphics/okular/generators/poppler/generator_pdf.cpp: In member function ‘virtual void PDFGenerator::generatePixmap(Okular::PixmapRequest*)’:
/home/kde4/kdesvn/kdegraphics/okular/generators/poppler/generator_pdf.cpp:778: error: ‘Poppler’ has not been declared
/home/kde4/kdesvn/kdegraphics/okular/generators/poppler/generator_pdf.cpp:778: error: ‘p’ was not declared in this scope
/home/kde4/kdesvn/kdegraphics/okular/generators/poppler/generator_pdf.cpp:778: error: ‘pdfdoc’ was not declared in this scope
/home/kde4/kdesvn/kdegraphics/okular/generators/poppler/generator_pdf.cpp:784: error: ‘Poppler’ has not been declared
/home/kde4/kdesvn/kdegraphics/okular/generators/poppler/generator_pdf.cpp:800: error: ‘Poppler’ was not declared in this scope
/home/kde4/kdesvn/kdegraphics/okular/generators/poppler/generator_pdf.cpp:800: error: template argument 1 is invalid
/home/kde4/kdesvn/kdegraphics/okular/generators/poppler/generator_pdf.cpp:800: error: invalid type in declaration before ‘=’ token
/home/kde4/kdesvn/kdegraphics/okular/generators/poppler/generator_pdf.cpp:800: error: ‘Poppler’ is not a class or namespace
/home/kde4/kdesvn/kdegraphics/okular/generators/poppler/generator_pdf.cpp:804: error: type ‘<type error>’ argument given to ‘delete’, expected pointer
/home/kde4/kdesvn/kdegraphics/okular/generators/poppler/generator_pdf.cpp: In member function ‘virtual Okular::TextPage* PDFGenerator::textPage(Okular::Page*)’:
/home/kde4/kdesvn/kdegraphics/okular/generators/poppler/generator_pdf.cpp:817: error: ‘Poppler’ has not been declared
/home/kde4/kdesvn/kdegraphics/okular/generators/poppler/generator_pdf.cpp:817: error: ‘pp’ was not declared in this scope
/home/kde4/kdesvn/kdegraphics/okular/generators/poppler/generator_pdf.cpp:817: error: ‘pdfdoc’ was not declared in this scope
/home/kde4/kdesvn/kdegraphics/okular/generators/poppler/generator_pdf.cpp:819: error: ‘Poppler’ was not declared in this scope
/home/kde4/kdesvn/kdegraphics/okular/generators/poppler/generator_pdf.cpp:819: error: template argument 1 is invalid
/home/kde4/kdesvn/kdegraphics/okular/generators/poppler/generator_pdf.cpp:819: error: invalid type in declaration before ‘=’ token
/home/kde4/kdesvn/kdegraphics/okular/generators/poppler/generator_pdf.cpp:819: error: ‘Poppler’ is not a class or namespace
/home/kde4/kdesvn/kdegraphics/okular/generators/poppler/generator_pdf.cpp:821: error: type ‘<type error>’ argument given to ‘delete’, expected pointer
/home/kde4/kdesvn/kdegraphics/okular/generators/poppler/generator_pdf.cpp:826: error: ‘Poppler’ is not a class or namespace
/home/kde4/kdesvn/kdegraphics/okular/generators/poppler/generator_pdf.cpp: At global scope:
/home/kde4/kdesvn/kdegraphics/okular/generators/poppler/generator_pdf.cpp:831: warning: unused parameter ‘printer’
/home/kde4/kdesvn/kdegraphics/okular/generators/poppler/generator_pdf.cpp: In member function ‘virtual QVariant PDFGenerator::metaData(const QString&, const QVariant&) const’:
/home/kde4/kdesvn/kdegraphics/okular/generators/poppler/generator_pdf.cpp:953: error: ‘pdfdoc’ was not declared in this scope
/home/kde4/kdesvn/kdegraphics/okular/generators/poppler/generator_pdf.cpp:953: error: ‘Poppler’ has not been declared
/home/kde4/kdesvn/kdegraphics/okular/generators/poppler/generator_pdf.cpp:962: error: ‘Poppler’ has not been declared
/home/kde4/kdesvn/kdegraphics/okular/generators/poppler/generator_pdf.cpp:962: error: ‘ld’ was not declared in this scope
/home/kde4/kdesvn/kdegraphics/okular/generators/poppler/generator_pdf.cpp:962: error: ‘pdfdoc’ was not declared in this scope
/home/kde4/kdesvn/kdegraphics/okular/generators/poppler/generator_pdf.cpp:968: error: type ‘<type error>’ argument given to ‘delete’, expected pointer
/home/kde4/kdesvn/kdegraphics/okular/generators/poppler/generator_pdf.cpp:975: error: ‘pdfdoc’ was not declared in this scope
/home/kde4/kdesvn/kdegraphics/okular/generators/poppler/generator_pdf.cpp:981: error: ‘pdfdoc’ was not declared in this scope
/home/kde4/kdesvn/kdegraphics/okular/generators/poppler/generator_pdf.cpp:981: error: ‘Poppler’ has not been declared
/home/kde4/kdesvn/kdegraphics/okular/generators/poppler/generator_pdf.cpp: In member function ‘virtual bool PDFGenerator::reparseConfig()’:
/home/kde4/kdesvn/kdegraphics/okular/generators/poppler/generator_pdf.cpp:994: error: ‘pdfdoc’ was not declared in this scope
/home/kde4/kdesvn/kdegraphics/okular/generators/poppler/generator_pdf.cpp: In member function ‘virtual bool PDFGenerator::exportTo(const QString&, const Okular::ExportFormat&)’:
/home/kde4/kdesvn/kdegraphics/okular/generators/poppler/generator_pdf.cpp:1030: error: ‘Poppler’ has not been declared
/home/kde4/kdesvn/kdegraphics/okular/generators/poppler/generator_pdf.cpp:1030: error: ‘pp’ was not declared in this scope
/home/kde4/kdesvn/kdegraphics/okular/generators/poppler/generator_pdf.cpp:1030: error: ‘pdfdoc’ was not declared in this scope
/home/kde4/kdesvn/kdegraphics/okular/generators/poppler/generator_pdf.cpp:1034: error: type ‘<type error>’ argument given to ‘delete’, expected pointer
/home/kde4/kdesvn/kdegraphics/okular/generators/poppler/generator_pdf.cpp: At global scope:
/home/kde4/kdesvn/kdegraphics/okular/generators/poppler/generator_pdf.cpp:1059: error: ‘Poppler’ was not declared in this scope
/home/kde4/kdesvn/kdegraphics/okular/generators/poppler/generator_pdf.cpp:1059: error: template argument 1 is invalid
/home/kde4/kdesvn/kdegraphics/okular/generators/poppler/generator_pdf.cpp: In member function ‘Okular::TextPage* PDFGenerator::abstractTextPage(const int&, double, double, int)’:
/home/kde4/kdesvn/kdegraphics/okular/generators/poppler/generator_pdf.cpp:1062: error: ‘Poppler’ has not been declared
/home/kde4/kdesvn/kdegraphics/okular/generators/poppler/generator_pdf.cpp:1062: error: ‘next’ was not declared in this scope
/home/kde4/kdesvn/kdegraphics/okular/generators/poppler/generator_pdf.cpp:1071: error: ‘class QForeachContainer<const int>’ has no member named ‘i’
/home/kde4/kdesvn/kdegraphics/okular/generators/poppler/generator_pdf.cpp:1071: error: ‘class QForeachContainer<const int>’ has no member named ‘e’
/home/kde4/kdesvn/kdegraphics/okular/generators/poppler/generator_pdf.cpp:1071: error: ‘class QForeachContainer<const int>’ has no member named ‘i’
/home/kde4/kdesvn/kdegraphics/okular/generators/poppler/generator_pdf.cpp:1071: error: ‘Poppler’ has not been declared
/home/kde4/kdesvn/kdegraphics/okular/generators/poppler/generator_pdf.cpp:1071: error: ‘word’ was not declared in this scope
/home/kde4/kdesvn/kdegraphics/okular/generators/poppler/generator_pdf.cpp:1071: error: ‘class QForeachContainer<const int>’ has no member named ‘i’
/home/kde4/kdesvn/kdegraphics/okular/generators/poppler/generator_pdf.cpp: In member function ‘void PDFGenerator::addSynopsisChildren(QDomNode*, QDomNode*)’:
/home/kde4/kdesvn/kdegraphics/okular/generators/poppler/generator_pdf.cpp:1197: error: ‘Poppler’ has not been declared
/home/kde4/kdesvn/kdegraphics/okular/generators/poppler/generator_pdf.cpp:1197: error: ‘pdfdoc’ was not declared in this scope
/home/kde4/kdesvn/kdegraphics/okular/generators/poppler/generator_pdf.cpp: At global scope:
/home/kde4/kdesvn/kdegraphics/okular/generators/poppler/generator_pdf.cpp:1208: error: variable or field ‘addAnnotations’ declared void
/home/kde4/kdesvn/kdegraphics/okular/generators/poppler/generator_pdf.cpp:1208: error: ‘int PDFGenerator::addAnnotations’ is not a static member of ‘class PDFGenerator’
/home/kde4/kdesvn/kdegraphics/okular/generators/poppler/generator_pdf.cpp:1208: error: ‘Poppler’ has not been declared
/home/kde4/kdesvn/kdegraphics/okular/generators/poppler/generator_pdf.cpp:1208: error: ‘popplerPage’ was not declared in this scope
/home/kde4/kdesvn/kdegraphics/okular/generators/poppler/generator_pdf.cpp:1208: error: expected primary-expression before ‘*’ token
/home/kde4/kdesvn/kdegraphics/okular/generators/poppler/generator_pdf.cpp:1208: error: ‘page’ was not declared in this scope
/home/kde4/kdesvn/kdegraphics/okular/generators/poppler/generator_pdf.cpp:1208: error: initializer expression list treated as compound expression
/home/kde4/kdesvn/kdegraphics/okular/generators/poppler/generator_pdf.cpp:1209: error: expected ‘,’ or ‘;’ before ‘{’ token
/home/kde4/kdesvn/kdegraphics/okular/generators/poppler/generator_pdf.cpp:1265: error: variable or field ‘addTransition’ declared void
/home/kde4/kdesvn/kdegraphics/okular/generators/poppler/generator_pdf.cpp:1265: error: ‘int PDFGenerator::addTransition’ is not a static member of ‘class PDFGenerator’
/home/kde4/kdesvn/kdegraphics/okular/generators/poppler/generator_pdf.cpp:1265: error: ‘Poppler’ has not been declared
/home/kde4/kdesvn/kdegraphics/okular/generators/poppler/generator_pdf.cpp:1265: error: ‘pdfPage’ was not declared in this scope
/home/kde4/kdesvn/kdegraphics/okular/generators/poppler/generator_pdf.cpp:1265: error: expected primary-expression before ‘*’ token
/home/kde4/kdesvn/kdegraphics/okular/generators/poppler/generator_pdf.cpp:1265: error: ‘page’ was not declared in this scope
/home/kde4/kdesvn/kdegraphics/okular/generators/poppler/generator_pdf.cpp:1265: error: initializer expression list treated as compound expression
/home/kde4/kdesvn/kdegraphics/okular/generators/poppler/generator_pdf.cpp:1267: error: expected ‘,’ or ‘;’ before ‘{’ token
/home/kde4/kdesvn/kdegraphics/okular/generators/poppler/generator_pdf.cpp:1339: error: variable or field ‘addFormFields’ declared void
/home/kde4/kdesvn/kdegraphics/okular/generators/poppler/generator_pdf.cpp:1339: error: ‘int PDFGenerator::addFormFields’ is not a static member of ‘class PDFGenerator’
/home/kde4/kdesvn/kdegraphics/okular/generators/poppler/generator_pdf.cpp:1339: error: ‘Poppler’ has not been declared
/home/kde4/kdesvn/kdegraphics/okular/generators/poppler/generator_pdf.cpp:1339: error: ‘popplerPage’ was not declared in this scope
/home/kde4/kdesvn/kdegraphics/okular/generators/poppler/generator_pdf.cpp:1339: error: expected primary-expression before ‘*’ token
/home/kde4/kdesvn/kdegraphics/okular/generators/poppler/generator_pdf.cpp:1339: error: ‘page’ was not declared in this scope
/home/kde4/kdesvn/kdegraphics/okular/generators/poppler/generator_pdf.cpp:1339: error: initializer expression list treated as compound expression
/home/kde4/kdesvn/kdegraphics/okular/generators/poppler/generator_pdf.cpp:1340: error: expected ‘,’ or ‘;’ before ‘{’ token
/home/kde4/kdesvn/kdegraphics/okular/generators/poppler/generator_pdf.cpp: In member function ‘void PDFGenerator::threadFinished()’:
/home/kde4/kdesvn/kdegraphics/okular/generators/poppler/generator_pdf.cpp:1548: error: ‘Poppler’ was not declared in this scope
/home/kde4/kdesvn/kdegraphics/okular/generators/poppler/generator_pdf.cpp:1548: error: template argument 1 is invalid
/home/kde4/kdesvn/kdegraphics/okular/generators/poppler/generator_pdf.cpp:1548: error: invalid type in declaration before ‘=’ token
/home/kde4/kdesvn/kdegraphics/okular/generators/poppler/generator_pdf.cpp:1553: error: request for member ‘isEmpty’ in ‘outText’, which is of non-class type ‘int’
/home/kde4/kdesvn/kdegraphics/okular/generators/poppler/generator_pdf.cpp: At global scope:
/home/kde4/kdesvn/kdegraphics/okular/generators/poppler/generator_pdf.cpp:1589: error: ‘Poppler’ was not declared in this scope
/home/kde4/kdesvn/kdegraphics/okular/generators/poppler/generator_pdf.cpp:1589: error: template argument 1 is invalid
/home/kde4/kdesvn/kdegraphics/okular/generators/poppler/generator_pdf.cpp:1676: error: ‘Poppler’ was not declared in this scope
/home/kde4/kdesvn/kdegraphics/okular/generators/poppler/generator_pdf.cpp:1676: error: template argument 1 is invalid
/home/kde4/kdesvn/kdegraphics/okular/generators/poppler/generator_pdf.cpp: In member function ‘int PDFPixmapGeneratorThread::takeText()’:
/home/kde4/kdesvn/kdegraphics/okular/generators/poppler/generator_pdf.cpp:1678: error: ‘Poppler’ was not declared in this scope
/home/kde4/kdesvn/kdegraphics/okular/generators/poppler/generator_pdf.cpp:1678: error: template argument 1 is invalid
/home/kde4/kdesvn/kdegraphics/okular/generators/poppler/generator_pdf.cpp:1678: error: invalid type in declaration before ‘=’ token
/home/kde4/kdesvn/kdegraphics/okular/generators/poppler/generator_pdf.cpp:1679: error: request for member ‘clear’ in ‘((PDFPixmapGeneratorThread*)this)->PDFPixmapGeneratorThread::d->PPGThreadPrivate::m_textList’, which is of non-class type ‘int’
/home/kde4/kdesvn/kdegraphics/okular/generators/poppler/generator_pdf.cpp: In member function ‘virtual void PDFPixmapGeneratorThread::run()’:
/home/kde4/kdesvn/kdegraphics/okular/generators/poppler/generator_pdf.cpp:1721: error: ‘Poppler’ has not been declared
/home/kde4/kdesvn/kdegraphics/okular/generators/poppler/generator_pdf.cpp:1721: error: ‘pp’ was not declared in this scope
/home/kde4/kdesvn/kdegraphics/okular/generators/poppler/generator_pdf.cpp:1721: error: ‘class PDFGenerator’ has no member named ‘pdfdoc’
/home/kde4/kdesvn/kdegraphics/okular/generators/poppler/generator_pdf.cpp:1727: error: request for member ‘isEmpty’ in ‘((PDFPixmapGeneratorThread*)this)->PDFPixmapGeneratorThread::d->PPGThreadPrivate::m_textList’, which is of non-class type ‘int’
/home/kde4/kdesvn/kdegraphics/okular/generators/poppler/generator_pdf.cpp:1733: error: ‘Poppler’ has not been declared
/home/kde4/kdesvn/kdegraphics/okular/generators/poppler/generator_pdf.cpp:1738: error: ‘class PDFGenerator’ has no member named ‘pdfdoc’
/home/kde4/kdesvn/kdegraphics/okular/generators/poppler/generator_pdf.cpp:1744: error: ‘Poppler’ has not been declared
/home/kde4/kdesvn/kdegraphics/okular/generators/poppler/generator_pdf.cpp:1746: error: type ‘<type error>’ argument given to ‘delete’, expected pointer
/opt/kde4/qt4/include/QtCore/qglobal.h: In constructor ‘QForeachContainer<T>::QForeachContainer(const T&) [with T = const int]’:
/home/kde4/kdesvn/kdegraphics/okular/generators/poppler/generator_pdf.cpp:251:   instantiated from here
/opt/kde4/qt4/include/QtCore/qglobal.h:1835: error: using invalid field ‘QForeachContainer<T>::i’
/opt/kde4/qt4/include/QtCore/qglobal.h:1835: error: request for member ‘begin’ in ‘((QForeachContainer<const int>*)this)->QForeachContainer<const int>::c’, which is of non-class type ‘const int’
/opt/kde4/qt4/include/QtCore/qglobal.h:1835: error: using invalid field ‘QForeachContainer<T>::e’
/opt/kde4/qt4/include/QtCore/qglobal.h:1835: error: request for member ‘end’ in ‘((QForeachContainer<const int>*)this)->QForeachContainer<const int>::c’, which is of non-class type ‘const int’
/opt/kde4/qt4/include/QtCore/qalgorithms.h: In function ‘void qDeleteAll(const Container&) [with Container = int]’:
/home/kde4/kdesvn/kdegraphics/okular/generators/poppler/generator_pdf.cpp:270:   instantiated from here
/opt/kde4/qt4/include/QtCore/qalgorithms.h:353: error: request for member ‘begin’ in ‘c’, which is of non-class type ‘const int’
/opt/kde4/qt4/include/QtCore/qalgorithms.h:353: error: request for member ‘end’ in ‘c’, which is of non-class type ‘const int’
/opt/kde4/qt4/include/QtCore/qglobal.h: In constructor ‘QForeachContainer<T>::QForeachContainer(const T&) [with T = int]’:
/home/kde4/kdesvn/kdegraphics/okular/generators/poppler/generator_pdf.cpp:670:   instantiated from here
/opt/kde4/qt4/include/QtCore/qglobal.h:1835: error: using invalid field ‘QForeachContainer<T>::i’
/opt/kde4/qt4/include/QtCore/qglobal.h:1835: error: request for member ‘begin’ in ‘((QForeachContainer<int>*)this)->QForeachContainer<int>::c’, which is of non-class type ‘const int’
/opt/kde4/qt4/include/QtCore/qglobal.h:1835: error: using invalid field ‘QForeachContainer<T>::e’
/opt/kde4/qt4/include/QtCore/qglobal.h:1835: error: request for member ‘end’ in ‘((QForeachContainer<int>*)this)->QForeachContainer<int>::c’, which is of non-class type ‘const int’
make[2]: *** [okular/generators/poppler/CMakeFiles/okularGenerator_poppler.dir/generator_pdf.o] Error 1
make[1]: *** [okular/generators/poppler/CMakeFiles/okularGenerator_poppler.dir/all] Error 2
make[1]: *** Waiting for unfinished jobs....
[ 35%] Building CXX object kolourpaint/CMakeFiles/kolourpaint4.dir/mainWindow/kpMainWindow_Help.o
Linking CXX executable kolourpaint4
[ 78%] Built target kolourpaint4
make: *** [all] Error 2