All pastes #770436 Raw Edit

Anonymous

public text v1 · immutable
·published 2007-11-12 08:56 UTC
rendered paste body
elease/.ui -o ../build/release/.obj/unix/pTabBar.o widgets/pTabBar.cpp
widgets/pTabBar.cpp: In member function ‘virtual void pTabBar::mousePressEvent(QMouseEvent*)’:
widgets/pTabBar.cpp:94: error: ‘tabAt’ was not declared in this scope
widgets/pTabBar.cpp: In member function ‘virtual void pTabBar::mouseReleaseEvent(QMouseEvent*)’:
widgets/pTabBar.cpp:125: error: ‘tabAt’ was not declared in this scope
widgets/pTabBar.cpp: In member function ‘virtual void pTabBar::mouseMoveEvent(QMouseEvent*)’:
widgets/pTabBar.cpp:145: error: ‘tabAt’ was not declared in this scope
widgets/pTabBar.cpp:156: error: ‘tabAt’ was not declared in this scope
widgets/pTabBar.cpp:161: error: ‘tabAt’ was not declared in this scope
widgets/pTabBar.cpp:169: error: ‘class QDrag’ has no member named ‘exec’
widgets/pTabBar.cpp: In member function ‘virtual void pTabBar::dragEnterEvent(QDragEnterEvent*)’:
widgets/pTabBar.cpp:180: error: ‘tabAt’ was not declared in this scope
widgets/pTabBar.cpp: In member function ‘virtual void pTabBar::dropEvent(QDropEvent*)’:
widgets/pTabBar.cpp:193: error: ‘tabAt’ was not declared in this scope
make[2]: *** [../build/release/.obj/unix/pTabBar.o] Error 1
make[2]: se sale del directorio `/home/david/monkeystudio1.8/monkeystudio-1.8.0.0-preview/fresh'
make[1]: *** [release] Error 2
make[1]: se sale del directorio `/home/david/monkeystudio1.8/monkeystudio-1.8.0.0-preview/fresh'
make: *** [sub-fresh-make_default] Error 2
linex-inWpyZ:/home/david/monkeystudio1.8/monkeystudio-1.8.0.0-preview# ls