All pastes #769994 Raw Edit

Miscellany

public text v1 · immutable
·published 2007-11-11 20:40 UTC
rendered paste body
[  3%] Built target gpgmepp
[  6%] Built target gpgmepp-pth
[ 11%] Built target gpgmepp-pthread
[ 11%] Built target qgpgme
[ 14%] Built target kldap
[ 16%] Built target kresources
[ 24%] Built target kabc
[ 24%] Built target kabcformat_binary
[ 24%] Built target kabc_file_core
[ 26%] Built target kabc_file
[ 27%] Built target kabc_directory
[ 29%] Built target kabc_net
[ 29%] Built target kabc_ldapkio
[ 31%] Built target kpimutils
[ 32%] Built target kxmlrpcclient
[ 50%] Built target syndication
[ 52%] Built target ical-headers
[ 72%] Built target kcal
[ 75%] Built target kblog
[ 75%] Built target kcal_local
[ 77%] Built target kcal_localdir
[ 77%] Built target kimap
[ 81%] Built target kmime
[ 83%] Built target kpimidentities
[ 85%] Built target kcm_kresources
[ 88%] Built target ktnef
[ 90%] Building CXX object mailtransport/CMakeFiles/mailtransport.dir/transportconfigdialog.o
/home/sally/kdesvn/kdepimlibs/mailtransport/transportconfigdialog.cpp:47: error: âUiâ has not been declared
/home/sally/kdesvn/kdepimlibs/mailtransport/transportconfigdialog.cpp:47: error: ISO C++ forbids declaration of âSMTPSettingsâ with no type
/home/sally/kdesvn/kdepimlibs/mailtransport/transportconfigdialog.cpp:47: error: expected â;â before âsmtpâ
/home/sally/kdesvn/kdepimlibs/mailtransport/transportconfigdialog.cpp:48: error: âUiâ has not been declared
/home/sally/kdesvn/kdepimlibs/mailtransport/transportconfigdialog.cpp:48: error: ISO C++ forbids declaration of âSendmailSettingsâ with no type
/home/sally/kdesvn/kdepimlibs/mailtransport/transportconfigdialog.cpp:48: error: expected â;â before âsendmailâ
/home/sally/kdesvn/kdepimlibs/mailtransport/transportconfigdialog.cpp:51: error: ISO C++ forbids declaration of âKLineEditâ with no type
/home/sally/kdesvn/kdepimlibs/mailtransport/transportconfigdialog.cpp:51: error: expected â;â before â*â token
/home/sally/kdesvn/kdepimlibs/mailtransport/transportconfigdialog.cpp: In member function âvoid MailTransport::TransportConfigDialog::Private::updateAuthCapbilities()â:
/home/sally/kdesvn/kdepimlibs/mailtransport/transportconfigdialog.cpp:78: error: âsmtpâ was not declared in this scope
/home/sally/kdesvn/kdepimlibs/mailtransport/transportconfigdialog.cpp:84: error: invalid use of incomplete type âstruct QAbstractButtonâ
/home/sally/qt4/include/QtGui/qmessagebox.h:52: error: forward declaration of âstruct QAbstractButtonâ
/home/sally/kdesvn/kdepimlibs/mailtransport/transportconfigdialog.cpp:87: error: âsmtpâ was not declared in this scope
/home/sally/kdesvn/kdepimlibs/mailtransport/transportconfigdialog.cpp:91: error: âsmtpâ was not declared in this scope
/home/sally/kdesvn/kdepimlibs/mailtransport/transportconfigdialog.cpp: In constructor âMailTransport::TransportConfigDialog::TransportConfigDialog(MailTransport::Transport*, QWidget*)â:
/home/sally/kdesvn/kdepimlibs/mailtransport/transportconfigdialog.cpp:105: error: âclass MailTransport::TransportConfigDialog::Privateâ has no member named âpasswordEditâ
/home/sally/kdesvn/kdepimlibs/mailtransport/transportconfigdialog.cpp:119: error: âclass MailTransport::TransportConfigDialog::Privateâ has no member named âsmtpâ
/home/sally/kdesvn/kdepimlibs/mailtransport/transportconfigdialog.cpp:120: error: âclass MailTransport::TransportConfigDialog::Privateâ has no member named âpasswordEditâ
/home/sally/kdesvn/kdepimlibs/mailtransport/transportconfigdialog.cpp:120: error: âclass MailTransport::TransportConfigDialog::Privateâ has no member named âsmtpâ
/home/sally/kdesvn/kdepimlibs/mailtransport/transportconfigdialog.cpp:123: error: âclass MailTransport::TransportConfigDialog::Privateâ has no member named âsmtpâ
/home/sally/kdesvn/kdepimlibs/mailtransport/transportconfigdialog.cpp:124: error: âclass MailTransport::TransportConfigDialog::Privateâ has no member named âsmtpâ
/home/sally/kdesvn/kdepimlibs/mailtransport/transportconfigdialog.cpp:125: error: âclass MailTransport::TransportConfigDialog::Privateâ has no member named âsmtpâ
/home/sally/kdesvn/kdepimlibs/mailtransport/transportconfigdialog.cpp:128: error: âclass MailTransport::TransportConfigDialog::Privateâ has no member named âsmtpâ
/home/sally/kdesvn/kdepimlibs/mailtransport/transportconfigdialog.cpp:129: error: âclass MailTransport::TransportConfigDialog::Privateâ has no member named âsmtpâ
/home/sally/kdesvn/kdepimlibs/mailtransport/transportconfigdialog.cpp:130: error: âclass MailTransport::TransportConfigDialog::Privateâ has no member named âsmtpâ
/home/sally/kdesvn/kdepimlibs/mailtransport/transportconfigdialog.cpp:131: error: âclass MailTransport::TransportConfigDialog::Privateâ has no member named âsmtpâ
/home/sally/kdesvn/kdepimlibs/mailtransport/transportconfigdialog.cpp:132: error: âclass MailTransport::TransportConfigDialog::Privateâ has no member named âsmtpâ
/home/sally/kdesvn/kdepimlibs/mailtransport/transportconfigdialog.cpp:133: error: âclass MailTransport::TransportConfigDialog::Privateâ has no member named âsmtpâ
/home/sally/kdesvn/kdepimlibs/mailtransport/transportconfigdialog.cpp:136: error: âclass MailTransport::TransportConfigDialog::Privateâ has no member named âsmtpâ
/home/sally/kdesvn/kdepimlibs/mailtransport/transportconfigdialog.cpp:137: error: âclass MailTransport::TransportConfigDialog::Privateâ has no member named âsmtpâ
/home/sally/kdesvn/kdepimlibs/mailtransport/transportconfigdialog.cpp:140: error: âclass MailTransport::TransportConfigDialog::Privateâ has no member named âsmtpâ
/home/sally/kdesvn/kdepimlibs/mailtransport/transportconfigdialog.cpp:142: error: âclass MailTransport::TransportConfigDialog::Privateâ has no member named âsmtpâ
/home/sally/kdesvn/kdepimlibs/mailtransport/transportconfigdialog.cpp:144: error: âclass MailTransport::TransportConfigDialog::Privateâ has no member named âsmtpâ
/home/sally/kdesvn/kdepimlibs/mailtransport/transportconfigdialog.cpp:150: error: âclass MailTransport::TransportConfigDialog::Privateâ has no member named âsendmailâ
/home/sally/kdesvn/kdepimlibs/mailtransport/transportconfigdialog.cpp:152: error: âclass MailTransport::TransportConfigDialog::Privateâ has no member named âsendmailâ
/home/sally/kdesvn/kdepimlibs/mailtransport/transportconfigdialog.cpp:154: error: âclass MailTransport::TransportConfigDialog::Privateâ has no member named âsendmailâ
/home/sally/kdesvn/kdepimlibs/mailtransport/transportconfigdialog.cpp:160: error: âclass MailTransport::TransportConfigDialog::Privateâ has no member named âpasswordEditâ
/home/sally/kdesvn/kdepimlibs/mailtransport/transportconfigdialog.cpp:162: error: âclass MailTransport::TransportConfigDialog::Privateâ has no member named âpasswordEditâ
/home/sally/kdesvn/kdepimlibs/mailtransport/transportconfigdialog.cpp: In member function âvoid MailTransport::TransportConfigDialog::checkSmtpCapabilities()â:
/home/sally/kdesvn/kdepimlibs/mailtransport/transportconfigdialog.cpp:186: error: âclass MailTransport::TransportConfigDialog::Privateâ has no member named âsmtpâ
/home/sally/kdesvn/kdepimlibs/mailtransport/transportconfigdialog.cpp:187: error: âclass MailTransport::TransportConfigDialog::Privateâ has no member named âsmtpâ
/home/sally/kdesvn/kdepimlibs/mailtransport/transportconfigdialog.cpp:191: error: âclass MailTransport::TransportConfigDialog::Privateâ has no member named âsmtpâ
/home/sally/kdesvn/kdepimlibs/mailtransport/transportconfigdialog.cpp: In member function âvoid MailTransport::TransportConfigDialog::save()â:
/home/sally/kdesvn/kdepimlibs/mailtransport/transportconfigdialog.cpp:198: error: âclass MailTransport::TransportConfigDialog::Privateâ has no member named âpasswordEditâ
/home/sally/kdesvn/kdepimlibs/mailtransport/transportconfigdialog.cpp:199: error: âclass MailTransport::TransportConfigDialog::Privateâ has no member named âpasswordEditâ
/home/sally/kdesvn/kdepimlibs/mailtransport/transportconfigdialog.cpp: In member function âvoid MailTransport::TransportConfigDialog::chooseSendmail()â:
/home/sally/kdesvn/kdepimlibs/mailtransport/transportconfigdialog.cpp:232: error: âclass MailTransport::TransportConfigDialog::Privateâ has no member named âsendmailâ
/home/sally/kdesvn/kdepimlibs/mailtransport/transportconfigdialog.cpp: In member function âvoid MailTransport::TransportConfigDialog::passwordsLoaded()â:
/home/sally/kdesvn/kdepimlibs/mailtransport/transportconfigdialog.cpp:238: error: âclass MailTransport::TransportConfigDialog::Privateâ has no member named âpasswordEditâ
/home/sally/kdesvn/kdepimlibs/mailtransport/transportconfigdialog.cpp:240: error: âclass MailTransport::TransportConfigDialog::Privateâ has no member named âpasswordEditâ
/home/sally/kdesvn/kdepimlibs/mailtransport/transportconfigdialog.cpp:241: error: âclass MailTransport::TransportConfigDialog::Privateâ has no member named âpasswordEditâ
/home/sally/kdesvn/kdepimlibs/mailtransport/transportconfigdialog.cpp: In function âvoid checkHighestEnabledButton(QButtonGroup*)â:
/home/sally/kdesvn/kdepimlibs/mailtransport/transportconfigdialog.cpp:250: error: invalid use of incomplete type âstruct QAbstractButtonâ
/home/sally/qt4/include/QtGui/qmessagebox.h:52: error: forward declaration of âstruct QAbstractButtonâ
/home/sally/kdesvn/kdepimlibs/mailtransport/transportconfigdialog.cpp:251: error: invalid use of incomplete type âstruct QAbstractButtonâ
/home/sally/qt4/include/QtGui/qmessagebox.h:52: error: forward declaration of âstruct QAbstractButtonâ
/home/sally/kdesvn/kdepimlibs/mailtransport/transportconfigdialog.cpp: In member function âvoid MailTransport::TransportConfigDialog::slotFinished(QList<int>)â:
/home/sally/kdesvn/kdepimlibs/mailtransport/transportconfigdialog.cpp:259: error: âclass MailTransport::TransportConfigDialog::Privateâ has no member named âsmtpâ
/home/sally/kdesvn/kdepimlibs/mailtransport/transportconfigdialog.cpp:262: error: âclass MailTransport::TransportConfigDialog::Privateâ has no member named âsmtpâ
/home/sally/kdesvn/kdepimlibs/mailtransport/transportconfigdialog.cpp:263: error: âclass MailTransport::TransportConfigDialog::Privateâ has no member named âsmtpâ
/home/sally/kdesvn/kdepimlibs/mailtransport/transportconfigdialog.cpp:264: error: âclass MailTransport::TransportConfigDialog::Privateâ has no member named âsmtpâ
/home/sally/kdesvn/kdepimlibs/mailtransport/transportconfigdialog.cpp:271: error: âclass MailTransport::TransportConfigDialog::Privateâ has no member named âsmtpâ
/home/sally/kdesvn/kdepimlibs/mailtransport/transportconfigdialog.cpp: In member function âvoid MailTransport::TransportConfigDialog::hostNameChanged(const QString&)â:
/home/sally/kdesvn/kdepimlibs/mailtransport/transportconfigdialog.cpp:289: error: invalid use of incomplete type âstruct QAbstractButtonâ
/home/sally/qt4/include/QtGui/qmessagebox.h:52: error: forward declaration of âstruct QAbstractButtonâ
/home/sally/kdesvn/kdepimlibs/mailtransport/transportconfigdialog.cpp: In member function âvoid MailTransport::TransportConfigDialog::encryptionChanged(int)â:
/home/sally/kdesvn/kdepimlibs/mailtransport/transportconfigdialog.cpp:299: error: âclass MailTransport::TransportConfigDialog::Privateâ has no member named âsmtpâ
/home/sally/kdesvn/kdepimlibs/mailtransport/transportconfigdialog.cpp:300: error: âclass MailTransport::TransportConfigDialog::Privateâ has no member named âsmtpâ
/home/sally/kdesvn/kdepimlibs/mailtransport/transportconfigdialog.cpp:302: error: âclass MailTransport::TransportConfigDialog::Privateâ has no member named âsmtpâ
/home/sally/kdesvn/kdepimlibs/mailtransport/transportconfigdialog.cpp:303: error: âclass MailTransport::TransportConfigDialog::Privateâ has no member named âsmtpâ
/home/sally/kdesvn/kdepimlibs/mailtransport/transportconfigdialog.cpp:309: error: invalid use of incomplete type âstruct QAbstractButtonâ
/home/sally/qt4/include/QtGui/qmessagebox.h:52: error: forward declaration of âstruct QAbstractButtonâ
/home/sally/kdesvn/kdepimlibs/mailtransport/transportconfigdialog.cpp:309: error: invalid use of incomplete type âstruct QAbstractButtonâ
/home/sally/qt4/include/QtGui/qmessagebox.h:52: error: forward declaration of âstruct QAbstractButtonâ
make[2]: *** [mailtransport/CMakeFiles/mailtransport.dir/transportconfigdialog.o] Error 1
make[1]: *** [mailtransport/CMakeFiles/mailtransport.dir/all] Error 2
make: *** [all] Error 2